{"text_format":"1","workbook":"xlsx","n_sheets":12,"sheets":["Algemene richtlijnen","Generieke input","Parameters+keuzes","OLO-basis","1A-Infrastructuur met forfait","1B-Infra zonder forfait","Formulier 2","Bijlage investeringsoverzicht","Bijlage extra vergoedingen","Checklist overheidstussenkomst","Checklist_prijsaanvraag","Output"],"not_rendered":{"charts":0,"images":2,"macros":1,"external_links":1,"defined_names":318,"comments":0,"pivot_tables":0},"unopened":[],"bounds":{"document_bytes":16777216,"sheet_cells":100000,"rows_first":2000,"rows_last":500,"rows_between":2000,"halvings":0,"cell_chars":16384,"cell_head_chars":4096},"cells_cut":0,"cells_raw":0,"read":"whole","date_system":"1900"}

{"sheet":"Algemene richtlijnen","index":0,"n_rows":201,"n_cols":9,"rows_kept":201,"cut":false,"hidden":false,"merged":[[49,8,50,10],[52,4,54,6],[53,8,55,10],[46,4,48,4],[102,3,103,3],[104,3,105,3],[100,2,101,2],[102,2,103,2],[0,0,0,3],[49,2,52,2],[97,1,99,1],[100,1,101,1],[102,1,103,1],[104,1,105,1],[97,2,99,2],[104,2,105,2],[97,3,99,3],[100,3,101,3]]}
["Algemene richtlijnen"]
[]
["Algemeen:","De groene tabbladen laten invoer toe met impact op uw aanvraag."]
[null,"De rode tabbladen bevatten parameters die u niet kan wijzigen."]
[null,"De oranje tabbladen hebben louter een informatieve waarde."]
[]
["Stappen"]
[1,"Bepaal voor welke zorgvormen en voor welke aanleidingen u een prijsaanvraag wenst in te dienen"]
{"$rows_left_out":194}
{"sheet":"Generieke input","index":1,"n_rows":56,"n_cols":27,"rows_kept":56,"cut":false,"hidden":false,"merged":[[0,0,1,15],[17,1,17,4],[17,5,17,12],[8,1,8,4],[8,5,8,12],[15,1,15,4],[15,5,15,12],[16,1,16,4],[16,5,16,12],[12,1,12,4],[12,5,12,12],[13,1,13,4],[13,5,13,12],[7,1,7,4],[9,5,9,12],[10,1,10,4],[14,1,14,4],[14,5,14,12],[7,5,7,12],[10,5,10,12],[11,1,11,4],[11,5,11,12],[9,1,9,4],[29,5,29,6],[29,4,30,4],[29,2,30,2],[23,1,26,12],[29,3,30,3],[28,5,28,8],[28,2,28,3],[29,7,30,7],[29,8,30,8]]}
["Dagprijsaanvraag: generieke input"]
[]
["Enkel de blauw aangeduide cellen kunnen (indien nodig) worden ingevuld",null,null,null,"Belangrijk: doorloop alle rubrieken. Vergeet niet om ook het jaar van aanvangsbevel in te vullen, tenzij het louter een aanvraag voor marge-evolutie betreft."]
["1. Datum aanvraag",null,"2025-06-19","vul hier de datum van aanvraag in"]
[]
["2. Identificatie"]
[]
[null,"Naam inrichtende macht :",null,null,null,"Naam inrichtende macht",null,null,null,null,null,null,null,"in te vullen",null,null,null,null,null,null,null,{"$f":"IF(F8<>\"\",1,0)","v":1}]
{"$rows_left_out":49}
{"sheet":"Parameters+keuzes","index":2,"n_rows":48,"n_cols":16,"rows_kept":48,"cut":false,"hidden":false,"merged":[[2,0,4,4]]}
["Parameters",null,null,null,null,null,"Toelichting:",null,null,null,null,null,null,null,null,"Keuzes"]
[]
["De parameters zoals hieronder vermeld, worden verder in 1 of meerdere prijsaanvragen gebruikt. Belangrijk is dat de parameters maar 1 maal per jaar worden geactualiseerd en dan voor een volledig jaar gelden. De informatie hierna is enkel ter consultatie. "]
[]
[]
[]
["Parameters voor het jaar:",2025]
[]
{"$rows_left_out":41}
{"sheet":"OLO-basis","index":3,"n_rows":1060,"n_cols":8,"rows_kept":1060,"cut":false,"hidden":false,"merged":[[1,0,1,2],[1,3,1,4],[2,3,2,4],[3,0,1018,0]]}
["Dataset: Long term yield of the reference loans 11am"]
["Frequency",null,null,"Daily",null,null,null,"Yield of Belgian loans on the secondary market (nbb.be)"]
["Country","Time","",""]
["Belgium","2020-01-02","","",0.09]
[null,"2020-01-03","","",-0.01]
[null,"2020-01-06","","",-0.01]
[null,"2020-01-07","","",0]
[null,"2020-01-08","","",0]
{"$rows_left_out":1053}
{"sheet":"1A-Infrastructuur met forfait","index":4,"n_rows":197,"n_cols":28,"rows_kept":197,"cut":false,"hidden":true,"merged":[[3,1,6,16],[195,1,195,3],[195,4,195,8],[196,4,196,8],[0,0,0,16],[8,0,8,16],[9,0,69,0],[12,1,12,16],[14,1,15,16],[19,4,19,6],[19,7,19,9],[20,1,20,3],[20,4,20,6],[20,7,20,9],[23,1,23,3],[23,4,23,6],[23,7,23,9],[24,1,24,3],[24,4,24,6],[24,7,24,9],[21,1,21,3],[21,4,21,6],[21,7,21,9],[172,9,173,9],[22,1,22,3],[22,4,22,6],[22,7,22,9],[25,1,25,3],[25,4,25,6],[25,7,25,9],[28,10,28,17],[29,1,29,3],[29,4,29,6],[29,7,29,9],[29,10,29,16],[26,1,26,3],[26,7,26,9],[26,4,26,6],[30,1,30,3],[30,4,30,6],[30,7,30,9],[27,1,27,3],[27,4,27,6],[27,7,27,9],[28,1,28,3],[28,4,28,6],[28,7,28,9],[31,1,31,3],[31,4,31,6],[31,7,31,9],[32,1,32,3],[32,4,32,6],[32,7,32,9],[34,1,34,9],[39,1,39,5],[39,6,39,16],[40,1,40,16],[42,1,42,4],[42,5,42,16],[44,1,44,16],[36,1,36,5],[36,6,36,8],[37,1,37,5],[37,6,37,8],[38,1,38,5],[38,6,38,8],[46,1,47,16],[49,4,49,5],[49,6,49,8],[49,9,49,11],[49,12,49,16],[50,4,50,5],[50,6,50,8],[50,9,50,11],[50,12,50,16],[53,4,53,5],[53,6,53,8],[53,9,53,11],[53,12,53,16],[54,4,54,5],[54,6,54,8],[54,9,54,11],[54,12,54,16],[51,4,51,5],[51,6,51,8],[51,9,51,11],[51,12,51,16],[52,4,52,5],[52,6,52,8],[52,9,52,11],[52,12,52,16],[57,4,57,5],[57,6,57,8],[57,9,57,11],[57,12,57,16],[58,4,58,5],[58,6,58,8],[58,9,58,11],[58,12,58,16],[55,4,55,5],[55,6,55,8],[55,9,55,11],[55,12,55,16],[56,4,56,5],[56,6,56,8],[56,9,56,11],[56,12,56,16],[61,4,61,5],[61,6,61,8],[61,9,61,11],[61,12,61,16],[62,4,62,5],[62,6,62,8],[62,9,62,11],[62,12,62,16],[59,4,59,5],[59,6,59,8],[59,9,59,11],[59,12,59,16],[60,4,60,5],[60,6,60,8],[60,9,60,11],[60,12,60,16],[68,1,68,4],[68,5,68,16],[71,1,71,16],[73,1,74,12],[77,1,77,3],[63,1,63,16],[64,1,64,5],[64,6,64,8],[65,1,65,5],[65,6,65,16],[66,1,66,16],[87,1,87,16],[89,1,89,16],[91,1,91,3],[92,6,92,12],[95,7,95,16],[97,7,97,12],[78,1,78,3],[84,1,84,5],[84,6,84,8],[85,1,85,5],[85,6,85,16],[132,5,132,7],[134,1,134,16],[136,1,139,16],[141,1,142,3],[141,4,142,4],[141,5,142,5],[141,6,142,6],[141,7,141,10],[122,1,122,3],[125,1,125,5],[125,6,125,8],[126,1,126,5],[126,6,126,16],[130,0,130,16],[140,1,140,3],[147,1,147,3],[147,7,147,11],[148,1,148,3],[149,1,149,3],[150,1,150,3],[143,1,143,3],[143,7,143,9],[144,1,144,3],[144,7,144,12],[145,1,145,3],[145,7,146,11],[146,1,146,3],[156,1,156,3],[157,1,157,3],[158,1,158,3],[159,1,159,3],[160,1,160,3],[161,1,161,3],[151,1,151,3],[152,1,152,3],[152,7,154,9],[153,1,153,3],[154,1,154,3],[155,1,155,3],[176,1,176,3],[177,1,177,3],[162,1,162,3],[164,1,164,16],[166,1,169,16],[172,1,173,3],[172,4,173,4],[172,6,173,6],[172,7,173,7],[172,8,173,8],[172,10,173,14],[174,10,174,14],[175,10,175,14],[176,10,176,14],[177,10,177,14],[172,5,173,5],[171,1,171,3],[193,1,193,3],[187,1,187,3],[188,1,188,3],[189,1,189,3],[190,1,190,3],[191,1,191,3],[192,1,192,3],[187,10,187,14],[188,10,188,14],[189,10,189,14],[190,10,190,14],[191,10,191,14],[192,10,192,14],[193,10,193,14],[103,6,103,11],[182,1,182,3],[183,1,183,3],[183,16,185,19],[184,1,184,3],[185,1,185,3],[186,1,186,3],[178,1,178,3],[178,16,178,21],[179,1,179,3],[180,1,180,3],[181,1,181,3],[178,10,178,14],[179,10,179,14],[180,10,180,14],[181,10,181,14],[182,10,182,14],[183,10,183,14],[184,10,184,14],[185,10,185,14],[186,10,186,14],[174,1,174,3],[174,16,174,21],[175,1,175,3]]}
["Prijsaanvraag infrastructuur met infrastructuurforfait"]
[null,"Klik hier indien terug naar generieke input"]
[null,"Enkel de lichtblauw gekleurde velden dienen te worden ingevuld"]
[null,"Dit kostentabblad '1A' wordt ingevuld naar aanleiding van de investeringen die u uitvoert om  het infrastructuurforfait te kunnen bekomen. Dit formulier wordt ook gebruikt voor drastische investeringen voor bewoners met een reeds lopend infrastructuurforfait (i.e. waarvoor in het verleden reeds de prijsaanvraag en het infrastructuurforfait werden goedgekeurd). Indien u voor bewoners met een lopend infrastructuurforfait voor een andere aanleiding dan drastische investeringen een prijsaanvraag wenst in te dienen, dan hanteert u het formulier 2."]
[]
[]
[]
[]
{"$rows_left_out":190}
{"sheet":"1B-Infra zonder forfait","index":5,"n_rows":188,"n_cols":26,"rows_kept":188,"cut":false,"hidden":true,"merged":[[131,1,131,3],[162,1,162,3],[3,1,6,16],[56,1,56,5],[186,1,186,3],[162,7,162,10],[0,0,0,16],[173,8,173,13],[174,8,174,13],[175,8,175,13],[176,8,176,13],[177,8,177,13],[178,8,178,13],[179,8,179,13],[163,8,164,13],[165,8,165,13],[166,8,166,13],[167,8,167,13],[168,8,168,13],[169,8,169,13],[170,8,170,13],[171,8,171,13],[20,1,20,3],[20,4,20,6],[22,1,22,3],[22,4,22,6],[8,0,8,16],[9,0,59,0],[12,1,12,16],[14,1,15,16],[18,4,18,6],[19,1,19,3],[19,4,19,6],[25,1,25,3],[25,4,25,6],[26,1,26,3],[26,4,26,6],[23,7,23,14],[24,1,24,3],[24,4,24,6],[23,1,23,3],[23,4,23,6],[21,1,21,3],[21,4,21,6],[49,1,49,16],[50,1,50,5],[50,6,50,8],[51,1,51,5],[51,6,51,16],[52,1,52,16],[32,1,33,16],[28,1,28,4],[28,5,28,16],[30,1,30,16],[76,1,76,5],[76,6,76,8],[77,1,77,5],[77,6,77,16],[79,1,79,16],[81,1,81,16],[54,1,54,4],[54,5,54,16],[63,1,63,16],[65,1,66,12],[69,1,69,3],[70,1,70,3],[118,1,118,5],[118,6,118,16],[121,0,121,16],[123,5,123,7],[125,1,125,16],[127,1,130,16],[83,1,83,3],[84,6,84,12],[87,7,87,16],[89,7,89,12],[114,1,114,3],[117,1,117,5],[117,6,117,8],[135,1,135,3],[135,6,135,11],[136,1,136,3],[136,6,137,10],[137,1,137,3],[138,1,138,3],[138,6,138,10],[132,1,133,3],[132,4,133,4],[132,5,133,5],[132,6,132,9],[134,1,134,3],[134,6,134,8],[146,1,146,3],[147,1,147,3],[148,1,148,3],[149,1,149,3],[150,1,150,3],[151,1,151,3],[139,1,139,3],[140,1,140,3],[140,6,141,11],[141,1,141,3],[142,1,142,3],[143,1,143,3],[143,6,145,8],[144,1,144,3],[145,1,145,3],[165,1,165,3],[165,14,165,19],[166,1,166,3],[152,1,152,3],[153,1,153,3],[155,1,155,16],[157,1,160,16],[163,1,164,3],[163,4,164,4],[163,5,164,5],[163,6,164,6],[163,7,164,7],[173,1,173,3],[174,1,174,3],[174,14,176,17],[175,1,175,3],[176,1,176,3],[177,1,177,3],[167,1,167,3],[168,1,168,3],[169,1,169,3],[169,14,169,19],[170,1,170,3],[171,1,171,3],[171,14,172,20],[172,1,172,3],[172,8,172,13],[186,4,186,10],[187,4,187,10],[184,1,184,3],[178,1,178,3],[179,1,179,3],[180,1,180,3],[181,1,181,3],[182,1,182,3],[183,1,183,3],[180,8,180,13],[181,8,181,13],[182,8,182,13],[183,8,183,13],[184,8,184,13]]}
["Prijsaanvraag infrastructuur zonder infrastructuurforfait"]
[null,"Klik hier indien terug naar generieke input"]
[null,"Enkel de lichtblauw gekleurde velden dienen te worden ingevuld"]
[null,"Dit onderdeel wordt ingevuld voor de bewoners zonder infrastructuurforfait waarvoor drastische investeringen worden gerealiseerd waarvan minimaal de helft wordt afgeschreven over een looptijd van minimaal twintig jaar. Indien de investeringen hieraan niet voldoen, dient u het formulier 2 te hanteren. Voor dezelfde bewoners kan u formulier 1 voor investeringen en formulier 2 voor marge-evolutie niet simultaan gebruiken. U zal een keuze moeten maken welk formulier eerst gehanteerd wordt en een volgende aanvraag voor de andere aanleiding kan maar na twee jaar."]
[]
[]
[]
[]
{"$rows_left_out":181}
{"sheet":"Formulier 2","index":6,"n_rows":301,"n_cols":19,"rows_kept":301,"cut":false,"hidden":true,"merged":[[308,1,308,7],[308,8,308,9],[308,10,308,11],[309,1,309,7],[309,8,309,9],[309,10,309,11],[242,4,242,5],[305,1,305,7],[305,8,305,9],[305,10,305,11],[306,1,306,7],[306,8,306,9],[306,10,306,11],[307,1,307,7],[307,8,307,9],[307,10,307,11],[288,1,288,7],[289,1,289,7],[290,1,290,7],[291,1,291,7],[292,1,292,7],[297,1,297,11],[298,1,298,11],[304,1,304,7],[304,8,304,9],[304,10,304,11],[262,1,262,7],[262,8,262,9],[262,10,262,11],[262,12,262,13],[263,1,263,7],[263,8,263,9],[263,10,263,11],[263,12,263,13],[264,1,264,7],[264,8,264,9],[264,10,264,11],[264,12,264,13],[283,1,283,7],[284,1,284,7],[272,1,272,5],[273,1,273,13],[274,1,274,13],[275,1,275,13],[276,1,276,13],[277,1,277,13],[299,1,299,7],[299,8,299,9],[259,1,259,7],[259,8,259,9],[259,10,259,11],[259,12,259,13],[260,1,260,7],[260,8,260,9],[260,10,260,11],[260,12,260,13],[261,1,261,7],[261,8,261,9],[261,10,261,11],[261,12,261,13],[43,0,109,0],[44,1,47,14],[94,5,94,6],[112,1,116,14],[153,1,156,14],[246,1,246,14],[248,8,250,9],[248,10,250,11],[248,12,250,13],[54,5,54,6],[55,5,55,6],[56,5,56,6],[53,5,53,6],[57,5,57,6],[169,6,169,11],[170,1,170,3],[170,6,171,10],[171,1,171,3],[107,1,107,4],[107,5,107,13],[142,1,142,14],[159,1,159,16],[161,1,164,16],[136,1,136,5],[136,6,136,13],[137,1,137,13],[139,1,139,4],[151,1,151,14],[129,4,129,5],[129,6,129,8],[129,9,129,11],[129,12,129,13],[130,4,130,5],[130,6,130,8],[130,9,130,11],[130,12,130,13],[134,1,134,13],[135,1,135,5],[135,6,135,8],[132,9,132,11],[132,12,132,13],[139,5,139,16],[145,6,145,10],[145,11,145,13],[203,10,203,15],[217,1,217,3],[218,1,218,3],[216,1,216,3],[199,1,199,3],[207,1,207,3],[208,1,208,3],[215,1,215,3],[211,1,211,3],[212,1,212,3],[213,1,213,3],[204,1,204,3],[205,1,205,3],[205,10,206,16],[206,1,206,3],[201,1,201,3],[202,1,202,3],[203,1,203,3],[199,10,199,15],[200,1,200,3],[214,1,214,3],[208,10,210,13],[128,12,128,13],[125,4,125,5],[42,1,42,14],[133,4,133,5],[133,6,133,8],[133,9,133,11],[133,12,133,13],[110,1,110,14],[86,5,86,6],[92,5,92,6],[103,1,103,5],[103,6,103,8],[88,5,88,6],[91,5,91,6],[89,5,89,6],[131,4,131,5],[131,6,131,8],[131,9,131,11],[131,12,131,13],[132,4,132,5],[132,6,132,8],[48,14,109,14],[83,5,83,6],[84,5,84,6],[221,4,221,5],[176,1,176,3],[177,1,177,3],[177,6,179,8],[178,1,178,3],[209,1,209,3],[210,1,210,3],[128,4,128,5],[128,6,128,8],[197,7,198,7],[186,1,186,3],[187,1,187,3],[189,1,189,16],[180,1,180,3],[172,1,172,3],[172,6,172,10],[173,1,173,3],[144,1,144,5],[144,6,144,8],[145,1,145,5],[146,1,146,13],[148,1,148,4],[148,5,148,13],[128,9,128,11],[166,1,167,3],[179,1,179,3],[191,1,194,16],[197,1,198,3],[197,4,198,4],[197,5,198,5],[197,6,198,6],[197,9,198,9],[197,8,198,8],[181,1,181,3],[182,1,182,3],[183,1,183,3],[184,1,184,3],[185,1,185,3],[174,1,174,3],[174,6,175,11],[175,1,175,3],[168,1,168,3],[166,4,167,4],[166,5,167,5],[166,6,166,9],[168,6,168,8],[169,1,169,3],[74,5,74,6],[76,5,76,6],[77,5,77,6],[78,5,78,6],[51,5,51,6],[61,5,61,6],[67,5,67,6],[73,5,73,6],[80,5,80,6],[79,5,79,6],[98,5,98,6],[90,5,90,6],[95,5,95,6],[96,5,96,6],[97,5,97,6],[99,5,99,6],[101,5,101,6],[104,1,104,5],[104,6,104,13],[105,1,105,13],[120,4,120,5],[120,6,120,8],[120,9,120,11],[120,12,120,13],[125,6,125,8],[125,9,125,11],[125,12,125,13],[126,4,126,5],[126,6,126,8],[126,9,126,11],[126,12,126,13],[121,12,121,13],[122,4,122,5],[122,6,122,8],[122,9,122,11],[122,12,122,13],[108,5,108,13],[117,0,140,0],[118,4,118,5],[118,6,118,8],[118,9,118,11],[118,12,118,13],[123,4,123,5],[123,6,123,8],[123,9,123,11],[123,12,123,13],[124,4,124,5],[124,6,124,8],[124,9,124,11],[124,12,124,13],[121,4,121,5],[121,6,121,8],[121,9,121,11],[127,4,127,5],[127,6,127,8],[127,9,127,11],[127,12,127,13],[119,4,119,5],[119,6,119,8],[119,9,119,11],[119,12,119,13],[39,1,40,4],[39,5,39,13],[40,5,40,13],[36,1,36,4],[36,6,37,8],[36,9,37,11],[37,1,37,4],[33,1,33,4],[33,6,34,8],[33,9,34,11],[34,1,34,4],[35,1,35,4],[35,6,35,8],[35,9,35,11],[31,1,31,4],[31,6,31,8],[31,9,31,11],[32,1,32,4],[32,6,32,8],[32,9,32,11],[26,1,26,4],[26,6,28,8],[26,9,28,11],[27,1,27,4],[28,1,28,4],[29,6,29,8],[29,9,29,11],[29,1,29,4],[30,6,30,8],[30,9,30,11],[19,9,19,11],[25,1,25,4],[25,6,25,8],[25,9,25,11],[22,1,23,4],[22,6,23,8],[22,9,23,11],[24,6,24,8],[24,9,24,11],[20,1,20,4],[20,6,20,8],[20,9,20,11],[21,1,21,4],[21,6,21,8],[21,9,21,11],[19,1,19,4],[19,6,19,8],[299,10,299,11],[293,1,293,7],[285,1,285,7],[286,1,286,7],[287,1,287,7],[279,1,279,7],[280,1,280,7],[281,1,281,7],[282,1,282,7],[302,1,302,7],[302,8,302,9],[302,10,302,11],[303,1,303,7],[303,8,303,9],[303,10,303,11],[300,1,300,7],[300,8,300,9],[300,10,300,11],[301,1,301,7],[301,8,301,9],[301,10,301,11],[257,1,257,7],[257,8,257,9],[257,10,257,11],[257,12,257,13],[258,1,258,7],[258,8,258,9],[258,10,258,11],[258,12,258,13],[255,1,255,7],[255,8,255,9],[255,10,255,11],[255,12,255,13],[256,1,256,7],[256,8,256,9],[256,10,256,11],[256,12,256,13],[253,1,253,7],[253,8,253,9],[253,10,253,11],[253,12,253,13],[254,1,254,7],[254,8,254,9],[254,10,254,11],[254,12,254,13],[251,1,251,7],[251,8,251,9],[251,10,251,11],[251,12,251,13],[252,1,252,7],[252,8,252,9],[252,10,252,11],[252,12,252,13],[249,1,249,7],[250,1,250,7],[248,1,248,7],[1,0,5,0],[0,0,0,14],[245,1,245,7],[245,8,245,9],[245,10,245,11],[245,12,245,13],[3,1,5,14],[17,1,17,4],[17,6,17,8],[17,9,17,11],[18,1,18,4],[18,6,18,8],[18,9,18,11],[7,0,7,14],[14,1,15,4],[14,6,14,8],[14,9,14,11],[16,1,16,4],[16,6,16,8],[16,9,16,11],[9,1,10,14]]}
["Formulier 2: andere (geen drastische infrastructuurwerken of evolueren naar marge)"]
[null,"Klik hier indien terug naar generieke input"]
[null,"U kan de lichtblauw gekleurde cellen invullen (waar nodig)"]
[null,"Dit formulier wordt gebruikt voor alle zorgvormen  en voor volgende aanleidingen voor dagprijsverhoging: hetzij (a) investeringen waarvan minder dan 50% van de totale kost op factuur afgeschreven wordt op minimaal twintig jaar (rubriek 3) of hetzij (b)  een marge-evolutie (rubrieken 1 en 2).\nBeide (a) en (b) kunnen niet gelijktijdig worden ingevoerd. Tussen de indiening van (a) en (b) dient ook minimaal twee jaar verstreken te zijn. \nVerder kan dit formulier ook ingevuld worden voor verschuiving van supplement naar dagprijs (rubriek 4) of voor andere toeslagen (rubriek 6)."]
[]
[]
[]
["1. Resultatenrekening"]
{"$rows_left_out":294}
{"sheet":"Bijlage investeringsoverzicht","index":7,"n_rows":250,"n_cols":7,"rows_kept":250,"cut":false,"hidden":false,"merged":[[5,0,5,3],[36,0,36,3],[0,0,2,9],[4,0,4,4],[202,0,202,4],[229,0,229,4],[235,2,235,3],[235,4,237,4],[25,0,25,2],[29,2,29,3],[30,2,30,6],[33,2,33,6],[28,2,28,9],[198,0,198,2],[208,3,208,4],[208,5,210,5],[35,0,35,6]]}
["Dit is een hulpblad voor de detaillering van de investeringskosten in hetzij formulier 1 of 2. \nOnder stap 1 voert u de investeringssoorten en hun  afschrijvingsduur in.\nOnder stap 2 vermeldt u de detaillijnen voor de kosten met per detaillijn de omschrijving, het referentienummer van het verantwoordingsstuk, het bedrag en het toewijzingspercentage\nOnder stap 3 kan u de investeringskosten toewijzen volgens de combinatie van investeringssoort en afschrijvingsduur (3a) of enkel volgens afschrijvingsduur (3b)"]
[]
[]
[]
["Stap 1: voer hier de investeringssoorten en hun afschrijvingsduur in"]
["Belangrijk: de geevens hieronder zijn enkel bedoeld als voorbeeld, gelieve de reële gegevens in te vullen. Gelieve de reeds ingevulde gegevens te overschrijven."]
["in te vullen","in te vullen"]
["Kies uit de investeringssoort:","afschrijvingsduur"]
{"$rows_left_out":243}
{"sheet":"Bijlage extra vergoedingen","index":8,"n_rows":249,"n_cols":12,"rows_kept":249,"cut":false,"hidden":true,"merged":[]}
["Bijlage extra vergoedingen","totaalbedrag in euro"]
[]
["Detailleer het totaalbedrag conform onderstaande rubrieken:"]
[]
["sondevoeding: het surplus op de gebruikelijke voedingskost, na aftrek van de door het RIZIV terugbetaalde tegemoetkoming:"]
["dokterskosten, paramedische kosten en medicatie:"]
["kapper:"]
["abonnement op kabeldistributie:"]
{"$rows_left_out":242}
{"sheet":"Checklist overheidstussenkomst","index":9,"n_rows":231,"n_cols":14,"rows_kept":231,"cut":false,"hidden":false,"merged":[[3,1,36,20],[0,7,0,9]]}
[null,"Checklist componenten overheidstussenkomsten",null,null,null,null,null,"Navigatie:","Navigatie:",null,"Terug naar algemene richtlijnen","Generieke input",null,"IFIC"]
[]
["In geval van een woonzorgcentrum/CVK:"]
[null,"1) Basistegemoetkoming voor zorg van jaar voor de aanvraag \nPersoneelskosten\n• Zorgpersoneel: verpleegkundigen, zorgkundigen, kinesitherapeuten, logopedisten, ergotherapeuten, personeel voor reactivering (delen A1,A2, A3, B1, B2, C, E1, E2, E3, E4, F, H, M)\n• Financiering van coördinerend arts in het woonzorgcentrum met bijkomende erkenning  \n• Financiering ondersteunend personeel (deel K)\n\nOm versleutelingsproblemen te vermijden mag op niveau van het personeel ook inbegrepen zijn:\n•  Financiering van verzorgingsmateriaal       \n•  Financiering van opleiding  \n\nNaast de pure basistegemoetkoming zorg:\n- tegemoetkoming incontinentiemateriaal\n- tegemoetkoming OCVK           \n\n2) tegemoetkoming vrijstelling van arbeidsprestaties en eindeloopbaan: vergoeding premie voor sommige werknemers die kiezen voor behoud de arbeidsprestaties vanaf de leeftijd van 45 jaar of voor de vervangers als die werknemers kiezen voor vermindering van de arbeidsprestaties. Laatst gekende rechtenbedrag = 4 voorschotten + bedrag afrekening van de volgende referentieperiode \n3) Fonds Sociale Maribel: laatst ontvangen inkomsten \n4) Aanvullende financiering (niet voor nieuwe voorzieningen of voor extra capaciteit)\n• Bovennorm zorg: laatst gekende rechtenbedrag \n• Ondersteunend personeel: laatst gekende rechtenbedrag \n5) Loonsverhoging VIA5+VIA6: 6,96% van de personeelskost, dit zit verwerkt in IFIC\n6)  DAC- en Gesco-tussenkomsten cfr. uitbetaald bedrag voor het jaar voorafgaand aan het jaar waarin de aanvraag wordt ingediend (niet voor nieuwe voorzieningen of voor extra capaciteit)\n7) Andere: \n• Nomenclatuur-inkomsten (bvb. kiné-ROB)\n• Financiering bijkomende erkenning oriënterend centrum voor kortverblijf \n• Financiering bijzondere erkenning voor de zorg en ondersteuning van personen met jongdementie\n• Syndicale premie\n\n\n\n"]
[]
[]
[]
[]
{"$rows_left_out":224}
{"sheet":"Checklist_prijsaanvraag","index":10,"n_rows":97,"n_cols":6,"rows_kept":97,"cut":false,"hidden":false,"merged":[[61,0,62,2]]}
[]
["Checks ",null,null,null,"Check","Vereiste actie:"]
[]
["A. Invoer"]
["Generieke input:"]
[]
["1. Datum aanvraag ingevuld?",null,null,null,{"$f":"IF('Generieke input'!C4<>\"\", \"OK\",\"NIET OK\")","v":"OK"},{"$f":"IF(E7=\"NIET OK\", \"Gelieve de aanvraagdatum in te vullen\",\"\")","v":""}]
[]
{"$rows_left_out":90}
{"sheet":"Output","index":11,"n_rows":220,"n_cols":8,"rows_kept":220,"cut":false,"hidden":false,"merged":[[17,1,17,5],[18,1,18,5],[8,1,8,5],[9,1,9,5],[10,1,10,5],[11,1,11,5],[12,1,12,5],[13,1,13,5],[14,1,14,5],[15,1,15,5],[16,1,16,5],[57,0,57,3],[58,0,58,3],[101,0,101,1],[102,0,102,1],[103,0,103,1],[104,0,104,1],[49,0,49,3],[50,0,50,3],[51,0,51,3],[59,0,59,3],[60,0,60,3],[61,0,61,3],[52,0,52,3],[53,0,53,3],[54,0,54,3],[55,0,55,3],[56,0,56,3],[70,0,70,3],[71,0,71,3],[72,0,72,3],[73,0,73,3],[74,0,74,3],[62,0,62,3],[63,0,63,3],[47,0,47,3],[48,0,48,3],[24,0,24,2],[25,0,25,2],[26,0,26,2],[27,0,27,2],[28,0,28,2],[29,0,29,2],[30,0,30,2],[31,0,31,2],[32,0,32,2],[33,0,33,2],[34,0,34,2],[35,0,35,2],[36,0,36,2],[37,0,37,2],[38,0,38,2],[39,0,39,2],[40,0,40,2],[41,0,41,2],[42,0,42,2],[43,0,43,2],[64,0,64,3],[65,0,65,3],[66,0,66,3],[80,0,80,3],[81,0,81,3],[82,0,82,3],[83,0,83,3],[84,0,84,3],[75,0,75,3],[76,0,76,3],[77,0,77,3],[78,0,78,3],[79,0,79,3],[85,0,85,3],[86,0,86,3],[129,0,129,2],[130,0,130,2],[87,0,87,3],[88,0,88,3],[89,0,89,3],[96,0,96,1],[97,0,97,1],[98,0,98,1],[99,0,99,1],[100,0,100,1],[118,0,119,5],[120,0,121,5],[110,0,110,1],[111,0,111,1],[112,0,112,1],[113,0,113,1],[105,0,105,1],[106,0,106,1],[107,0,107,1],[108,0,108,1],[109,0,109,1],[114,0,114,1],[127,0,127,2],[128,0,128,2],[115,0,115,1],[141,0,141,2],[142,0,142,2],[143,0,143,2],[144,0,144,2],[145,0,145,2],[136,0,136,2],[137,0,137,2],[138,0,138,2],[139,0,139,2],[140,0,140,2],[214,4,215,5],[217,4,218,5],[214,1,214,2],[215,1,215,2],[217,1,217,2],[218,1,218,2],[170,0,170,1],[171,0,171,1],[172,0,172,1],[173,0,173,1],[174,0,174,1],[178,0,178,4],[179,0,179,4],[180,0,180,4],[181,0,181,4],[182,0,182,4],[183,0,183,4],[184,0,184,4],[185,0,185,4],[186,0,186,4],[187,0,187,4],[188,0,188,4],[189,0,189,4],[190,0,190,4],[1,0,2,5],[165,0,165,1],[166,0,166,1],[167,0,167,1],[168,0,168,1],[169,0,169,1],[160,0,160,1],[161,0,161,1],[162,0,162,1],[163,0,163,1],[164,0,164,1],[155,0,155,1],[156,0,156,1],[157,0,157,1],[158,0,158,1],[159,0,159,1],[148,0,149,5],[150,0,151,5],[131,0,131,2],[132,0,132,2],[133,0,133,2],[134,0,134,2],[135,0,135,2],[126,0,126,2],[207,0,208,5],[202,0,202,4],[203,0,203,4],[204,0,204,4],[205,0,205,4],[191,0,191,4],[192,0,192,4],[195,0,195,4],[196,0,196,4],[197,0,197,4],[198,0,198,4],[199,0,199,4],[200,0,200,4],[201,0,201,4]]}
[null,null,null,null,null,null,null,"Aandachtspunten:"]
["Dagprijsaanvraag: samenvatting"]
[null,null,null,null,null,null,1,"HEEL BELANGRIJK: ga na of de prijzen verschijnen. Indien dit niet het geval is, gelieve dan de macrobeveiliging  in te schakelen. Voor meer uitleg: zie word-documenten \"Technische nota prijsaanvraagformulier\""]
[null,null,null,null,null,null,1,"Het merendeel van gegevens voor de output wordt overgenomen uit de andere tabbladen. Enkel onderaan dienen de gemachtigden hun naam te vermelden en te handtekenen."]
["1. Datum aanvraag",null,{"$f":"'Generieke input'!C4","v":"2025-06-19"},null,null,null,1,"De getekende versie van dit tabblad wordt als pdf meegestuurd. Via bestand>afdrukken kan u de layout nog wijzigen."]
[null,null,null,null,null,null,1]
["2. Identificatie",null,null,null,null,null,1]
[null,null,null,null,null,null,1]
{"$rows_left_out":212}