{"text_format":"1","workbook":"xlsx","n_sheets":10,"sheets":["TOELICHTING","Facturatie","Contractanten","Betrokken medewerkers","Verklaring betrokkenen","Verklaring onderaannemers","DNSH","Identificatie","Register stavingsstukken","basisdata"],"not_rendered":{"charts":0,"images":1,"macros":1,"external_links":1,"defined_names":5,"comments":0,"pivot_tables":1},"unopened":[],"bounds":{"document_bytes":16777216,"sheet_cells":100000,"rows_first":2000,"rows_last":500,"rows_between":2000,"halvings":0,"cell_chars":16384,"cell_head_chars":4096},"cells_cut":0,"cells_raw":0,"read":"whole","date_system":"1900"}

{"sheet":"TOELICHTING","index":0,"n_rows":64,"n_cols":2,"rows_kept":64,"cut":false,"hidden":false,"merged":[[10,0,10,1],[12,0,12,1],[13,0,13,1],[39,0,39,1],[40,0,40,1],[41,0,41,1],[47,0,47,1],[53,0,53,1],[46,0,46,1],[42,0,42,1]]}
["TOELICHTING BIJ HET INVULLEN VAN HET RAPPORTERINGSSJABLOON"]
[]
["Maak eerst een kopie van het rapporteringssjabloon per gebouw. "]
["U doet dit door op het tabblad 'Facturatie' uw geheime code in te geven en het gebouw te selecteren. Sla deze kopie(ën) op."]
[]
[]
["Tabblad 'Facturatie'"]
["U vindt hier een overzicht van de maatregelen waarvoor een subsidie werd toegekend."]
["Vul bij de aanvraag van de tweede betaalschijf de start- en einddatum en effectieve kostprijs van de werken excl. btw aan op de facturatiefiche. "]
[]
["Tabblad 'Contractanten':"]
["U vult de gegevens van de aannemers en onderaannemers aan."]
["1. Indien meerdere aannemers (contractanten) de werken uitvoeren, gelieve dan evenveel lijnen als aannemers in te vullen."]
["2. Indien de aannemer beroep doet op meerdere onderaannemers (subcontractanten), gelieve dan evenveel lijnen als onderaannemers in te vullen. "]
[]
{"$rows_left_out":50}
{"sheet":"Facturatie","index":1,"n_rows":44,"n_cols":9,"rows_kept":44,"cut":false,"hidden":false,"merged":[[2,1,2,2],[4,1,4,3],[6,1,6,2]]}
["Vul hieronder de code van uw organisatie in, indien ok dan verschijnt de naam en het KBOnr van uw organisatie/rechtspersoon"]
[]
["Code organisatie"]
[]
["Rechtspersoon",{"$f":"IFERROR(VLOOKUP(B3,basisdata!$A$1:$I$639,4,FALSE),\"foutieve geheime code\")","v":"xxx"}]
[]
["KBOnr",{"$f":"IFERROR(VLOOKUP(B3,basisdata!$A$1:$I$639,3,FALSE),\"foutieve geheime code\")","v":0}]
[]
["Selecteer hier het gebouw waarop het sjabloon betrekking heeft"]
[]
[null,null,null,null,null,{"$f":"IF(AND($A24<>\"Eindtotaal\",$A24<>\"\"),IFERROR((VLOOKUP($A24,basisdata[[#All],[dossiernummer]:[Kolom12]],4,0)),0),\"\")","v":0}]
[null,null,null,null,null,{"$f":"IF(AND($A25<>\"Eindtotaal\",$A25<>\"\"),IFERROR((VLOOKUP($A25,basisdata[[#All],[dossiernummer]:[Kolom12]],4,0)),0),\"\")","v":""}]
[null,null,null,null,null,{"$f":"IF(AND($A26<>\"Eindtotaal\",$A26<>\"\"),IFERROR((VLOOKUP($A26,basisdata[[#All],[dossiernummer]:[Kolom12]],4,0)),0),\"\")","v":""}]
[null,null,null,null,null,{"$f":"IF(AND($A27<>\"Eindtotaal\",$A27<>\"\"),IFERROR((VLOOKUP($A27,basisdata[[#All],[dossiernummer]:[Kolom12]],4,0)),0),\"\")","v":""}]
[null,null,null,null,null,{"$f":"IF(AND($A28<>\"Eindtotaal\",$A28<>\"\"),IFERROR((VLOOKUP($A28,basisdata[[#All],[dossiernummer]:[Kolom12]],4,0)),0),\"\")","v":""}]
{"$rows_left_out":30}
{"sheet":"Contractanten","index":2,"n_rows":11,"n_cols":11,"rows_kept":11,"cut":false,"hidden":false,"merged":[]}
["(Sub)Contractanten"]
["Begunstigde KBO nummer","Begunstigde naam","Aanbestedende overheid? (J/N)","Raamcontract VEB?\n(J/N)","Contractnaam (vb. zonnepanelen, dakisolatie, …)","Aankoopbedrag","Contractant KBO nummer","Contractant naam","Subcontractant KBO nummer","Subcontractant naam","Definitief (J/N)"]
["KBO nummer (BEXXXXXXXXXX, zonder puntjes) van uw organiserend bestuur","Naam van uw organiserend bestuur","Vul \"J\" in indien uw organiserend bestuur of dit project valt onder de Wet op de Overheidsopdrachten, \"N\" indien niet","Vul \"J\" in indien u voor uitvoering van dit project afneemt van RO VEB, \"N\" indien niet","Naam van de maatregel die zal worden uitgevoerd (vb. plaatsing zonnepanelen, dakisolatie…)","Totaalbedrag in euro, excl. btw","KBO nummer (BEXXXXXXXXXX, zonder puntjes) van de aannemer","Leverancier, aannemer of dienstverlener die de maatregel uitvoert","KBO nummer (BEXXXXXXXXXX, zonder puntjes) van de eventuele onderaannemer","Onderaannemer waarop de aannemer beroep doen in het kader van de uitvoering van de werken/levereing (bekendgeving via bestek of via melding)","Vul 'J' in indien het contract reeds volledig werd gefactureerd, 'N' indien er nog facturen worden verwacht."]
[{"$f":"\"BE\"&Facturatie!$B$7","v":"BE0"},{"$f":"Facturatie!$B$5","v":"xxx"},null,null,{"$f":"Facturatie!F24","v":0}]
[{"$f":"\"BE\"&Facturatie!$B$7","v":"BE0"},{"$f":"Facturatie!$B$5","v":"xxx"},null,null,{"$f":"Facturatie!F25","v":""}]
[{"$f":"\"BE\"&Facturatie!$B$7","v":"BE0"},{"$f":"Facturatie!$B$5","v":"xxx"},null,null,{"$f":"Facturatie!F26","v":""}]
[{"$f":"\"BE\"&Facturatie!$B$7","v":"BE0"},{"$f":"Facturatie!$B$5","v":"xxx"},null,null,{"$f":"Facturatie!F27","v":""}]
[{"$f":"\"BE\"&Facturatie!$B$7","v":"BE0"},{"$f":"Facturatie!$B$5","v":"xxx"},null,null,{"$f":"Facturatie!F28","v":""}]
[{"$f":"\"BE\"&Facturatie!$B$7","v":"BE0"},{"$f":"Facturatie!$B$5","v":"xxx"},null,null,{"$f":"Facturatie!F29","v":""}]
[{"$f":"\"BE\"&Facturatie!$B$7","v":"BE0"},{"$f":"Facturatie!$B$5","v":"xxx"},null,null,{"$f":"Facturatie!F30","v":""}]
[{"$f":"\"BE\"&Facturatie!$B$7","v":"BE0"},{"$f":"Facturatie!$B$5","v":"xxx"},null,null,{"$f":"Facturatie!F31","v":""}]

{"sheet":"Betrokken medewerkers","index":3,"n_rows":16,"n_cols":4,"rows_kept":16,"cut":false,"hidden":true,"merged":[]}
["Betrokken personen"]
["Voornaam medewerkers betrokken bij de toekenningsprocedure","Naam","Geboortedatum","Functie"]
[{"$f":"'Verklaring betrokkenen'!A104","v":0},{"$f":"'Verklaring betrokkenen'!B104","v":0},{"$f":"'Verklaring betrokkenen'!C104","v":0},{"$f":"'Verklaring betrokkenen'!D104","v":0}]
[{"$f":"'Verklaring betrokkenen'!A105","v":0},{"$f":"'Verklaring betrokkenen'!B105","v":0},{"$f":"'Verklaring betrokkenen'!C105","v":0},{"$f":"'Verklaring betrokkenen'!D105","v":0}]
[{"$f":"'Verklaring betrokkenen'!A106","v":0},{"$f":"'Verklaring betrokkenen'!B106","v":0},{"$f":"'Verklaring betrokkenen'!C106","v":0},{"$f":"'Verklaring betrokkenen'!D106","v":0}]
[{"$f":"'Verklaring betrokkenen'!A107","v":0},{"$f":"'Verklaring betrokkenen'!B107","v":0},{"$f":"'Verklaring betrokkenen'!C107","v":0},{"$f":"'Verklaring betrokkenen'!D107","v":0}]
[{"$f":"'Verklaring betrokkenen'!A108","v":0},{"$f":"'Verklaring betrokkenen'!B108","v":0},{"$f":"'Verklaring betrokkenen'!C108","v":0},{"$f":"'Verklaring betrokkenen'!D108","v":0}]
[{"$f":"'Verklaring betrokkenen'!A109","v":0},{"$f":"'Verklaring betrokkenen'!B109","v":0},{"$f":"'Verklaring betrokkenen'!C109","v":0},{"$f":"'Verklaring betrokkenen'!D109","v":0}]
[{"$f":"'Verklaring betrokkenen'!A110","v":0},{"$f":"'Verklaring betrokkenen'!B110","v":0},{"$f":"'Verklaring betrokkenen'!C110","v":0},{"$f":"'Verklaring betrokkenen'!D110","v":0}]
[{"$f":"'Verklaring betrokkenen'!A111","v":0},{"$f":"'Verklaring betrokkenen'!B111","v":0},{"$f":"'Verklaring betrokkenen'!C111","v":0},{"$f":"'Verklaring betrokkenen'!D111","v":0}]
[{"$f":"'Verklaring betrokkenen'!A112","v":0},{"$f":"'Verklaring betrokkenen'!B112","v":0},{"$f":"'Verklaring betrokkenen'!C112","v":0},{"$f":"'Verklaring betrokkenen'!D112","v":0}]
[{"$f":"'Verklaring betrokkenen'!A113","v":0},{"$f":"'Verklaring betrokkenen'!B113","v":0},{"$f":"'Verklaring betrokkenen'!C113","v":0},{"$f":"'Verklaring betrokkenen'!D113","v":0}]
[{"$f":"'Verklaring betrokkenen'!A114","v":0},{"$f":"'Verklaring betrokkenen'!B114","v":0},{"$f":"'Verklaring betrokkenen'!C114","v":0},{"$f":"'Verklaring betrokkenen'!D114","v":0}]
[{"$f":"'Verklaring betrokkenen'!A115","v":0},{"$f":"'Verklaring betrokkenen'!B115","v":0},{"$f":"'Verklaring betrokkenen'!C115","v":0},{"$f":"'Verklaring betrokkenen'!D115","v":0}]
[{"$f":"'Verklaring betrokkenen'!A116","v":0},{"$f":"'Verklaring betrokkenen'!B116","v":0},{"$f":"'Verklaring betrokkenen'!C116","v":0},{"$f":"'Verklaring betrokkenen'!D116","v":0}]
{"$rows_left_out":2}
{"sheet":"Verklaring betrokkenen","index":4,"n_rows":103,"n_cols":5,"rows_kept":103,"cut":false,"hidden":false,"merged":[[77,0,100,3],[0,0,4,3],[11,0,64,3]]}
["Verklaring op eer omtrent de afwezigheid van belangenconflicten"]
[]
[]
[]
[]
[]
[null,"KBOnr",{"$f":"Facturatie!B7","v":0}]
[null,"Naam rechtspersoon",{"$f":"Facturatie!B5","v":"xxx"}]
[null,"Gebouw",{"$f":"Facturatie!F11","v":0}]
[]
[]
["1. INLEIDING\n\nIn het kader van de bescherming van de financiële belangen van de Unie, artikel 22, 2, d, i tot iii, van Verordening (EU) nr. 2021/241 dient elke persoon betrokken bij de selectieprocedure van een projectoproep of overheidsaanbesteding die bijdraagt tot het behalen van de mijlpalen en streefdoelen die geheel of gedeeltelijk gefinancierd worden met middelen uit de Recovery en Resilience Facility (RRF, in dit geval REPowerEU-middelen), de afwezigheid van een conflicterend belang te verklaren. Meer bepaald moet elke persoon die deelneemt aan de voorbereiding, evaluatie en de toekenning van de overheidsopdracht deze verklaring verplicht invullen en ondertekenen.\n\nDe Europese Commissie legt bijzondere voorwaarden op met betrekking tot het afleggen van de verklaring op eer omtrent de afwezigheid van belangenconflicten door alle betrokken personen in alle stadia (voorbereiding, uitwerking, uitvoering of afhandeling) van de selectieprocedure. Hierna volgt een niet limitatieve opsomming van personen waarvoor deze verplichting in ieder geval geldt:\n•\thet hoofd van de aanbestedende dienst en iedereen aan wie hij/zij zijn/haar taken delegeert;\n•\talle leden van het managementcomité,\n•\talle personeelsleden die meewerken aan het voorbereiden en opstellen van de aanbestedingsdocumenten, \n•\tde leden van de beoordelingscommissie, \n•\tdeskundigen die taken verrichten die verband houden met het opstellen van de aanbestedingsdocumenten en/of het beoordelen van de offertes..\n\nMet deze ondertekening verklaart de ondertekenaar zich niet in een toestand van belangenconflict te bevinden zoals gedefinieerd in artikel 61 van het VERORDENING 2018/1046 VAN HET EUROPEES PARLEMENT EN DE RAAD van 18 juli 2018. In geval een risico op belangenconflict zich voordoet gedurende de selectieprocedure, reikt het hierboven vermelde artikel 61, de stappen aan die genomen moeten worden om het risico te mitigeren.\n\nHet artikel leest als volgt:\nBelangenconflict\n1.\tFinanciële actoren in de zin van hoofdstuk 4 van deze titel en andere personen, daaronder begrepen nationale autoriteiten op alle niveaus, die bij de uitvoering van de begroting onder direct, indirect en gedeeld beheer, met inbegrip van voorbereidende handelingen op dit gebied, de audit of de controle betrokken zijn, verrichten geen handelingen waarbij hun eigen belangen in conflict kunnen komen met die van de Unie. Zij nemen ook passende maatregelen om te voorkomen dat een belangenconflict ontstaat in de functies onder hun verantwoordelijkheid en om situaties te verhelpen die objectief als belangenconflict kunnen worden beschouwd.\n\n2.\tIndien er een risico bestaat op een belangenconflict waarbij een personeelslid van een nationale autoriteit betrokken is, brengt de betrokken persoon deze zaak ter kennis van zijn hiërarchieke meerdere. Indien een dergelijk risico bestaat voor aan het statuut onderworpen personeel brengt de betrokken persoon deze zaak ter kennis van de bevoegde gedelegeerde ordonnateur. De bevoegde hiërarchieke meerdere of de verantwoordelijk gedelegeerde ordonnateur bevestigt schriftelijk of er sprake is van een belangenconflict. Indien een belangenconflict wordt vastgesteld, zorgt het tot aanstelling bevoegde gezag of de bevoegde nationale autriteit ervoor dat de betrokken persoon al zijn activiteiten in verband met de zaak beëindigt. De betrokken gedelegeerde ordonnateur of de betrokken nationale autoriteit zorgt ervoor dat de nodige verdere maatregelen worden genomen in overeenstemming met de toepasselijke wetgeving.\n\n3.\tVoor de toepassing van lid 1 doet een belangenconflict zich voor wanneer de onpartijdige en objectieve uitoefening van de functies van de in lid 1 bedoelde financiële actor of andere persoon in gevaar wordt gebracht als gevolg van familiebanden, persoonlijke relaties, politieke gezindheid of nationaliteit, economische belangen of elk ander direct of indirect persoonlijk belang.\n\nDoor de ondertekening van dit document verklaart de betrokken persoon zich akkoord met de registratie en het gebruik van zijn of haar naam en voornaam in de database en het voorziene risicoscoringsinstrument (i.e. Arachne). \n\n2. GEBRUIKSINSTRUCTIE\n\nDe projectverantwoordelijke die instaat voor de overheidsopdracht, zorgt ervoor dat de hoofdstukken 3 en 4 correct worden ingevuld, en slaat dit bestand op als PDF. Dit document wordt door alle personen betrokken bij de beslissing tot toekenning van de overheidsopdracht verder ingevuld en ondertekend. \n\n3.PROJECTDETAILS\n\n3.1.PROJECTBESCHRIJVING\n(in te vullen door projectverantwoordelijke)"]
[]
[]
[]
{"$rows_left_out":89}
{"sheet":"Verklaring onderaannemers","index":5,"n_rows":25,"n_cols":3,"rows_kept":25,"cut":false,"hidden":false,"merged":[[0,1,3,3]]}
[null,"Verklaring op eer onderaannemers"]
[]
[]
[]
[]
[]
[]
[null,"KBOnr",{"$f":"Contractanten!A5","v":"BE0"}]
[null,"Naam",{"$f":"Contractanten!B5","v":"xxx"}]
[]
[null,"maatregel(en)"]
[]
[]
[]
[null,"Ik, ondergetekende (voornaam, naam, functie)"]
{"$rows_left_out":11}
{"sheet":"DNSH","index":6,"n_rows":64,"n_cols":19,"rows_kept":64,"cut":false,"hidden":false,"merged":[[121,31,128,37],[121,38,128,38],[121,39,128,39],[121,40,128,47],[71,31,90,37],[71,38,90,38],[71,39,90,39],[71,40,90,47],[91,31,120,37],[91,38,120,38],[91,39,120,39],[91,40,120,47],[59,40,63,47],[47,18,47,24],[49,18,49,24],[64,31,70,37],[64,38,70,38],[64,39,70,39],[37,39,58,39],[37,31,58,37],[37,40,58,47],[37,38,58,38],[59,39,63,39],[64,40,70,47],[59,31,63,37],[59,38,63,38],[51,1,52,17],[41,1,44,7],[41,10,41,17],[37,1,40,7],[37,8,40,8],[37,9,40,9],[37,10,40,17],[48,9,49,9],[43,10,43,17],[29,31,30,37],[29,38,30,38],[29,39,30,39],[29,40,30,47],[60,1,61,17],[63,1,63,17],[42,10,42,17],[45,1,47,7],[44,10,44,17],[47,10,47,17],[49,10,49,17],[45,8,47,8],[45,9,47,9],[45,10,45,17],[53,1,53,17],[55,1,55,17],[57,1,58,17],[41,8,44,8],[41,9,44,9],[41,18,41,24],[46,10,46,17],[48,1,49,7],[48,10,48,17],[48,8,49,8],[31,1,32,17],[31,31,36,37],[31,38,36,38],[31,39,36,39],[31,40,36,47],[35,1,36,7],[35,8,36,8],[35,9,36,9],[35,10,36,17],[35,18,36,24],[27,31,28,37],[1,0,2,22],[1,31,2,36],[1,37,2,47],[6,1,8,17],[6,31,7,47],[13,39,15,39],[13,40,15,47],[25,8,26,8],[25,9,26,9],[24,10,24,17],[25,10,25,17],[26,10,26,17],[22,10,23,17],[27,38,28,38],[27,39,28,39],[27,40,28,47],[14,10,14,17],[9,31,11,47],[11,1,12,7],[11,8,12,8],[11,9,12,9],[11,10,12,17],[16,40,17,47],[13,1,15,7],[13,8,15,8],[13,9,15,9],[13,31,15,37],[13,38,15,38],[13,10,13,17],[15,10,15,17],[16,10,16,17],[17,10,17,17],[16,1,17,7],[16,8,17,8],[16,9,17,9],[16,31,17,37],[16,38,17,38],[16,39,17,39],[18,39,19,39],[18,40,19,47],[20,1,21,7],[20,8,21,8],[20,9,21,9],[20,10,21,17],[20,31,26,37],[20,38,26,38],[20,39,26,39],[20,40,26,47],[18,10,18,17],[19,10,19,17],[25,1,26,7],[18,1,19,7],[18,8,19,8],[18,9,19,9],[18,31,19,37],[18,38,19,38],[22,1,24,7],[22,8,24,8],[22,9,24,9]]}
["DNSH CHECKLIST - Energiebesparende maatregelen"]
["DNSH staat voor: Do No Significant Harm. Een principe dat Europa hanteert om zekerheid te krijgen dat Europees gefinancierde projecten geen impact hebben op de zes milieudoelstellingen van de Europese Unie. Deze doelstellingen hebben betrekking op klimaatverandering, klimaatadaptatie, bescherming van het water en de zee, afvalbeheer en vermindering, uitstootbeheersing en herstellen van biodiversiteit.  Naargelang de aard van het project moet een uitgebreide of beknopte analyse uitgevoerd worden, die waar nodig met bewijsstukken wordt gestaafd. De controlerende instantie (=europa naar VIPA, VIPA naar voorziening, of voorziening naar aannemer) heeft het recht om bijkomende vragen te stellen i.k.v. de DNSH-analyse en kan verzoeken om bijkomende stavingstukken. Voor deze subsidieoproep volstaat een beknopte analyse in de vorm van onderstaande zelfbevraging. Duid aan of uw investering/ingreep impact heeft op onderstaande vragen: ja: het heeft impact, duid aan wat u doet om het te mitigeren, neen: geen impact, en schrijf kort neer waarom niet: bv zonnepanelen geven groene stroom, en verlagen ons verbruik op een duurzame wijze. We helpen jullie alvast op weg door een aantal velden al in te vullen, aangezien deze generiek zijn aan de scope van onze VIPA-projectoproep. Een aantal velden (in rood en blauw kader) dient u nog zelf in te vullen, aangezien deze evaluatie van DNSH uitvoering specifiek is. rood kader = verplicht in te vullen, blauw kader = facultatief in te vullen, wit kader = kan ongewijzigd blijven. "]
[]
[]
[]
[]
[null,"DEEL 1: In de eerste checklist moet men de zes milieudoelstellingen filteren om te bepalen welke doelstellingen een inhoudelijke beoordeling (DEEL 2) vereisen. Voor elke maatregel: geef aan voor welke van de onderstande milieudoelstellingen, zoals omschreven in artikel 17 (\"Ernstige afbreuk aan milieudoelstellingen\") van de taxonomieverordening van de EU, een inhoudelijke toetsing van de maatregel aan het beginsel \"geen ernstige afbreuk doen aan\" vereist is: "]
[]
[]
[]
[]
[null,"Geef aan voor welke milieudoelstellingen de maatregel inhoudelijk aan het beginsel \"geen ernstige afbreuk doen aan\" moet worden getoetst.",null,null,null,null,null,null,"Ja","Nee","Onderbouwing indien \"Nee\" is gekozen"]
[]
[null,"klimaatmitigatie",null,null,null,null,null,null,null,"x","Door deze maatregelen wordt de CO2-uitstoot van gebouwen en installaties significant beperkt.\nDe projectoproep van VIPA is bedoeld voor maatregelen die GHG emissies reduceren of de energie-efficiëntie van gebouwen en installaties verbeteren. \nVoor elk van de te beoordelen investeringsmaatregelen is vooraf met een analyse en audit de haalbaarheid van dit resultaat geverifieerd, en zijn  onderbouwde energiebesparende maatregelen voorgesteld binnen de best beschikbare technologie. Deze energiebesparende maatregel is een onderdeel van het resultaat van de audit, waarop bovenstaande analyse toegepast is."]
[null,null,null,null,null,null,null,null,null,null,"Met het uitvoeren van deze maatregel wordt er XXX ton/jaar CO2-reductie gerealiseerd."]
{"$rows_left_out":50}
{"sheet":"Identificatie","index":7,"n_rows":27,"n_cols":19,"rows_kept":27,"cut":false,"hidden":false,"merged":[[24,1,24,2],[24,3,24,5],[24,6,24,7],[24,8,24,9],[26,1,26,2],[26,3,26,5],[26,6,26,7],[26,8,26,9],[16,1,16,6],[17,1,17,9],[22,1,22,2],[22,3,22,5],[22,6,22,7],[22,8,22,9],[12,4,12,9],[14,1,14,9],[2,1,2,9],[4,4,4,9],[5,4,5,9],[6,4,6,9],[7,4,7,9],[8,4,8,9],[9,4,9,9],[10,4,10,9],[11,4,11,9]]}
[null,"Identificatieformulier klimaatsubsidies"]
[]
[null,"Identificatiegegevens ",null,null,null,null,null,null,null,null,null,null,null,null,null,10]
[null,null,null,null,null,null,null,null,null,null,null,null,null,null,null,11]
[null,"Rechtspersoon:",null,null,{"$f":"Facturatie!B5","v":"xxx"}]
[null,"Ondernemingsnummer:",null,null,{"$f":"Facturatie!B7","v":0}]
[null,"Straat+nr:"]
[null,"Gemeente:"]
[null,"Bankrekeningnummer:",null,null,null,null,null,null,null,null,null,null,null,null,null,null,"IBAN-nummer: ",null,"BE gevolgd door 14 cijfers, zonder spaties"]
[null,"Contactpersoon:",null,null,null,null,null,null,null,null,null,null,null,null,null,null,null,null,"http://www.ibanbic.be/"]
[null,"Mailadres contactpersoon:"]
[null,"Telefoonnummer:"]
[null,"Voorziening:",null,null,null,null,null,null,null,null,null,null,null,null,null,1]
[null,null,null,null,null,null,null,null,null,null,null,null,null,null,null,2]
[null,"Ondertekening door 2 vertegenwoordigers van de aanvrager",null,null,null,null,null,null,null,null,null,null,null,null,null,3]
{"$rows_left_out":13}
{"sheet":"Register stavingsstukken","index":8,"n_rows":7,"n_cols":2,"rows_kept":7,"cut":false,"hidden":false,"merged":[[0,0,4,1]]}
["Register stavingsstukken (factuur, UBO, documenten ondersteunend voor DNSH, verklaringen op eer,…)"]
[]
[]
[]
[]
["Naam document (bestandsnaam)","type "]
["Vb. Factuur_20183547.1_RPS-1107-2","Factuur"]

{"sheet":"basisdata","index":9,"n_rows":639,"n_cols":13,"rows_kept":639,"cut":false,"hidden":true,"merged":[]}
["geheime code","Referentie Gebouw","KBO","Organisatie","Gebouw","Categorie maatregel","Subsidiebedrag","Dossiertype","dossiernummer","Kolom2","Kolom1","Kolom12","oproep"]
[2074380105,"20209492.1",207436775,"Stad Oostende","De Ballon","PV-panelen",21696,"SIMPLE","RPS-1080-1 (R1)",{"$f":"basisdata[[#This Row],[Categorie maatregel]]","v":"PV-panelen"},{"$f":"IFERROR(VLOOKUP(Facturatie!B3,basisdata[[#All],[geheime code]:[KBO]],3,FALSE),0)","v":0},{"$f":"basisdata[[#This Row],[Gebouw]]","v":"De Ballon"},"R1"]
[2074380105,"20207013.1",207436775,"Stad Oostende","De Zeeparel","PV-panelen",1357,"SIMPLE","RPS-1081-1 (R1)",{"$f":"basisdata[[#This Row],[Categorie maatregel]]","v":"PV-panelen"},null,{"$f":"basisdata[[#This Row],[Gebouw]]","v":"De Zeeparel"},"R1"]
[2074380105,"20206107.2",207436775,"Stad Oostende","LDC DE BOEIE","PV-panelen",3490,"SIMPLE","RPS-1082-1 (R1)",{"$f":"basisdata[[#This Row],[Categorie maatregel]]","v":"PV-panelen"},null,{"$f":"basisdata[[#This Row],[Gebouw]]","v":"LDC DE BOEIE"},"R1"]
[2074380105,"20206033.2",207436775,"Stad Oostende","De Brem","PV-panelen",14072,"SIMPLE","RPS-531-2 (R1)",{"$f":"basisdata[[#This Row],[Categorie maatregel]]","v":"PV-panelen"},null,{"$f":"basisdata[[#This Row],[Gebouw]]","v":"De Brem"},"R1"]
[2074380105,"20206033.2",207436775,"Stad Oostende","De Brem","Relighting/relamping",2706,"SIMPLE","RPS-531-3 (R1)",{"$f":"basisdata[[#This Row],[Categorie maatregel]]","v":"Relighting/relamping"},null,{"$f":"basisdata[[#This Row],[Gebouw]]","v":"De Brem"},"R1"]
[2074380105,"20209441.2",207436775,"Stad Oostende","LDC 't Viooltje","PV-panelen",8407,"SIMPLE","RPS-534-4 (R1)",{"$f":"basisdata[[#This Row],[Categorie maatregel]]","v":"PV-panelen"},null,{"$f":"basisdata[[#This Row],[Gebouw]]","v":"LDC 't Viooltje"},"R1"]
[2074380105,"20209441.2",207436775,"Stad Oostende","LDC 't Viooltje","Relighting/relamping",503,"SIMPLE","RPS-534-5 (R1)",{"$f":"basisdata[[#This Row],[Categorie maatregel]]","v":"Relighting/relamping"},null,{"$f":"basisdata[[#This Row],[Gebouw]]","v":"LDC 't Viooltje"},"R1"]
[2074380105,"20209441.2",207436775,"Stad Oostende","LDC 't Viooltje","Relighting/relamping",12483,"SIMPLE","RPS-534-6 (R1)",{"$f":"basisdata[[#This Row],[Categorie maatregel]]","v":"Relighting/relamping"},null,{"$f":"basisdata[[#This Row],[Gebouw]]","v":"LDC 't Viooltje"},"R1"]
[2074380105,"20203436.2",207436775,"Stad Oostende","Panukkel","PV-panelen",7352,"SIMPLE","RPS-535-3 (R1)",{"$f":"basisdata[[#This Row],[Categorie maatregel]]","v":"PV-panelen"},null,{"$f":"basisdata[[#This Row],[Gebouw]]","v":"Panukkel"},"R1"]
[2074380105,"20203436.2",207436775,"Stad Oostende","Panukkel","Relighting/relamping",4398,"SIMPLE","RPS-535-4 (R1)",{"$f":"basisdata[[#This Row],[Categorie maatregel]]","v":"Relighting/relamping"},null,{"$f":"basisdata[[#This Row],[Gebouw]]","v":"Panukkel"},"R1"]
[2074715640,"20224805.2",207470330,"Gemeente Tessenderlo","BKO Pinokkio","Relighting",430,"SIMPLE","RPS-874-10 (R1)",{"$f":"basisdata[[#This Row],[Categorie maatregel]]","v":"Relighting"},null,{"$f":"basisdata[[#This Row],[Gebouw]]","v":"BKO Pinokkio"},"R1"]
[2074715640,"20224805.2",207470330,"Gemeente Tessenderlo","BKO Pinokkio","Relighting",659,"SIMPLE","RPS-874-11 (R1)",{"$f":"basisdata[[#This Row],[Categorie maatregel]]","v":"Relighting"},null,{"$f":"basisdata[[#This Row],[Gebouw]]","v":"BKO Pinokkio"},"R1"]
[2074715640,"20224805.2",207470330,"Gemeente Tessenderlo","BKO Pinokkio","Relighting",6089,"SIMPLE","RPS-874-12 (R1)",{"$f":"basisdata[[#This Row],[Categorie maatregel]]","v":"Relighting"},null,{"$f":"basisdata[[#This Row],[Gebouw]]","v":"BKO Pinokkio"},"R1"]
[2074715640,"20224805.2",207470330,"Gemeente Tessenderlo","BKO Pinokkio","Renovatie SWW",295,"SIMPLE","RPS-874-13 (R1)",{"$f":"basisdata[[#This Row],[Categorie maatregel]]","v":"Renovatie SWW"},null,{"$f":"basisdata[[#This Row],[Gebouw]]","v":"BKO Pinokkio"},"R1"]
{"$rows_left_out":624}