*Heading
** Job name: modelo-equation Model name: modelo-equation
** Generated by: Abaqus/CAE 2019
*Preprint, echo=NO, model=NO, history=NO, contact=NO
**
** PARTS
**
*Part, name=cuaderna
*End Part
**
*Part, name=fuselaje
*End Part
**
*Part, name=largueros
*End Part
**
**
** ASSEMBLY
**
*Assembly, name=Assembly
**
*Instance, name=fuselaje-1, part=fuselaje
*Node
*Element, type=S4R
*Nset, nset=Set-1, generate
*Elset, elset=Set-1, generate
** Section: aluminio
*Shell Section, elset=Set-1, material=aluminio
2., 5
*End Instance
**
*Instance, name=cuaderna-1, part=cuaderna
*Node
*Element, type=S4R
*Nset, nset=Set-1, generate
*Elset, elset=Set-1, generate
** Section: aluminio
*Shell Section, elset=Set-1, material=aluminio, offset=SPOS
2., 5
*End Instance
**
*Instance, name=fuselaje-1-lin-2-1, part=fuselaje
*Node
*Element, type=S4R
*Nset, nset=Set-1, generate
*Elset, elset=Set-1, generate
** Section: aluminio
*Shell Section, elset=Set-1, material=aluminio
2., 5
*End Instance
**
*Instance, name=fuselaje-1-lin-3-1, part=fuselaje
*Node
*Element, type=S4R
*Nset, nset=Set-1, generate
*Elset, elset=Set-1, generate
** Section: aluminio
*Shell Section, elset=Set-1, material=aluminio
2., 5
*End Instance
**
*Instance, name=fuselaje-1-lin-4-1, part=fuselaje
*Node
*Element, type=S4R
*Nset, nset=Set-1, generate
*Elset, elset=Set-1, generate
** Section: aluminio
*Shell Section, elset=Set-1, material=aluminio
2., 5
*End Instance
**
*Instance, name=fuselaje-1-lin-5-1, part=fuselaje
*Node
*Element, type=S4R
*Nset, nset=Set-1, generate
*Elset, elset=Set-1, generate
** Section: aluminio
*Shell Section, elset=Set-1, material=aluminio
2., 5
*End Instance
**
*Instance, name=cuaderna-1-lin-2-1, part=cuaderna
*Node
*Element, type=S4R
*Nset, nset=Set-1, generate
*Elset, elset=Set-1, generate
** Section: aluminio
*Shell Section, elset=Set-1, material=aluminio, offset=SPOS
2., 5
*End Instance
**
*Instance, name=cuaderna-1-lin-3-1, part=cuaderna
*Node
*Element, type=S4R
*Nset, nset=Set-1, generate
*Elset, elset=Set-1, generate
** Section: aluminio
*Shell Section, elset=Set-1, material=aluminio, offset=SPOS
2., 5
*End Instance
**
*Instance, name=cuaderna-1-lin-4-1, part=cuaderna
*Node
*Element, type=S4R
*Nset, nset=Set-1, generate
*Elset, elset=Set-1, generate
** Section: aluminio
*Shell Section, elset=Set-1, material=aluminio, offset=SPOS
2., 5
*End Instance
**
*Instance, name=cuaderna-1-lin-5-1, part=cuaderna
*Node
*Element, type=S4R
*Nset, nset=Set-1, generate
*Elset, elset=Set-1, generate
** Section: aluminio
*Shell Section, elset=Set-1, material=aluminio, offset=SPOS
2., 5
*End Instance
**
*Instance, name=fuselaje-2, part=fuselaje
*Node
*Element, type=S4R
*Nset, nset=Set-1, generate
*Elset, elset=Set-1, generate
** Section: aluminio
*Shell Section, elset=Set-1, material=aluminio
2., 5
*End Instance
**
*Instance, name=cuaderna-2, part=cuaderna
*Node
*Element, type=S4R
*Nset, nset=Set-1, generate
*Elset, elset=Set-1, generate
** Section: aluminio
*Shell Section, elset=Set-1, material=aluminio, offset=SPOS
2., 5
*End Instance
**
*Instance, name=fuselaje-1-lin-2-1-1, part=fuselaje
*Node
*Element, type=S4R
*Nset, nset=Set-1, generate
*Elset, elset=Set-1, generate
** Section: aluminio
*Shell Section, elset=Set-1, material=aluminio
2., 5
*End Instance
**
*Instance, name=fuselaje-1-lin-2-1-lin-2-1, part=fuselaje
*Node
*Element, type=S4R
*Nset, nset=Set-1, generate
*Elset, elset=Set-1, generate
** Section: aluminio
*Shell Section, elset=Set-1, material=aluminio
2., 5
*End Instance
**
*Instance, name=fuselaje-2-lin-2-1, part=fuselaje
*Node
*Element, type=S4R
*Nset, nset=Set-1, generate
*Elset, elset=Set-1, generate
** Section: aluminio
*Shell Section, elset=Set-1, material=aluminio
2., 5
*End Instance
**
*Instance, name=fuselaje-1-lin-3-1-lin-2-1, part=fuselaje
*Node
*Element, type=S4R
*Nset, nset=Set-1, generate
*Elset, elset=Set-1, generate
** Section: aluminio
*Shell Section, elset=Set-1, material=aluminio
2., 5
*End Instance
**
*Instance, name=fuselaje-1-lin-4-1-lin-2-1, part=fuselaje
*Node
*Element, type=S4R
*Nset, nset=Set-1, generate
*Elset, elset=Set-1, generate
** Section: aluminio
*Shell Section, elset=Set-1, material=aluminio
2., 5
*End Instance
**
*Instance, name=fuselaje-1-lin-5-1-lin-2-1, part=fuselaje
*Node
*Element, type=S4R
*Nset, nset=Set-1, generate
*Elset, elset=Set-1, generate
** Section: aluminio
*Shell Section, elset=Set-1, material=aluminio
2., 5
*End Instance
**
*Instance, name=cuaderna-1-lin-2-1-1, part=cuaderna
*Node
*Element, type=S4R
*Nset, nset=Set-1, generate
*Elset, elset=Set-1, generate
** Section: aluminio
*Shell Section, elset=Set-1, material=aluminio, offset=SPOS
2., 5
*End Instance
**
*Instance, name=cuaderna-1-lin-2-1-lin-2-1, part=cuaderna
*Node
*Element, type=S4R
*Nset, nset=Set-1, generate
*Elset, elset=Set-1, generate
** Section: aluminio
*Shell Section, elset=Set-1, material=aluminio, offset=SPOS
2., 5
*End Instance
**
*Instance, name=cuaderna-1-lin-3-1-lin-2-1, part=cuaderna
*Node
*Element, type=S4R
*Nset, nset=Set-1, generate
*Elset, elset=Set-1, generate
** Section: aluminio
*Shell Section, elset=Set-1, material=aluminio, offset=SPOS
2., 5
*End Instance
**
*Instance, name=cuaderna-1-lin-4-1-lin-2-1, part=cuaderna
*Node
*Element, type=S4R
*Nset, nset=Set-1, generate
*Elset, elset=Set-1, generate
** Section: aluminio
*Shell Section, elset=Set-1, material=aluminio, offset=SPOS
2., 5
*End Instance
**
*Instance, name=cuaderna-1-lin-5-1-lin-2-1, part=cuaderna
*Node
*Element, type=S4R
*Nset, nset=Set-1, generate
*Elset, elset=Set-1, generate
** Section: aluminio
*Shell Section, elset=Set-1, material=aluminio, offset=SPOS
2., 5
*End Instance
**
*Instance, name=largueros-1, part=largueros
*Node
*Element, type=S4R
*Nset, nset=Set-1, generate
*Elset, elset=Set-1, generate
** Section: aluminio
*Shell Section, elset=Set-1, material=aluminio, offset=SPOS
2., 5
*End Instance
**
*Instance, name=largueros-1-rad-2, part=largueros
*Node
*Element, type=S4R
*Nset, nset=Set-1, generate
*Elset, elset=Set-1, generate
** Section: aluminio
*Shell Section, elset=Set-1, material=aluminio, offset=SPOS
2., 5
*End Instance
**
*Instance, name=largueros-1-rad-3, part=largueros
*Node
*Element, type=S4R
*Nset, nset=Set-1, generate
*Elset, elset=Set-1, generate
** Section: aluminio
*Shell Section, elset=Set-1, material=aluminio, offset=SPOS
2., 5
*End Instance
**
*Instance, name=largueros-1-rad-4, part=largueros
*Node
*Element, type=S4R
*Nset, nset=Set-1, generate
*Elset, elset=Set-1, generate
** Section: aluminio
*Shell Section, elset=Set-1, material=aluminio, offset=SPOS
2., 5
*End Instance
**
*Instance, name=largueros-1-rad-5, part=largueros
*Node
*Element, type=S4R
*Nset, nset=Set-1, generate
*Elset, elset=Set-1, generate
** Section: aluminio
*Shell Section, elset=Set-1, material=aluminio, offset=SPOS
2., 5
*End Instance
**
*Instance, name=largueros-1-rad-6, part=largueros
*Node
*Element, type=S4R
*Nset, nset=Set-1, generate
*Elset, elset=Set-1, generate
** Section: aluminio
*Shell Section, elset=Set-1, material=aluminio, offset=SPOS
2., 5
*End Instance
**
*Instance, name=largueros-1-rad-7, part=largueros
*Node
*Element, type=S4R
*Nset, nset=Set-1, generate
*Elset, elset=Set-1, generate
** Section: aluminio
*Shell Section, elset=Set-1, material=aluminio, offset=SPOS
2., 5
*End Instance
**
*Instance, name=largueros-1-rad-8, part=largueros
*Node
*Element, type=S4R
*Nset, nset=Set-1, generate
*Elset, elset=Set-1, generate
** Section: aluminio
*Shell Section, elset=Set-1, material=aluminio, offset=SPOS
2., 5
*End Instance
**
*Instance, name=largueros-1-rad-9, part=largueros
*Node
*Element, type=S4R
*Nset, nset=Set-1, generate
*Elset, elset=Set-1, generate
** Section: aluminio
*Shell Section, elset=Set-1, material=aluminio, offset=SPOS
2., 5
*End Instance
**
*Instance, name=largueros-1-rad-10, part=largueros
*Node
*Element, type=S4R
*Nset, nset=Set-1, generate
*Elset, elset=Set-1, generate
** Section: aluminio
*Shell Section, elset=Set-1, material=aluminio, offset=SPOS
2., 5
*End Instance
**
*Instance, name=largueros-1-rad-11, part=largueros
*Node
*Element, type=S4R
*Nset, nset=Set-1, generate
*Elset, elset=Set-1, generate
** Section: aluminio
*Shell Section, elset=Set-1, material=aluminio, offset=SPOS
2., 5
*End Instance
**
*Instance, name=largueros-1-rad-12, part=largueros
*Node
*Element, type=S4R
*Nset, nset=Set-1, generate
*Elset, elset=Set-1, generate
** Section: aluminio
*Shell Section, elset=Set-1, material=aluminio, offset=SPOS
2., 5
*End Instance
**
*Instance, name=largueros-1-rad-13, part=largueros
*Node
*Element, type=S4R
*Nset, nset=Set-1, generate
*Elset, elset=Set-1, generate
** Section: aluminio
*Shell Section, elset=Set-1, material=aluminio, offset=SPOS
2., 5
*End Instance
**
*Instance, name=largueros-1-rad-14, part=largueros
*Node
*Element, type=S4R
*Nset, nset=Set-1, generate
*Elset, elset=Set-1, generate
** Section: aluminio
*Shell Section, elset=Set-1, material=aluminio, offset=SPOS
2., 5
*End Instance
**
*Instance, name=largueros-1-rad-15, part=largueros
*Node
*Element, type=S4R
*Nset, nset=Set-1, generate
*Elset, elset=Set-1, generate
** Section: aluminio
*Shell Section, elset=Set-1, material=aluminio, offset=SPOS
2., 5
*End Instance
**
*Instance, name=largueros-1-rad-16, part=largueros
*Node
*Element, type=S4R
*Nset, nset=Set-1, generate
*Elset, elset=Set-1, generate
** Section: aluminio
*Shell Section, elset=Set-1, material=aluminio, offset=SPOS
2., 5
*End Instance
**
*Node
*Node
*Nset, nset=Set-1, instance=fuselaje-1
*Nset, nset=Set-1, instance=largueros-1
*Nset, nset=Set-1, instance=largueros-1-rad-3
*Nset, nset=Set-1, instance=largueros-1-rad-5
*Nset, nset=Set-1, instance=largueros-1-rad-9
*Nset, nset=Set-1, instance=largueros-1-rad-13
*Nset, nset=Set-1, instance=largueros-1-rad-7
*Nset, nset=Set-1, instance=largueros-1-rad-11
*Nset, nset=Set-1, instance=largueros-1-rad-15
*Nset, nset=Set-1, instance=largueros-1-rad-2
*Nset, nset=Set-1, instance=largueros-1-rad-6
*Nset, nset=Set-1, instance=largueros-1-rad-10
*Nset, nset=Set-1, instance=largueros-1-rad-14
*Nset, nset=Set-1, instance=largueros-1-rad-4
*Nset, nset=Set-1, instance=largueros-1-rad-12
*Nset, nset=Set-1, instance=largueros-1-rad-8
*Nset, nset=Set-1, instance=largueros-1-rad-16
*Elset, elset=Set-1, instance=fuselaje-1
*Elset, elset=Set-1, instance=largueros-1, generate
*Elset, elset=Set-1, instance=largueros-1-rad-3, generate
*Elset, elset=Set-1, instance=largueros-1-rad-5, generate
*Elset, elset=Set-1, instance=largueros-1-rad-9, generate
*Elset, elset=Set-1, instance=largueros-1-rad-13, generate
*Elset, elset=Set-1, instance=largueros-1-rad-7, generate
*Elset, elset=Set-1, instance=largueros-1-rad-11, generate
*Elset, elset=Set-1, instance=largueros-1-rad-15, generate
*Elset, elset=Set-1, instance=largueros-1-rad-2, generate
*Elset, elset=Set-1, instance=largueros-1-rad-6, generate
*Elset, elset=Set-1, instance=largueros-1-rad-10, generate
*Elset, elset=Set-1, instance=largueros-1-rad-14, generate
*Elset, elset=Set-1, instance=largueros-1-rad-4, generate
*Elset, elset=Set-1, instance=largueros-1-rad-12, generate
*Elset, elset=Set-1, instance=largueros-1-rad-8, generate
*Elset, elset=Set-1, instance=largueros-1-rad-16, generate
*Nset, nset=Set-2, instance=fuselaje-2-lin-2-1
*Nset, nset=Set-2, instance=largueros-1
*Nset, nset=Set-2, instance=largueros-1-rad-3
*Nset, nset=Set-2, instance=largueros-1-rad-5
*Nset, nset=Set-2, instance=largueros-1-rad-9
*Nset, nset=Set-2, instance=largueros-1-rad-13
*Nset, nset=Set-2, instance=largueros-1-rad-7
*Nset, nset=Set-2, instance=largueros-1-rad-11
*Nset, nset=Set-2, instance=largueros-1-rad-15
*Nset, nset=Set-2, instance=largueros-1-rad-2
*Nset, nset=Set-2, instance=largueros-1-rad-6
*Nset, nset=Set-2, instance=largueros-1-rad-10
*Nset, nset=Set-2, instance=largueros-1-rad-14
*Nset, nset=Set-2, instance=largueros-1-rad-4
*Nset, nset=Set-2, instance=largueros-1-rad-12
*Nset, nset=Set-2, instance=largueros-1-rad-8
*Nset, nset=Set-2, instance=largueros-1-rad-16
*Elset, elset=Set-2, instance=fuselaje-2-lin-2-1
*Elset, elset=Set-2, instance=largueros-1, generate
*Elset, elset=Set-2, instance=largueros-1-rad-3, generate
*Elset, elset=Set-2, instance=largueros-1-rad-5, generate
*Elset, elset=Set-2, instance=largueros-1-rad-9, generate
*Elset, elset=Set-2, instance=largueros-1-rad-13, generate
*Elset, elset=Set-2, instance=largueros-1-rad-7, generate
*Elset, elset=Set-2, instance=largueros-1-rad-11, generate
*Elset, elset=Set-2, instance=largueros-1-rad-15, generate
*Elset, elset=Set-2, instance=largueros-1-rad-2, generate
*Elset, elset=Set-2, instance=largueros-1-rad-6, generate
*Elset, elset=Set-2, instance=largueros-1-rad-10, generate
*Elset, elset=Set-2, instance=largueros-1-rad-14, generate
*Elset, elset=Set-2, instance=largueros-1-rad-4, generate
*Elset, elset=Set-2, instance=largueros-1-rad-12, generate
*Elset, elset=Set-2, instance=largueros-1-rad-8, generate
*Elset, elset=Set-2, instance=largueros-1-rad-16, generate
*Nset, nset=Set-7
*Nset, nset=Set-8
*Nset, nset=Set-9
*Nset, nset=carga
*Nset, nset=empotramiento
*Nset, nset=set-carga, instance=fuselaje-2-lin-2-1
*Nset, nset=set-carga, instance=largueros-1
*Nset, nset=set-carga, instance=largueros-1-rad-3
*Nset, nset=set-carga, instance=largueros-1-rad-5
*Nset, nset=set-carga, instance=largueros-1-rad-9
*Nset, nset=set-carga, instance=largueros-1-rad-13
*Nset, nset=set-carga, instance=largueros-1-rad-7
*Nset, nset=set-carga, instance=largueros-1-rad-11
*Nset, nset=set-carga, instance=largueros-1-rad-15
*Nset, nset=set-carga, instance=largueros-1-rad-2
*Nset, nset=set-carga, instance=largueros-1-rad-6
*Nset, nset=set-carga, instance=largueros-1-rad-10
*Nset, nset=set-carga, instance=largueros-1-rad-14
*Nset, nset=set-carga, instance=largueros-1-rad-4
*Nset, nset=set-carga, instance=largueros-1-rad-12
*Nset, nset=set-carga, instance=largueros-1-rad-8
*Nset, nset=set-carga, instance=largueros-1-rad-16
*Elset, elset=set-carga, instance=fuselaje-2-lin-2-1
*Elset, elset=set-carga, instance=largueros-1, generate
*Elset, elset=set-carga, instance=largueros-1-rad-3, generate
*Elset, elset=set-carga, instance=largueros-1-rad-5, generate
*Elset, elset=set-carga, instance=largueros-1-rad-9, generate
*Elset, elset=set-carga, instance=largueros-1-rad-13, generate
*Elset, elset=set-carga, instance=largueros-1-rad-7, generate
*Elset, elset=set-carga, instance=largueros-1-rad-11, generate
*Elset, elset=set-carga, instance=largueros-1-rad-15, generate
*Elset, elset=set-carga, instance=largueros-1-rad-2, generate
*Elset, elset=set-carga, instance=largueros-1-rad-6, generate
*Elset, elset=set-carga, instance=largueros-1-rad-10, generate
*Elset, elset=set-carga, instance=largueros-1-rad-14, generate
*Elset, elset=set-carga, instance=largueros-1-rad-4, generate
*Elset, elset=set-carga, instance=largueros-1-rad-12, generate
*Elset, elset=set-carga, instance=largueros-1-rad-8, generate
*Elset, elset=set-carga, instance=largueros-1-rad-16, generate
*Nset, nset=set-empotramiento, instance=fuselaje-1
*Nset, nset=set-empotramiento, instance=largueros-1
*Nset, nset=set-empotramiento, instance=largueros-1-rad-3
*Nset, nset=set-empotramiento, instance=largueros-1-rad-5
*Nset, nset=set-empotramiento, instance=largueros-1-rad-9
*Nset, nset=set-empotramiento, instance=largueros-1-rad-13
*Nset, nset=set-empotramiento, instance=largueros-1-rad-7
*Nset, nset=set-empotramiento, instance=largueros-1-rad-11
*Nset, nset=set-empotramiento, instance=largueros-1-rad-15
*Nset, nset=set-empotramiento, instance=largueros-1-rad-2
*Nset, nset=set-empotramiento, instance=largueros-1-rad-6
*Nset, nset=set-empotramiento, instance=largueros-1-rad-10
*Nset, nset=set-empotramiento, instance=largueros-1-rad-14
*Nset, nset=set-empotramiento, instance=largueros-1-rad-4
*Nset, nset=set-empotramiento, instance=largueros-1-rad-12
*Nset, nset=set-empotramiento, instance=largueros-1-rad-8
*Nset, nset=set-empotramiento, instance=largueros-1-rad-16
*Elset, elset=set-empotramiento, instance=fuselaje-1
*Elset, elset=set-empotramiento, instance=largueros-1, generate
*Elset, elset=set-empotramiento, instance=largueros-1-rad-3, generate
*Elset, elset=set-empotramiento, instance=largueros-1-rad-5, generate
*Elset, elset=set-empotramiento, instance=largueros-1-rad-9, generate
*Elset, elset=set-empotramiento, instance=largueros-1-rad-13, generate
*Elset, elset=set-empotramiento, instance=largueros-1-rad-7, generate
*Elset, elset=set-empotramiento, instance=largueros-1-rad-11, generate
*Elset, elset=set-empotramiento, instance=largueros-1-rad-15, generate
*Elset, elset=set-empotramiento, instance=largueros-1-rad-2, generate
*Elset, elset=set-empotramiento, instance=largueros-1-rad-6, generate
*Elset, elset=set-empotramiento, instance=largueros-1-rad-10, generate
*Elset, elset=set-empotramiento, instance=largueros-1-rad-14, generate
*Elset, elset=set-empotramiento, instance=largueros-1-rad-4, generate
*Elset, elset=set-empotramiento, instance=largueros-1-rad-12, generate
*Elset, elset=set-empotramiento, instance=largueros-1-rad-8, generate
*Elset, elset=set-empotramiento, instance=largueros-1-rad-16, generate
*Elset, elset=_Surf-18_E2, internal, instance=fuselaje-2
*Elset, elset=_Surf-18_E4, internal, instance=fuselaje-2, generate
*Surface, type=ELEMENT, name=Surf-18
_Surf-18_E2, E2
_Surf-18_E4, E4
*Elset, elset=_Surf-19_E2, internal, instance=fuselaje-2, generate
*Surface, type=ELEMENT, name=Surf-19
_Surf-19_E2, E2
*Elset, elset=_Surf-20_E2, internal, instance=fuselaje-2
*Elset, elset=_Surf-20_E4, internal, instance=fuselaje-2, generate
*Surface, type=ELEMENT, name=Surf-20
_Surf-20_E2, E2
_Surf-20_E4, E4
*Elset, elset=_Surf-49_E2, internal, instance=fuselaje-2-lin-2-1
*Elset, elset=_Surf-49_E4, internal, instance=fuselaje-2-lin-2-1, generate
*Elset, elset=_Surf-49_E3, internal, instance=largueros-1, generate
*Elset, elset=_Surf-49_E3, internal, instance=largueros-1-rad-3, generate
*Elset, elset=_Surf-49_E3, internal, instance=largueros-1-rad-5, generate
*Elset, elset=_Surf-49_E3, internal, instance=largueros-1-rad-9, generate
*Elset, elset=_Surf-49_E3, internal, instance=largueros-1-rad-13, generate
*Elset, elset=_Surf-49_E3, internal, instance=largueros-1-rad-7, generate
*Elset, elset=_Surf-49_E3, internal, instance=largueros-1-rad-11, generate
*Elset, elset=_Surf-49_E3, internal, instance=largueros-1-rad-15, generate
*Elset, elset=_Surf-49_E3, internal, instance=largueros-1-rad-2, generate
*Elset, elset=_Surf-49_E3, internal, instance=largueros-1-rad-6, generate
*Elset, elset=_Surf-49_E3, internal, instance=largueros-1-rad-10, generate
*Elset, elset=_Surf-49_E3, internal, instance=largueros-1-rad-14, generate
*Elset, elset=_Surf-49_E3, internal, instance=largueros-1-rad-4, generate
*Elset, elset=_Surf-49_E3, internal, instance=largueros-1-rad-12, generate
*Elset, elset=_Surf-49_E3, internal, instance=largueros-1-rad-8, generate
*Elset, elset=_Surf-49_E3, internal, instance=largueros-1-rad-16, generate
*Surface, type=ELEMENT, name=Surf-49
_Surf-49_E2, E2
_Surf-49_E4, E4
_Surf-49_E3, E3
*Elset, elset=_m_Surf-1_SNEG, internal, instance=fuselaje-1, generate
*Surface, type=ELEMENT, name=m_Surf-1
_m_Surf-1_SNEG, SNEG
*Elset, elset=_m_Surf-2_SNEG, internal, instance=fuselaje-1, generate
*Surface, type=ELEMENT, name=m_Surf-2
_m_Surf-2_SNEG, SNEG
*Elset, elset=_m_Surf-4_SNEG, internal, instance=fuselaje-1, generate
*Elset, elset=_m_Surf-4_SNEG, internal, instance=fuselaje-1-lin-2-1, generate
*Elset, elset=_m_Surf-4_SNEG, internal, instance=fuselaje-1-lin-3-1, generate
*Elset, elset=_m_Surf-4_SNEG, internal, instance=fuselaje-1-lin-5-1, generate
*Elset, elset=_m_Surf-4_SNEG, internal, instance=fuselaje-1-lin-4-1, generate
*Elset, elset=_m_Surf-4_SNEG, internal, instance=fuselaje-2, generate
*Surface, type=ELEMENT, name=m_Surf-4
_m_Surf-4_SNEG, SNEG
*Elset, elset=_m_Surf-6_SNEG, internal, instance=fuselaje-1, generate
*Elset, elset=_m_Surf-6_SNEG, internal, instance=fuselaje-1-lin-2-1, generate
*Elset, elset=_m_Surf-6_SNEG, internal, instance=fuselaje-1-lin-3-1, generate
*Elset, elset=_m_Surf-6_SNEG, internal, instance=fuselaje-1-lin-5-1, generate
*Elset, elset=_m_Surf-6_SNEG, internal, instance=fuselaje-1-lin-4-1, generate
*Elset, elset=_m_Surf-6_SNEG, internal, instance=fuselaje-2, generate
*Surface, type=ELEMENT, name=m_Surf-6
_m_Surf-6_SNEG, SNEG
*Elset, elset=_m_Surf-8_E2, internal, instance=fuselaje-1
*Elset, elset=_m_Surf-8_E4, internal, instance=fuselaje-1, generate
*Surface, type=ELEMENT, name=m_Surf-8
_m_Surf-8_E2, E2
_m_Surf-8_E4, E4
*Elset, elset=_m_Surf-10_E2, internal, instance=fuselaje-1-lin-2-1
*Elset, elset=_m_Surf-10_E4, internal, instance=fuselaje-1-lin-2-1, generate
*Surface, type=ELEMENT, name=m_Surf-10
_m_Surf-10_E2, E2
_m_Surf-10_E4, E4
*Elset, elset=_m_Surf-12_E2, internal, instance=fuselaje-1-lin-3-1
*Elset, elset=_m_Surf-12_E4, internal, instance=fuselaje-1-lin-3-1, generate
*Surface, type=ELEMENT, name=m_Surf-12
_m_Surf-12_E2, E2
_m_Surf-12_E4, E4
*Elset, elset=_m_Surf-14_E2, internal, instance=fuselaje-1-lin-4-1
*Elset, elset=_m_Surf-14_E4, internal, instance=fuselaje-1-lin-4-1, generate
*Surface, type=ELEMENT, name=m_Surf-14
_m_Surf-14_E2, E2
_m_Surf-14_E4, E4
*Elset, elset=_m_Surf-16_E2, internal, instance=fuselaje-1-lin-5-1
*Elset, elset=_m_Surf-16_E4, internal, instance=fuselaje-1-lin-5-1, generate
*Surface, type=ELEMENT, name=m_Surf-16
_m_Surf-16_E2, E2
_m_Surf-16_E4, E4
*Elset, elset=_m_Surf-21_E2, internal, instance=fuselaje-1
*Elset, elset=_m_Surf-21_E4, internal, instance=fuselaje-1, generate
*Surface, type=ELEMENT, name=m_Surf-21
_m_Surf-21_E2, E2
_m_Surf-21_E4, E4
*Elset, elset=_m_Surf-23_E2, internal, instance=fuselaje-1-lin-2-1
*Elset, elset=_m_Surf-23_E4, internal, instance=fuselaje-1-lin-2-1, generate
*Surface, type=ELEMENT, name=m_Surf-23
_m_Surf-23_E2, E2
_m_Surf-23_E4, E4
*Elset, elset=_m_Surf-25_E2, internal, instance=fuselaje-1-lin-3-1
*Elset, elset=_m_Surf-25_E4, internal, instance=fuselaje-1-lin-3-1, generate
*Surface, type=ELEMENT, name=m_Surf-25
_m_Surf-25_E2, E2
_m_Surf-25_E4, E4
*Elset, elset=_m_Surf-27_E2, internal, instance=fuselaje-1-lin-4-1
*Elset, elset=_m_Surf-27_E4, internal, instance=fuselaje-1-lin-4-1, generate
*Surface, type=ELEMENT, name=m_Surf-27
_m_Surf-27_E2, E2
_m_Surf-27_E4, E4
*Elset, elset=_m_Surf-29_E2, internal, instance=fuselaje-1-lin-5-1
*Elset, elset=_m_Surf-29_E4, internal, instance=fuselaje-1-lin-5-1, generate
*Surface, type=ELEMENT, name=m_Surf-29
_m_Surf-29_E2, E2
_m_Surf-29_E4, E4
*Elset, elset=_m_Surf-31_E2, internal, instance=fuselaje-2
*Elset, elset=_m_Surf-31_E4, internal, instance=fuselaje-2, generate
*Surface, type=ELEMENT, name=m_Surf-31
_m_Surf-31_E2, E2
_m_Surf-31_E4, E4
*Elset, elset=_m_Surf-33_E2, internal, instance=fuselaje-1-lin-2-1-1
*Elset, elset=_m_Surf-33_E4, internal, instance=fuselaje-1-lin-2-1-1, generate
*Surface, type=ELEMENT, name=m_Surf-33
_m_Surf-33_E2, E2
_m_Surf-33_E4, E4
*Elset, elset=_m_Surf-35_E2, internal, instance=fuselaje-1-lin-2-1-lin-2-1
*Elset, elset=_m_Surf-35_E4, internal, instance=fuselaje-1-lin-2-1-lin-2-1, generate
*Surface, type=ELEMENT, name=m_Surf-35
_m_Surf-35_E2, E2
_m_Surf-35_E4, E4
*Elset, elset=_m_Surf-37_E2, internal, instance=fuselaje-1-lin-3-1-lin-2-1
*Elset, elset=_m_Surf-37_E4, internal, instance=fuselaje-1-lin-3-1-lin-2-1, generate
*Surface, type=ELEMENT, name=m_Surf-37
_m_Surf-37_E2, E2
_m_Surf-37_E4, E4
*Elset, elset=_m_Surf-39_E2, internal, instance=fuselaje-1-lin-4-1-lin-2-1
*Elset, elset=_m_Surf-39_E4, internal, instance=fuselaje-1-lin-4-1-lin-2-1, generate
*Surface, type=ELEMENT, name=m_Surf-39
_m_Surf-39_E2, E2
_m_Surf-39_E4, E4
*Elset, elset=_m_Surf-41_E2, internal, instance=fuselaje-1-lin-5-1-lin-2-1
*Elset, elset=_m_Surf-41_E4, internal, instance=fuselaje-1-lin-5-1-lin-2-1, generate
*Surface, type=ELEMENT, name=m_Surf-41
_m_Surf-41_E2, E2
_m_Surf-41_E4, E4
*Elset, elset=_m_Surf-43_SNEG, internal, instance=fuselaje-1, generate
*Elset, elset=_m_Surf-43_SNEG, internal, instance=fuselaje-1-lin-2-1, generate
*Elset, elset=_m_Surf-43_SNEG, internal, instance=fuselaje-1-lin-3-1, generate
*Elset, elset=_m_Surf-43_SNEG, internal, instance=fuselaje-2-lin-2-1, generate
*Elset, elset=_m_Surf-43_SNEG, internal, instance=fuselaje-1-lin-5-1, generate
*Elset, elset=_m_Surf-43_SNEG, internal, instance=fuselaje-1-lin-2-1-1, generate
*Elset, elset=_m_Surf-43_SNEG, internal, instance=fuselaje-1-lin-4-1-lin-2-1, generate
*Elset, elset=_m_Surf-43_SNEG, internal, instance=fuselaje-1-lin-4-1, generate
*Elset, elset=_m_Surf-43_SNEG, internal, instance=fuselaje-1-lin-3-1-lin-2-1, generate
*Elset, elset=_m_Surf-43_SNEG, internal, instance=fuselaje-2, generate
*Elset, elset=_m_Surf-43_SNEG, internal, instance=fuselaje-1-lin-2-1-lin-2-1, generate
*Elset, elset=_m_Surf-43_SNEG, internal, instance=fuselaje-1-lin-5-1-lin-2-1, generate
*Surface, type=ELEMENT, name=m_Surf-43
_m_Surf-43_SNEG, SNEG
*Elset, elset=_m_Surf-45_SPOS, internal, instance=fuselaje-1, generate
*Elset, elset=_m_Surf-45_SPOS, internal, instance=fuselaje-1-lin-2-1, generate
*Elset, elset=_m_Surf-45_SPOS, internal, instance=fuselaje-1-lin-3-1, generate
*Elset, elset=_m_Surf-45_SPOS, internal, instance=fuselaje-2-lin-2-1, generate
*Elset, elset=_m_Surf-45_SPOS, internal, instance=fuselaje-1-lin-5-1, generate
*Elset, elset=_m_Surf-45_SPOS, internal, instance=fuselaje-1-lin-2-1-1, generate
*Elset, elset=_m_Surf-45_SPOS, internal, instance=fuselaje-1-lin-4-1-lin-2-1, generate
*Elset, elset=_m_Surf-45_SPOS, internal, instance=fuselaje-1-lin-4-1, generate
*Elset, elset=_m_Surf-45_SPOS, internal, instance=fuselaje-1-lin-3-1-lin-2-1, generate
*Elset, elset=_m_Surf-45_SPOS, internal, instance=fuselaje-2, generate
*Elset, elset=_m_Surf-45_SPOS, internal, instance=fuselaje-1-lin-2-1-lin-2-1, generate
*Elset, elset=_m_Surf-45_SPOS, internal, instance=fuselaje-1-lin-5-1-lin-2-1, generate
*Surface, type=ELEMENT, name=m_Surf-45
_m_Surf-45_SPOS, SPOS
*Elset, elset=_m_Surf-47_SPOS, internal, instance=fuselaje-1, generate
*Elset, elset=_m_Surf-47_SPOS, internal, instance=fuselaje-1-lin-2-1, generate
*Elset, elset=_m_Surf-47_SPOS, internal, instance=fuselaje-1-lin-3-1, generate
*Elset, elset=_m_Surf-47_SPOS, internal, instance=fuselaje-2-lin-2-1, generate
*Elset, elset=_m_Surf-47_SPOS, internal, instance=fuselaje-1-lin-5-1, generate
*Elset, elset=_m_Surf-47_SPOS, internal, instance=fuselaje-1-lin-2-1-1, generate
*Elset, elset=_m_Surf-47_SPOS, internal, instance=fuselaje-1-lin-4-1-lin-2-1, generate
*Elset, elset=_m_Surf-47_SPOS, internal, instance=fuselaje-1-lin-4-1, generate
*Elset, elset=_m_Surf-47_SPOS, internal, instance=fuselaje-1-lin-3-1-lin-2-1, generate
*Elset, elset=_m_Surf-47_SPOS, internal, instance=fuselaje-2, generate
*Elset, elset=_m_Surf-47_SPOS, internal, instance=fuselaje-1-lin-2-1-lin-2-1, generate
*Elset, elset=_m_Surf-47_SPOS, internal, instance=fuselaje-1-lin-5-1-lin-2-1, generate
*Surface, type=ELEMENT, name=m_Surf-47
_m_Surf-47_SPOS, SPOS
*Elset, elset=_m_Surf-50_SNEG, internal, instance=fuselaje-1, generate
*Elset, elset=_m_Surf-50_SNEG, internal, instance=fuselaje-1-lin-2-1, generate
*Elset, elset=_m_Surf-50_SNEG, internal, instance=fuselaje-1-lin-3-1, generate
*Elset, elset=_m_Surf-50_SNEG, internal, instance=fuselaje-2-lin-2-1, generate
*Elset, elset=_m_Surf-50_SNEG, internal, instance=fuselaje-1-lin-5-1, generate
*Elset, elset=_m_Surf-50_SNEG, internal, instance=fuselaje-1-lin-2-1-1, generate
*Elset, elset=_m_Surf-50_SNEG, internal, instance=fuselaje-1-lin-4-1-lin-2-1, generate
*Elset, elset=_m_Surf-50_SNEG, internal, instance=fuselaje-1-lin-4-1, generate
*Elset, elset=_m_Surf-50_SNEG, internal, instance=fuselaje-1-lin-3-1-lin-2-1, generate
*Elset, elset=_m_Surf-50_SNEG, internal, instance=fuselaje-2, generate
*Elset, elset=_m_Surf-50_SNEG, internal, instance=fuselaje-1-lin-2-1-lin-2-1, generate
*Elset, elset=_m_Surf-50_SNEG, internal, instance=fuselaje-1-lin-5-1-lin-2-1, generate
*Surface, type=ELEMENT, name=m_Surf-50
_m_Surf-50_SNEG, SNEG
*Elset, elset=_s_Surf-2_SNEG, internal, instance=fuselaje-1-lin-2-1, generate
*Elset, elset=_s_Surf-2_SNEG, internal, instance=fuselaje-1-lin-3-1, generate
*Elset, elset=_s_Surf-2_SNEG, internal, instance=fuselaje-1-lin-5-1, generate
*Elset, elset=_s_Surf-2_SNEG, internal, instance=fuselaje-1-lin-4-1, generate
*Elset, elset=_s_Surf-2_SNEG, internal, instance=fuselaje-2, generate
*Surface, type=ELEMENT, name=s_Surf-2
_s_Surf-2_SNEG, SNEG
*Elset, elset=_s_Surf-4_SPOS, internal, instance=cuaderna-1
*Elset, elset=_s_Surf-4_SPOS, internal, instance=cuaderna-1-lin-2-1
*Elset, elset=_s_Surf-4_SPOS, internal, instance=cuaderna-1-lin-3-1
*Elset, elset=_s_Surf-4_SPOS, internal, instance=cuaderna-1-lin-5-1
*Elset, elset=_s_Surf-4_SPOS, internal, instance=cuaderna-1-lin-4-1
*Elset, elset=_s_Surf-4_SNEG, internal, instance=cuaderna-1
*Elset, elset=_s_Surf-4_SNEG, internal, instance=cuaderna-1-lin-2-1
*Elset, elset=_s_Surf-4_SNEG, internal, instance=cuaderna-1-lin-3-1
*Elset, elset=_s_Surf-4_SNEG, internal, instance=cuaderna-1-lin-5-1
*Elset, elset=_s_Surf-4_SNEG, internal, instance=cuaderna-1-lin-4-1
*Surface, type=ELEMENT, name=s_Surf-4
_s_Surf-4_SPOS, SPOS
_s_Surf-4_SNEG, SNEG
*Elset, elset=_s_Surf-8_E4, internal, instance=fuselaje-1-lin-2-1
*Elset, elset=_s_Surf-8_E2, internal, instance=fuselaje-1-lin-2-1, generate
*Surface, type=ELEMENT, name=s_Surf-8
_s_Surf-8_E4, E4
_s_Surf-8_E2, E2
*Elset, elset=_s_Surf-10_E4, internal, instance=fuselaje-1-lin-3-1
*Elset, elset=_s_Surf-10_E2, internal, instance=fuselaje-1-lin-3-1, generate
*Surface, type=ELEMENT, name=s_Surf-10
_s_Surf-10_E4, E4
_s_Surf-10_E2, E2
*Elset, elset=_s_Surf-12_E4, internal, instance=fuselaje-1-lin-4-1
*Elset, elset=_s_Surf-12_E2, internal, instance=fuselaje-1-lin-4-1, generate
*Surface, type=ELEMENT, name=s_Surf-12
_s_Surf-12_E4, E4
_s_Surf-12_E2, E2
*Elset, elset=_s_Surf-14_E4, internal, instance=fuselaje-1-lin-5-1
*Elset, elset=_s_Surf-14_E2, internal, instance=fuselaje-1-lin-5-1, generate
*Surface, type=ELEMENT, name=s_Surf-14
_s_Surf-14_E4, E4
_s_Surf-14_E2, E2
*Elset, elset=_s_Surf-16_E4, internal, instance=fuselaje-2
*Elset, elset=_s_Surf-16_E2, internal, instance=fuselaje-2, generate
*Surface, type=ELEMENT, name=s_Surf-16
_s_Surf-16_E4, E4
_s_Surf-16_E2, E2
*Elset, elset=_s_Surf-21_E4, internal, instance=fuselaje-1-lin-2-1
*Elset, elset=_s_Surf-21_E2, internal, instance=fuselaje-1-lin-2-1, generate
*Surface, type=ELEMENT, name=s_Surf-21
_s_Surf-21_E4, E4
_s_Surf-21_E2, E2
*Elset, elset=_s_Surf-23_E4, internal, instance=fuselaje-1-lin-3-1
*Elset, elset=_s_Surf-23_E2, internal, instance=fuselaje-1-lin-3-1, generate
*Surface, type=ELEMENT, name=s_Surf-23
_s_Surf-23_E4, E4
_s_Surf-23_E2, E2
*Elset, elset=_s_Surf-25_E4, internal, instance=fuselaje-1-lin-4-1
*Elset, elset=_s_Surf-25_E2, internal, instance=fuselaje-1-lin-4-1, generate
*Surface, type=ELEMENT, name=s_Surf-25
_s_Surf-25_E4, E4
_s_Surf-25_E2, E2
*Elset, elset=_s_Surf-27_E4, internal, instance=fuselaje-1-lin-5-1
*Elset, elset=_s_Surf-27_E2, internal, instance=fuselaje-1-lin-5-1, generate
*Surface, type=ELEMENT, name=s_Surf-27
_s_Surf-27_E4, E4
_s_Surf-27_E2, E2
*Elset, elset=_s_Surf-29_E4, internal, instance=fuselaje-2
*Elset, elset=_s_Surf-29_E2, internal, instance=fuselaje-2, generate
*Surface, type=ELEMENT, name=s_Surf-29
_s_Surf-29_E4, E4
_s_Surf-29_E2, E2
*Elset, elset=_s_Surf-31_E4, internal, instance=fuselaje-1-lin-2-1-1
*Elset, elset=_s_Surf-31_E2, internal, instance=fuselaje-1-lin-2-1-1, generate
*Surface, type=ELEMENT, name=s_Surf-31
_s_Surf-31_E4, E4
_s_Surf-31_E2, E2
*Elset, elset=_s_Surf-33_E4, internal, instance=fuselaje-1-lin-2-1-lin-2-1
*Elset, elset=_s_Surf-33_E2, internal, instance=fuselaje-1-lin-2-1-lin-2-1, generate
*Surface, type=ELEMENT, name=s_Surf-33
_s_Surf-33_E4, E4
_s_Surf-33_E2, E2
*Elset, elset=_s_Surf-35_E4, internal, instance=fuselaje-1-lin-3-1-lin-2-1
*Elset, elset=_s_Surf-35_E2, internal, instance=fuselaje-1-lin-3-1-lin-2-1, generate
*Surface, type=ELEMENT, name=s_Surf-35
_s_Surf-35_E4, E4
_s_Surf-35_E2, E2
*Elset, elset=_s_Surf-37_E4, internal, instance=fuselaje-1-lin-4-1-lin-2-1
*Elset, elset=_s_Surf-37_E2, internal, instance=fuselaje-1-lin-4-1-lin-2-1, generate
*Surface, type=ELEMENT, name=s_Surf-37
_s_Surf-37_E4, E4
_s_Surf-37_E2, E2
*Elset, elset=_s_Surf-39_E4, internal, instance=fuselaje-1-lin-5-1-lin-2-1
*Elset, elset=_s_Surf-39_E2, internal, instance=fuselaje-1-lin-5-1-lin-2-1, generate
*Surface, type=ELEMENT, name=s_Surf-39
_s_Surf-39_E4, E4
_s_Surf-39_E2, E2
*Elset, elset=_s_Surf-41_E4, internal, instance=fuselaje-2-lin-2-1
*Elset, elset=_s_Surf-41_E2, internal, instance=fuselaje-2-lin-2-1, generate
*Surface, type=ELEMENT, name=s_Surf-41
_s_Surf-41_E4, E4
_s_Surf-41_E2, E2
*Elset, elset=_s_Surf-43_SPOS, internal, instance=cuaderna-1
*Elset, elset=_s_Surf-43_SPOS, internal, instance=cuaderna-1-lin-2-1
*Elset, elset=_s_Surf-43_SPOS, internal, instance=cuaderna-1-lin-3-1
*Elset, elset=_s_Surf-43_SPOS, internal, instance=cuaderna-1-lin-2-1-1
*Elset, elset=_s_Surf-43_SPOS, internal, instance=cuaderna-1-lin-4-1-lin-2-1
*Elset, elset=_s_Surf-43_SPOS, internal, instance=cuaderna-1-lin-5-1
*Elset, elset=_s_Surf-43_SPOS, internal, instance=cuaderna-1-lin-2-1-lin-2-1
*Elset, elset=_s_Surf-43_SPOS, internal, instance=cuaderna-1-lin-4-1
*Elset, elset=_s_Surf-43_SPOS, internal, instance=cuaderna-2
*Elset, elset=_s_Surf-43_SPOS, internal, instance=cuaderna-1-lin-5-1-lin-2-1
*Elset, elset=_s_Surf-43_SPOS, internal, instance=cuaderna-1-lin-3-1-lin-2-1
*Elset, elset=_s_Surf-43_SNEG, internal, instance=cuaderna-1
*Elset, elset=_s_Surf-43_SNEG, internal, instance=cuaderna-1-lin-2-1
*Elset, elset=_s_Surf-43_SNEG, internal, instance=cuaderna-1-lin-3-1
*Elset, elset=_s_Surf-43_SNEG, internal, instance=cuaderna-1-lin-2-1-1
*Elset, elset=_s_Surf-43_SNEG, internal, instance=cuaderna-1-lin-4-1-lin-2-1
*Elset, elset=_s_Surf-43_SNEG, internal, instance=cuaderna-1-lin-5-1
*Elset, elset=_s_Surf-43_SNEG, internal, instance=cuaderna-1-lin-2-1-lin-2-1
*Elset, elset=_s_Surf-43_SNEG, internal, instance=cuaderna-1-lin-4-1
*Elset, elset=_s_Surf-43_SNEG, internal, instance=cuaderna-2
*Elset, elset=_s_Surf-43_SNEG, internal, instance=cuaderna-1-lin-5-1-lin-2-1
*Elset, elset=_s_Surf-43_SNEG, internal, instance=cuaderna-1-lin-3-1-lin-2-1
*Surface, type=ELEMENT, name=s_Surf-43
_s_Surf-43_SPOS, SPOS
_s_Surf-43_SNEG, SNEG
*Elset, elset=_s_Surf-47_SNEG, internal, instance=largueros-1, generate
*Elset, elset=_s_Surf-47_SNEG, internal, instance=largueros-1-rad-2, generate
*Elset, elset=_s_Surf-47_SNEG, internal, instance=largueros-1-rad-3, generate
*Elset, elset=_s_Surf-47_SNEG, internal, instance=largueros-1-rad-5, generate
*Elset, elset=_s_Surf-47_SNEG, internal, instance=largueros-1-rad-9, generate
*Elset, elset=_s_Surf-47_SNEG, internal, instance=largueros-1-rad-13, generate
*Elset, elset=_s_Surf-47_SNEG, internal, instance=largueros-1-rad-7, generate
*Elset, elset=_s_Surf-47_SNEG, internal, instance=largueros-1-rad-11, generate
*Elset, elset=_s_Surf-47_SNEG, internal, instance=largueros-1-rad-15, generate
*Elset, elset=_s_Surf-47_SNEG, internal, instance=largueros-1-rad-4, generate
*Elset, elset=_s_Surf-47_SNEG, internal, instance=largueros-1-rad-6, generate
*Elset, elset=_s_Surf-47_SNEG, internal, instance=largueros-1-rad-10, generate
*Elset, elset=_s_Surf-47_SNEG, internal, instance=largueros-1-rad-14, generate
*Elset, elset=_s_Surf-47_SNEG, internal, instance=largueros-1-rad-8, generate
*Elset, elset=_s_Surf-47_SNEG, internal, instance=largueros-1-rad-12, generate
*Elset, elset=_s_Surf-47_SNEG, internal, instance=largueros-1-rad-16, generate
*Surface, type=ELEMENT, name=s_Surf-47
_s_Surf-47_SNEG, SNEG
*Elset, elset=_s_Surf-50_SPOS, internal, instance=cuaderna-1
*Elset, elset=_s_Surf-50_SPOS, internal, instance=cuaderna-1-lin-2-1
*Elset, elset=_s_Surf-50_SPOS, internal, instance=cuaderna-1-lin-3-1
*Elset, elset=_s_Surf-50_SPOS, internal, instance=cuaderna-1-lin-2-1-1
*Elset, elset=_s_Surf-50_SPOS, internal, instance=cuaderna-1-lin-4-1-lin-2-1
*Elset, elset=_s_Surf-50_SPOS, internal, instance=cuaderna-1-lin-5-1
*Elset, elset=_s_Surf-50_SPOS, internal, instance=cuaderna-1-lin-2-1-lin-2-1
*Elset, elset=_s_Surf-50_SPOS, internal, instance=cuaderna-1-lin-4-1
*Elset, elset=_s_Surf-50_SPOS, internal, instance=cuaderna-2
*Elset, elset=_s_Surf-50_SPOS, internal, instance=cuaderna-1-lin-5-1-lin-2-1
*Elset, elset=_s_Surf-50_SPOS, internal, instance=cuaderna-1-lin-3-1-lin-2-1
*Elset, elset=_s_Surf-50_SNEG, internal, instance=cuaderna-1
*Elset, elset=_s_Surf-50_SNEG, internal, instance=cuaderna-1-lin-2-1
*Elset, elset=_s_Surf-50_SNEG, internal, instance=cuaderna-1-lin-3-1
*Elset, elset=_s_Surf-50_SNEG, internal, instance=cuaderna-1-lin-2-1-1
*Elset, elset=_s_Surf-50_SNEG, internal, instance=cuaderna-1-lin-4-1-lin-2-1
*Elset, elset=_s_Surf-50_SNEG, internal, instance=cuaderna-1-lin-5-1
*Elset, elset=_s_Surf-50_SNEG, internal, instance=cuaderna-1-lin-2-1-lin-2-1
*Elset, elset=_s_Surf-50_SNEG, internal, instance=cuaderna-1-lin-4-1
*Elset, elset=_s_Surf-50_SNEG, internal, instance=cuaderna-2
*Elset, elset=_s_Surf-50_SNEG, internal, instance=cuaderna-1-lin-5-1-lin-2-1
*Elset, elset=_s_Surf-50_SNEG, internal, instance=cuaderna-1-lin-3-1-lin-2-1
*Surface, type=ELEMENT, name=s_Surf-50
_s_Surf-50_SPOS, SPOS
_s_Surf-50_SNEG, SNEG
** Constraint: carga-x
*Equation
set-carga, 1, 1.
carga, 1, 1.
** Constraint: carga-y
*Equation
set-carga, 2, 1.
carga, 2, -1.
** Constraint: carga-z
*Equation
set-carga, 3, 1.
carga, 3, -1.
** Constraint: empotramiento-x
*Equation
set-empotramiento, 1, 1.
empotramiento, 1, -1.
** Constraint: empotramiento-y
*Equation
set-empotramiento, 2, 1.
empotramiento, 2, -1.
** Constraint: empotramiento-z
*Equation
set-empotramiento, 3, 1.
empotramiento, 3, -1.
** Constraint: tie-fuselaje-1
*Tie, name=tie-fuselaje-1, adjust=yes
s_Surf-21, m_Surf-21
** Constraint: tie-fuselaje-2
*Tie, name=tie-fuselaje-2, adjust=yes
s_Surf-23, m_Surf-23
** Constraint: tie-fuselaje-3
*Tie, name=tie-fuselaje-3, adjust=yes
s_Surf-25, m_Surf-25
** Constraint: tie-fuselaje-5
*Tie, name=tie-fuselaje-5, adjust=yes
s_Surf-27, m_Surf-27
** Constraint: tie-fuselaje-6
*Tie, name=tie-fuselaje-6, adjust=yes
s_Surf-29, m_Surf-29
** Constraint: tie-fuselaje-7
*Tie, name=tie-fuselaje-7, adjust=yes
s_Surf-31, m_Surf-31
** Constraint: tie-fuselaje-8
*Tie, name=tie-fuselaje-8, adjust=yes
s_Surf-33, m_Surf-33
** Constraint: tie-fuselaje-9
*Tie, name=tie-fuselaje-9, adjust=yes
s_Surf-35, m_Surf-35
** Constraint: tie-fuselaje-10
*Tie, name=tie-fuselaje-10, adjust=yes
s_Surf-37, m_Surf-37
** Constraint: tie-fuselaje-11
*Tie, name=tie-fuselaje-11, adjust=yes
s_Surf-39, m_Surf-39
** Constraint: tie-fuselaje-12
*Tie, name=tie-fuselaje-12, adjust=yes
s_Surf-41, m_Surf-41
** Constraint: tie-fuselaje-cuaderna
*Tie, name=tie-fuselaje-cuaderna, adjust=yes
m_Surf-50, s_Surf-50
** Constraint: tie-fuselaje-larguero
*Tie, name=tie-fuselaje-larguero, adjust=yes, position tolerance=400., no thickness
m_Surf-47, s_Surf-47
*End Assembly
**
** MATERIALS
**
*Material, name=aluminio
*Density
 2.77e-09,
*Elastic
74858., 0.3
*Plastic, hardening=JOHNSON COOK
369., 684., 0.73,  1.7,   0.,   0.
*Rate Dependent, type=JOHNSON COOK
**
** BOUNDARY CONDITIONS
**
** Name: empotramiento Type: Symmetry/Antisymmetry/Encastre
*Boundary
Set-7, ENCASTRE
** ----------------------------------------------------------------
**
** STEP: Step-1
**
*Step, name=Step-1, nlgeom=NO, perturbation
*Buckle
10, , 18, 1000
**
** BOUNDARY CONDITIONS
**
** Name: empotramiento Type: Symmetry/Antisymmetry/Encastre
*Boundary, op=NEW, load case=1
Set-7, ENCASTRE
*Boundary, op=NEW, load case=2
Set-7, ENCASTRE
**
** LOADS
**
** Name: Load-1   Type: Concentrated force
*Cload
Set-9, 3, 0.00318
**
** OUTPUT REQUESTS
**
*Restart, write, frequency=0
**
** FIELD OUTPUT: F-Output-1
**
*Output, field
*Node Output
U,
*Element Output, directions=YES
ALPHA, CS11, CTSHR, E, EE, EEQUT, ELEDEN, ELEN, ENER, ER, IE, LE, MISES, MISESMAX, MISESONLY, NE
PE, PEEQ, PEEQMAX, PEEQT, PEMAG, PEQC, PRESSONLY, PS, S, SALPHA, SE, SEE, SEP, SEPE, SEQUT, SPE
SSAVG, TE, TEEQ, TEVOL, THE, TRIAX, TSHR, VE, VEEQ, VS
*End Step