{"text_format":"1","workbook":"xlsx","n_sheets":12,"sheets":["CUENTAS CONTABLES","PROGRAMAS","Instrucciones","1. Autorización","TABLAS DE VIATICOS AUTORIZADOS ","2. Solicitud Cheque","3. Liquidación","3.1 Recibo Vehículo","3.2 Recibo Alimen al Extranjero","TABLA CALCULOS","Sol cheque complemento","Password"],"not_rendered":{"charts":0,"images":4,"macros":1,"external_links":5,"defined_names":38,"comments":3,"pivot_tables":0},"unopened":[],"bounds":{"document_bytes":16777216,"sheet_cells":100000,"rows_first":2000,"rows_last":500,"rows_between":2000,"halvings":0,"cell_chars":16384,"cell_head_chars":4096},"cells_cut":0,"cells_raw":0,"read":"whole","date_system":"1900"}

{"sheet":"CUENTAS CONTABLES","index":0,"n_rows":495,"n_cols":6,"rows_kept":495,"cut":false,"hidden":true,"merged":[[0,0,0,1]]}
["CENTRAL",null,"ALTIPLANO","SUR","CAS","DEFINITIVA"]
["Descripción cuenta","Número de cuenta","Número de cuenta","Número de cuenta","Número de cuenta","Número de cuenta"]
["ACREEDORES EXTRANJEROS","1-2-1-001-02-02","4-2-1-001-02-02","3-2-1-001-02-02","7-2-1-001-02-02",{"$f":"IF('1. Autorización'!$I$6=\"Altiplano\",'CUENTAS CONTABLES'!C3,IF('1. Autorización'!$I$6=\"Sur\",'CUENTAS CONTABLES'!D3,IF('1. Autorización'!$I$6=\"Colegio Americano del Sur\",'CUENTAS CONTABLES'!E3,'CUENTAS CONTABLES'!B3)))","v":"1-2-1-001-02-02"}]
["ACREEDORES INVENTARIO COLLEGE BOARD","1-2-1-001-02-03","4-2-1-001-02-03","3-2-1-001-02-03","7-2-1-001-02-03",{"$f":"IF('1. Autorización'!$I$6=\"Altiplano\",'CUENTAS CONTABLES'!C4,IF('1. Autorización'!$I$6=\"Sur\",'CUENTAS CONTABLES'!D4,IF('1. Autorización'!$I$6=\"Colegio Americano del Sur\",'CUENTAS CONTABLES'!E4,'CUENTAS CONTABLES'!B4)))","v":"1-2-1-001-02-03"}]
["ACREEDORES LOCALES","1-2-1-001-02-01","4-2-1-001-02-01","3-2-1-001-02-01","7-2-1-001-02-01",{"$f":"IF('1. Autorización'!$I$6=\"Altiplano\",'CUENTAS CONTABLES'!C5,IF('1. Autorización'!$I$6=\"Sur\",'CUENTAS CONTABLES'!D5,IF('1. Autorización'!$I$6=\"Colegio Americano del Sur\",'CUENTAS CONTABLES'!E5,'CUENTAS CONTABLES'!B5)))","v":"1-2-1-001-02-01"}]
["ACTIVIDADES DIVERSAS","1-6-1-005-02-07","4-6-1-005-02-07","3-6-1-005-02-07","7-6-1-005-02-07",{"$f":"IF('1. Autorización'!$I$6=\"Altiplano\",'CUENTAS CONTABLES'!C6,IF('1. Autorización'!$I$6=\"Sur\",'CUENTAS CONTABLES'!D6,IF('1. Autorización'!$I$6=\"Colegio Americano del Sur\",'CUENTAS CONTABLES'!E6,'CUENTAS CONTABLES'!B6)))","v":"1-6-1-005-02-07"}]
["ACTIVOS EN DONACION (SIN PRESUPUESTO)","1-1-3-001-09-02","4-1-3-001-09-02","3-1-3-001-09-02","7-1-3-001-09-02",{"$f":"IF('1. Autorización'!$I$6=\"Altiplano\",'CUENTAS CONTABLES'!C7,IF('1. Autorización'!$I$6=\"Sur\",'CUENTAS CONTABLES'!D7,IF('1. Autorización'!$I$6=\"Colegio Americano del Sur\",'CUENTAS CONTABLES'!E7,'CUENTAS CONTABLES'!B7)))","v":"1-1-3-001-09-02"}]
["ACTIVOS FIJOS EN TRANSITO","1-1-3-001-09-01","4-1-3-001-09-01","3-1-3-001-09-01","7-1-3-001-09-01",{"$f":"IF('1. Autorización'!$I$6=\"Altiplano\",'CUENTAS CONTABLES'!C8,IF('1. Autorización'!$I$6=\"Sur\",'CUENTAS CONTABLES'!D8,IF('1. Autorización'!$I$6=\"Colegio Americano del Sur\",'CUENTAS CONTABLES'!E8,'CUENTAS CONTABLES'!B8)))","v":"1-1-3-001-09-01"}]
["ADMINISTRACION DE PROYECTOS","1-5-1-004-02-06","4-5-1-004-02-06","3-5-1-004-02-06","7-5-1-004-02-06",{"$f":"IF('1. Autorización'!$I$6=\"Altiplano\",'CUENTAS CONTABLES'!C9,IF('1. Autorización'!$I$6=\"Sur\",'CUENTAS CONTABLES'!D9,IF('1. Autorización'!$I$6=\"Colegio Americano del Sur\",'CUENTAS CONTABLES'!E9,'CUENTAS CONTABLES'!B9)))","v":"1-5-1-004-02-06"}]
["AGROMERCANTIL NO RESTRINGIDO  (INT X COB INV)","1-1-1-003-08-23","4-1-1-003-08-23","3-1-1-003-08-23","7-1-1-003-08-23",{"$f":"IF('1. Autorización'!$I$6=\"Altiplano\",'CUENTAS CONTABLES'!C10,IF('1. Autorización'!$I$6=\"Sur\",'CUENTAS CONTABLES'!D10,IF('1. Autorización'!$I$6=\"Colegio Americano del Sur\",'CUENTAS CONTABLES'!E10,'CUENTAS CONTABLES'!B10)))","v":"1-1-1-003-08-23"}]
["AGROMERCANTIL TEM RESTRIN (INT X COB INV)","1-1-1-003-08-24","4-1-1-003-08-24","3-1-1-003-08-24","7-1-1-003-08-24",{"$f":"IF('1. Autorización'!$I$6=\"Altiplano\",'CUENTAS CONTABLES'!C11,IF('1. Autorización'!$I$6=\"Sur\",'CUENTAS CONTABLES'!D11,IF('1. Autorización'!$I$6=\"Colegio Americano del Sur\",'CUENTAS CONTABLES'!E11,'CUENTAS CONTABLES'!B11)))","v":"1-1-1-003-08-24"}]
["AGUINALDO","1-6-1-001-03-04","4-6-1-001-03-04","3-6-1-001-03-04","7-6-1-001-03-04",{"$f":"IF('1. Autorización'!$I$6=\"Altiplano\",'CUENTAS CONTABLES'!C12,IF('1. Autorización'!$I$6=\"Sur\",'CUENTAS CONTABLES'!D12,IF('1. Autorización'!$I$6=\"Colegio Americano del Sur\",'CUENTAS CONTABLES'!E12,'CUENTAS CONTABLES'!B12)))","v":"1-6-1-001-03-04"}]
["ALOJAMIENTO","1-6-1-007-02-02","4-6-1-007-02-02","3-6-1-007-02-02","7-6-1-007-02-02",{"$f":"IF('1. Autorización'!$I$6=\"Altiplano\",'CUENTAS CONTABLES'!C13,IF('1. Autorización'!$I$6=\"Sur\",'CUENTAS CONTABLES'!D13,IF('1. Autorización'!$I$6=\"Colegio Americano del Sur\",'CUENTAS CONTABLES'!E13,'CUENTAS CONTABLES'!B13)))","v":"1-6-1-007-02-02"}]
["AMORT ACUM EDIFICIOS E INSTALACIONES CONSTRUIDOS","1-1-4-001-03-98","4-1-4-001-03-98","3-1-4-001-03-98","7-1-4-001-03-98",{"$f":"IF('1. Autorización'!$I$6=\"Altiplano\",'CUENTAS CONTABLES'!C14,IF('1. Autorización'!$I$6=\"Sur\",'CUENTAS CONTABLES'!D14,IF('1. Autorización'!$I$6=\"Colegio Americano del Sur\",'CUENTAS CONTABLES'!E14,'CUENTAS CONTABLES'!B14)))","v":"1-1-4-001-03-98"}]
["AMORT ACUM REMODELACIONES","1-1-4-001-03-99","4-1-4-001-03-99","3-1-4-001-03-99","7-1-4-001-03-99",{"$f":"IF('1. Autorización'!$I$6=\"Altiplano\",'CUENTAS CONTABLES'!C15,IF('1. Autorización'!$I$6=\"Sur\",'CUENTAS CONTABLES'!D15,IF('1. Autorización'!$I$6=\"Colegio Americano del Sur\",'CUENTAS CONTABLES'!E15,'CUENTAS CONTABLES'!B15)))","v":"1-1-4-001-03-99"}]
["AMORT. INVERSION MONETARIA EN MONEDA LOCAL (FNR)","1-1-2-001-03-02","4-1-2-001-03-02","3-1-2-001-03-02","7-1-2-001-03-02",{"$f":"IF('1. Autorización'!$I$6=\"Altiplano\",'CUENTAS CONTABLES'!C16,IF('1. Autorización'!$I$6=\"Sur\",'CUENTAS CONTABLES'!D16,IF('1. Autorización'!$I$6=\"Colegio Americano del Sur\",'CUENTAS CONTABLES'!E16,'CUENTAS CONTABLES'!B16)))","v":"1-1-2-001-03-02"}]
["AMORT. INVERSION MONETARIA EN MONEDA LOCAL (FTR)","1-1-2-001-03-06","4-1-2-001-03-06","3-1-2-001-03-06","7-1-2-001-03-06",{"$f":"IF('1. Autorización'!$I$6=\"Altiplano\",'CUENTAS CONTABLES'!C17,IF('1. Autorización'!$I$6=\"Sur\",'CUENTAS CONTABLES'!D17,IF('1. Autorización'!$I$6=\"Colegio Americano del Sur\",'CUENTAS CONTABLES'!E17,'CUENTAS CONTABLES'!B17)))","v":"1-1-2-001-03-06"}]
["AMORT. INVERSION MONETARIA EN MONEDA LOCAL (PROYE)","1-1-2-001-03-04","4-1-2-001-03-04","3-1-2-001-03-04","7-1-2-001-03-04",{"$f":"IF('1. Autorización'!$I$6=\"Altiplano\",'CUENTAS CONTABLES'!C18,IF('1. Autorización'!$I$6=\"Sur\",'CUENTAS CONTABLES'!D18,IF('1. Autorización'!$I$6=\"Colegio Americano del Sur\",'CUENTAS CONTABLES'!E18,'CUENTAS CONTABLES'!B18)))","v":"1-1-2-001-03-04"}]
["AMORT. INVERSION MONETARIA MONEDA EXTRANJERA (FNR)","1-1-2-001-04-02","4-1-2-001-04-02","3-1-2-001-04-02","7-1-2-001-04-02",{"$f":"IF('1. Autorización'!$I$6=\"Altiplano\",'CUENTAS CONTABLES'!C19,IF('1. Autorización'!$I$6=\"Sur\",'CUENTAS CONTABLES'!D19,IF('1. Autorización'!$I$6=\"Colegio Americano del Sur\",'CUENTAS CONTABLES'!E19,'CUENTAS CONTABLES'!B19)))","v":"1-1-2-001-04-02"}]
["AMORT. INVERSION MONETARIA MONEDA EXTRANJERA (FTR)","1-1-2-001-04-06","4-1-2-001-04-06","3-1-2-001-04-06","7-1-2-001-04-06",{"$f":"IF('1. Autorización'!$I$6=\"Altiplano\",'CUENTAS CONTABLES'!C20,IF('1. Autorización'!$I$6=\"Sur\",'CUENTAS CONTABLES'!D20,IF('1. Autorización'!$I$6=\"Colegio Americano del Sur\",'CUENTAS CONTABLES'!E20,'CUENTAS CONTABLES'!B20)))","v":"1-1-2-001-04-06"}]
["AMORT. INVERSION MONETARIA MONEDA EXTRANJERA (PRO)","1-1-2-001-04-04","4-1-2-001-04-04","3-1-2-001-04-04","7-1-2-001-04-04",{"$f":"IF('1. Autorización'!$I$6=\"Altiplano\",'CUENTAS CONTABLES'!C21,IF('1. Autorización'!$I$6=\"Sur\",'CUENTAS CONTABLES'!D21,IF('1. Autorización'!$I$6=\"Colegio Americano del Sur\",'CUENTAS CONTABLES'!E21,'CUENTAS CONTABLES'!B21)))","v":"1-1-2-001-04-04"}]
["AMORTIZACIONES","1-6-1-005-02-19","4-6-1-005-02-19","3-6-1-005-02-19","7-6-1-005-02-19",{"$f":"IF('1. Autorización'!$I$6=\"Altiplano\",'CUENTAS CONTABLES'!C22,IF('1. Autorización'!$I$6=\"Sur\",'CUENTAS CONTABLES'!D22,IF('1. Autorización'!$I$6=\"Colegio Americano del Sur\",'CUENTAS CONTABLES'!E22,'CUENTAS CONTABLES'!B22)))","v":"1-6-1-005-02-19"}]
["ANTICIPO A PROVEEDORES","1-1-4-001-01-01","4-1-4-001-01-01","3-1-4-001-01-01","7-1-4-001-01-01",{"$f":"IF('1. Autorización'!$I$6=\"Altiplano\",'CUENTAS CONTABLES'!C23,IF('1. Autorización'!$I$6=\"Sur\",'CUENTAS CONTABLES'!D23,IF('1. Autorización'!$I$6=\"Colegio Americano del Sur\",'CUENTAS CONTABLES'!E23,'CUENTAS CONTABLES'!B23)))","v":"1-1-4-001-01-01"}]
["APORTACIONES","1-5-1-002-03-01","4-5-1-002-03-01","3-5-1-002-03-01","7-5-1-002-03-01",{"$f":"IF('1. Autorización'!$I$6=\"Altiplano\",'CUENTAS CONTABLES'!C24,IF('1. Autorización'!$I$6=\"Sur\",'CUENTAS CONTABLES'!D24,IF('1. Autorización'!$I$6=\"Colegio Americano del Sur\",'CUENTAS CONTABLES'!E24,'CUENTAS CONTABLES'!B24)))","v":"1-5-1-002-03-01"}]
["APORTE FUNDACION","1-6-1-005-02-04","4-6-1-005-02-04","3-6-1-005-02-04","7-6-1-005-02-04",{"$f":"IF('1. Autorización'!$I$6=\"Altiplano\",'CUENTAS CONTABLES'!C25,IF('1. Autorización'!$I$6=\"Sur\",'CUENTAS CONTABLES'!D25,IF('1. Autorización'!$I$6=\"Colegio Americano del Sur\",'CUENTAS CONTABLES'!E25,'CUENTAS CONTABLES'!B25)))","v":"1-6-1-005-02-04"}]
["APORTES ESCOLARES","1-5-1-002-03-02","4-5-1-002-03-02","3-5-1-002-03-02","7-5-1-002-03-02",{"$f":"IF('1. Autorización'!$I$6=\"Altiplano\",'CUENTAS CONTABLES'!C26,IF('1. Autorización'!$I$6=\"Sur\",'CUENTAS CONTABLES'!D26,IF('1. Autorización'!$I$6=\"Colegio Americano del Sur\",'CUENTAS CONTABLES'!E26,'CUENTAS CONTABLES'!B26)))","v":"1-5-1-002-03-02"}]
["APORTES ESCOLARES ANTICIPADOS","1-2-1-008-01-01","4-2-1-008-01-01","3-2-1-008-01-01","7-2-1-008-01-01",{"$f":"IF('1. Autorización'!$I$6=\"Altiplano\",'CUENTAS CONTABLES'!C27,IF('1. Autorización'!$I$6=\"Sur\",'CUENTAS CONTABLES'!D27,IF('1. Autorización'!$I$6=\"Colegio Americano del Sur\",'CUENTAS CONTABLES'!E27,'CUENTAS CONTABLES'!B27)))","v":"1-2-1-008-01-01"}]
["ARMARIO","1-5-1-001-02-07","4-5-1-001-02-07","3-5-1-001-02-07","7-5-1-001-02-07",{"$f":"IF('1. Autorización'!$I$6=\"Altiplano\",'CUENTAS CONTABLES'!C28,IF('1. Autorización'!$I$6=\"Sur\",'CUENTAS CONTABLES'!D28,IF('1. Autorización'!$I$6=\"Colegio Americano del Sur\",'CUENTAS CONTABLES'!E28,'CUENTAS CONTABLES'!B28)))","v":"1-5-1-001-02-07"}]
["ARRENDAMIENTOS ","1-6-1-003-02-01","4-6-1-003-02-01","3-6-1-003-02-01","7-6-1-003-02-01",{"$f":"IF('1. Autorización'!$I$6=\"Altiplano\",'CUENTAS CONTABLES'!C29,IF('1. Autorización'!$I$6=\"Sur\",'CUENTAS CONTABLES'!D29,IF('1. Autorización'!$I$6=\"Colegio Americano del Sur\",'CUENTAS CONTABLES'!E29,'CUENTAS CONTABLES'!B29)))","v":"1-6-1-003-02-01"}]
["ARTICULOS PROMOCIONALES","1-5-1-004-02-02","4-5-1-004-02-02","3-5-1-004-02-02","7-5-1-004-02-02",{"$f":"IF('1. Autorización'!$I$6=\"Altiplano\",'CUENTAS CONTABLES'!C30,IF('1. Autorización'!$I$6=\"Sur\",'CUENTAS CONTABLES'!D30,IF('1. Autorización'!$I$6=\"Colegio Americano del Sur\",'CUENTAS CONTABLES'!E30,'CUENTAS CONTABLES'!B30)))","v":"1-5-1-004-02-02"}]
["ATENCION AL PERSONAL","1-6-1-001-04-04","4-6-1-001-04-04","3-6-1-001-04-04","7-6-1-001-04-04",{"$f":"IF('1. Autorización'!$I$6=\"Altiplano\",'CUENTAS CONTABLES'!C31,IF('1. Autorización'!$I$6=\"Sur\",'CUENTAS CONTABLES'!D31,IF('1. Autorización'!$I$6=\"Colegio Americano del Sur\",'CUENTAS CONTABLES'!E31,'CUENTAS CONTABLES'!B31)))","v":"1-6-1-001-04-04"}]
["AYUDA FINANCIERA FDOS EXTERNO PROGRAMA ESPECIAL","1-5-1-001-01-99","4-5-1-001-01-99","3-5-1-001-01-99","7-5-1-001-01-99",{"$f":"IF('1. Autorización'!$I$6=\"Altiplano\",'CUENTAS CONTABLES'!C32,IF('1. Autorización'!$I$6=\"Sur\",'CUENTAS CONTABLES'!D32,IF('1. Autorización'!$I$6=\"Colegio Americano del Sur\",'CUENTAS CONTABLES'!E32,'CUENTAS CONTABLES'!B32)))","v":"1-5-1-001-01-99"}]
["AYUDA FINANCIERA FDOS EXTERNO PROGRAMA REGULAR","1-5-1-001-01-98","4-5-1-001-01-98","3-5-1-001-01-98","7-5-1-001-01-98",{"$f":"IF('1. Autorización'!$I$6=\"Altiplano\",'CUENTAS CONTABLES'!C33,IF('1. Autorización'!$I$6=\"Sur\",'CUENTAS CONTABLES'!D33,IF('1. Autorización'!$I$6=\"Colegio Americano del Sur\",'CUENTAS CONTABLES'!E33,'CUENTAS CONTABLES'!B33)))","v":"1-5-1-001-01-98"}]
["AYUDA FINANCIERA FDOS PROPIOS PROGRAMA ESPECIAL","1-5-1-001-01-97","4-5-1-001-01-97","3-5-1-001-01-97","7-5-1-001-01-97",{"$f":"IF('1. Autorización'!$I$6=\"Altiplano\",'CUENTAS CONTABLES'!C34,IF('1. Autorización'!$I$6=\"Sur\",'CUENTAS CONTABLES'!D34,IF('1. Autorización'!$I$6=\"Colegio Americano del Sur\",'CUENTAS CONTABLES'!E34,'CUENTAS CONTABLES'!B34)))","v":"1-5-1-001-01-97"}]
["AYUDA FINANCIERA FDOS PROPIOS PROGRAMA REGULAR","1-5-1-001-01-96","4-5-1-001-01-96","3-5-1-001-01-96","7-5-1-001-01-96",{"$f":"IF('1. Autorización'!$I$6=\"Altiplano\",'CUENTAS CONTABLES'!C35,IF('1. Autorización'!$I$6=\"Sur\",'CUENTAS CONTABLES'!D35,IF('1. Autorización'!$I$6=\"Colegio Americano del Sur\",'CUENTAS CONTABLES'!E35,'CUENTAS CONTABLES'!B35)))","v":"1-5-1-001-01-96"}]
["AYUDA FINANCIERA REEMBOLSABLE","1-5-1-001-04-02","4-5-1-001-04-02","3-5-1-001-04-02","7-5-1-001-04-02",{"$f":"IF('1. Autorización'!$I$6=\"Altiplano\",'CUENTAS CONTABLES'!C36,IF('1. Autorización'!$I$6=\"Sur\",'CUENTAS CONTABLES'!D36,IF('1. Autorización'!$I$6=\"Colegio Americano del Sur\",'CUENTAS CONTABLES'!E36,'CUENTAS CONTABLES'!B36)))","v":"1-5-1-001-04-02"}]
["AYUDAS FINANCIERAS","1-6-1-001-04-03","4-6-1-001-04-03","3-6-1-001-04-03","7-6-1-001-04-03",{"$f":"IF('1. Autorización'!$I$6=\"Altiplano\",'CUENTAS CONTABLES'!C37,IF('1. Autorización'!$I$6=\"Sur\",'CUENTAS CONTABLES'!D37,IF('1. Autorización'!$I$6=\"Colegio Americano del Sur\",'CUENTAS CONTABLES'!E37,'CUENTAS CONTABLES'!B37)))","v":"1-6-1-001-04-03"}]
["BAC  TEMP RESTRINGIDO (INT X COB INV)","1-1-1-003-08-20","4-1-1-003-08-20","3-1-1-003-08-20","7-1-1-003-08-20",{"$f":"IF('1. Autorización'!$I$6=\"Altiplano\",'CUENTAS CONTABLES'!C38,IF('1. Autorización'!$I$6=\"Sur\",'CUENTAS CONTABLES'!D38,IF('1. Autorización'!$I$6=\"Colegio Americano del Sur\",'CUENTAS CONTABLES'!E38,'CUENTAS CONTABLES'!B38)))","v":"1-1-1-003-08-20"}]
["BAC (BANCO DE AMERICA CENTRAL)","1-6-1-008-01-05","4-6-1-008-01-05","3-6-1-008-01-05","7-6-1-008-01-05",{"$f":"IF('1. Autorización'!$I$6=\"Altiplano\",'CUENTAS CONTABLES'!C39,IF('1. Autorización'!$I$6=\"Sur\",'CUENTAS CONTABLES'!D39,IF('1. Autorización'!$I$6=\"Colegio Americano del Sur\",'CUENTAS CONTABLES'!E39,'CUENTAS CONTABLES'!B39)))","v":"1-6-1-008-01-05"}]
["BAC NO RESTRINGIDO (INT X COBRAR INV)","1-1-1-003-08-19","4-1-1-003-08-19","3-1-1-003-08-19","7-1-1-003-08-19",{"$f":"IF('1. Autorización'!$I$6=\"Altiplano\",'CUENTAS CONTABLES'!C40,IF('1. Autorización'!$I$6=\"Sur\",'CUENTAS CONTABLES'!D40,IF('1. Autorización'!$I$6=\"Colegio Americano del Sur\",'CUENTAS CONTABLES'!E40,'CUENTAS CONTABLES'!B40)))","v":"1-1-1-003-08-19"}]
["BAM NO RESTRINGIDO (DIVIDENDOS X COBRAR ACC)","1-1-1-003-08-26","4-1-1-003-08-26","3-1-1-003-08-26","7-1-1-003-08-26",{"$f":"IF('1. Autorización'!$I$6=\"Altiplano\",'CUENTAS CONTABLES'!C41,IF('1. Autorización'!$I$6=\"Sur\",'CUENTAS CONTABLES'!D41,IF('1. Autorización'!$I$6=\"Colegio Americano del Sur\",'CUENTAS CONTABLES'!E41,'CUENTAS CONTABLES'!B41)))","v":"1-1-1-003-08-26"}]
["BANCO CUSCATLAN","1-6-1-008-01-06","4-6-1-008-01-06","3-6-1-008-01-06","7-6-1-008-01-06",{"$f":"IF('1. Autorización'!$I$6=\"Altiplano\",'CUENTAS CONTABLES'!C42,IF('1. Autorización'!$I$6=\"Sur\",'CUENTAS CONTABLES'!D42,IF('1. Autorización'!$I$6=\"Colegio Americano del Sur\",'CUENTAS CONTABLES'!E42,'CUENTAS CONTABLES'!B42)))","v":"1-6-1-008-01-06"}]
["BANCO CUSCATLAN (INTERESES POR PAGAR)","1-2-1-005-03-01","4-2-1-005-03-01","3-2-1-005-03-01","7-2-1-005-03-01",{"$f":"IF('1. Autorización'!$I$6=\"Altiplano\",'CUENTAS CONTABLES'!C43,IF('1. Autorización'!$I$6=\"Sur\",'CUENTAS CONTABLES'!D43,IF('1. Autorización'!$I$6=\"Colegio Americano del Sur\",'CUENTAS CONTABLES'!E43,'CUENTAS CONTABLES'!B43)))","v":"1-2-1-005-03-01"}]
["BANCO CUSCATLAN (PRESTAMO BANCARIO CAPITAL)","1-2-2-001-01-01","4-2-2-001-01-01","3-2-2-001-01-01","7-2-2-001-01-01",{"$f":"IF('1. Autorización'!$I$6=\"Altiplano\",'CUENTAS CONTABLES'!C44,IF('1. Autorización'!$I$6=\"Sur\",'CUENTAS CONTABLES'!D44,IF('1. Autorización'!$I$6=\"Colegio Americano del Sur\",'CUENTAS CONTABLES'!E44,'CUENTAS CONTABLES'!B44)))","v":"1-2-2-001-01-01"}]
["BANCO CUSCATLAN (PRESTAMOS BANCARIOS)","1-2-1-005-01-01","4-2-1-005-01-01","3-2-1-005-01-01","7-2-1-005-01-01",{"$f":"IF('1. Autorización'!$I$6=\"Altiplano\",'CUENTAS CONTABLES'!C45,IF('1. Autorización'!$I$6=\"Sur\",'CUENTAS CONTABLES'!D45,IF('1. Autorización'!$I$6=\"Colegio Americano del Sur\",'CUENTAS CONTABLES'!E45,'CUENTAS CONTABLES'!B45)))","v":"1-2-1-005-01-01"}]
["BANCO DE LOS TRABAJADORES","1-2-1-003-01-02","4-2-1-003-01-02","3-2-1-003-01-02","7-2-1-003-01-02",{"$f":"IF('1. Autorización'!$I$6=\"Altiplano\",'CUENTAS CONTABLES'!C46,IF('1. Autorización'!$I$6=\"Sur\",'CUENTAS CONTABLES'!D46,IF('1. Autorización'!$I$6=\"Colegio Americano del Sur\",'CUENTAS CONTABLES'!E46,'CUENTAS CONTABLES'!B46)))","v":"1-2-1-003-01-02"}]
["BANCO G&T CONTINENTAL (INT. POR PAGAR SOBREGIRO)","1-2-1-005-03-02","4-2-1-005-03-02","3-2-1-005-03-02","7-2-1-005-03-02",{"$f":"IF('1. Autorización'!$I$6=\"Altiplano\",'CUENTAS CONTABLES'!C47,IF('1. Autorización'!$I$6=\"Sur\",'CUENTAS CONTABLES'!D47,IF('1. Autorización'!$I$6=\"Colegio Americano del Sur\",'CUENTAS CONTABLES'!E47,'CUENTAS CONTABLES'!B47)))","v":"1-2-1-005-03-02"}]
["BANCO G&T CONTINENTAL (PRESTAMOS BANCARIOS)","1-2-1-005-02-01","4-2-1-005-02-01","3-2-1-005-02-01","7-2-1-005-02-01",{"$f":"IF('1. Autorización'!$I$6=\"Altiplano\",'CUENTAS CONTABLES'!C48,IF('1. Autorización'!$I$6=\"Sur\",'CUENTAS CONTABLES'!D48,IF('1. Autorización'!$I$6=\"Colegio Americano del Sur\",'CUENTAS CONTABLES'!E48,'CUENTAS CONTABLES'!B48)))","v":"1-2-1-005-02-01"}]
["BANCO INDUSTRIAL","1-6-1-008-01-04","4-6-1-008-01-04","3-6-1-008-01-04","7-6-1-008-01-04",{"$f":"IF('1. Autorización'!$I$6=\"Altiplano\",'CUENTAS CONTABLES'!C49,IF('1. Autorización'!$I$6=\"Sur\",'CUENTAS CONTABLES'!D49,IF('1. Autorización'!$I$6=\"Colegio Americano del Sur\",'CUENTAS CONTABLES'!E49,'CUENTAS CONTABLES'!B49)))","v":"1-6-1-008-01-04"}]
["BANCO INDUSTRIAL  FONDOS RESTRINGIDOS","1-2-1-005-02-02","4-2-1-005-02-02","3-2-1-005-02-02","7-2-1-005-02-02",{"$f":"IF('1. Autorización'!$I$6=\"Altiplano\",'CUENTAS CONTABLES'!C50,IF('1. Autorización'!$I$6=\"Sur\",'CUENTAS CONTABLES'!D50,IF('1. Autorización'!$I$6=\"Colegio Americano del Sur\",'CUENTAS CONTABLES'!E50,'CUENTAS CONTABLES'!B50)))","v":"1-2-1-005-02-02"}]
["BANCO INDUSTRIAL (PRESTAMO BANCARIO CAPITAL)","1-2-2-001-01-02","4-2-2-001-01-02","3-2-2-001-01-02","7-2-2-001-01-02",{"$f":"IF('1. Autorización'!$I$6=\"Altiplano\",'CUENTAS CONTABLES'!C51,IF('1. Autorización'!$I$6=\"Sur\",'CUENTAS CONTABLES'!D51,IF('1. Autorización'!$I$6=\"Colegio Americano del Sur\",'CUENTAS CONTABLES'!E51,'CUENTAS CONTABLES'!B51)))","v":"1-2-2-001-01-02"}]
["BANCO INDUSTRIAL (PRESTAMOS BANCARIOS","1-2-1-005-01-02","4-2-1-005-01-02","3-2-1-005-01-02","7-2-1-005-01-02",{"$f":"IF('1. Autorización'!$I$6=\"Altiplano\",'CUENTAS CONTABLES'!C52,IF('1. Autorización'!$I$6=\"Sur\",'CUENTAS CONTABLES'!D52,IF('1. Autorización'!$I$6=\"Colegio Americano del Sur\",'CUENTAS CONTABLES'!E52,'CUENTAS CONTABLES'!B52)))","v":"1-2-1-005-01-02"}]
["BANCO INDUSTRIAL NO RESTRINGIDO (INT.X COBRAR INV)","1-1-1-003-08-01","4-1-1-003-08-01","3-1-1-003-08-01","7-1-1-003-08-01",{"$f":"IF('1. Autorización'!$I$6=\"Altiplano\",'CUENTAS CONTABLES'!C53,IF('1. Autorización'!$I$6=\"Sur\",'CUENTAS CONTABLES'!D53,IF('1. Autorización'!$I$6=\"Colegio Americano del Sur\",'CUENTAS CONTABLES'!E53,'CUENTAS CONTABLES'!B53)))","v":"1-1-1-003-08-01"}]
["BANCO INDUSTRIAL PRESTAMO $ TEMP RESTRINGIDO","1-2-2-001-01-03","4-2-2-001-01-03","3-2-2-001-01-03","7-2-2-001-01-03",{"$f":"IF('1. Autorización'!$I$6=\"Altiplano\",'CUENTAS CONTABLES'!C54,IF('1. Autorización'!$I$6=\"Sur\",'CUENTAS CONTABLES'!D54,IF('1. Autorización'!$I$6=\"Colegio Americano del Sur\",'CUENTAS CONTABLES'!E54,'CUENTAS CONTABLES'!B54)))","v":"1-2-2-001-01-03"}]
["BANCO INTERNACIONAL","1-6-1-008-01-01","4-6-1-008-01-01","3-6-1-008-01-01","7-6-1-008-01-01",{"$f":"IF('1. Autorización'!$I$6=\"Altiplano\",'CUENTAS CONTABLES'!C55,IF('1. Autorización'!$I$6=\"Sur\",'CUENTAS CONTABLES'!D55,IF('1. Autorización'!$I$6=\"Colegio Americano del Sur\",'CUENTAS CONTABLES'!E55,'CUENTAS CONTABLES'!B55)))","v":"1-6-1-008-01-01"}]
["BANCO PRIVADO DE DESARROLLO (BANCASOL)","1-2-1-003-01-06","4-2-1-003-01-06","3-2-1-003-01-06","7-2-1-003-01-06",{"$f":"IF('1. Autorización'!$I$6=\"Altiplano\",'CUENTAS CONTABLES'!C56,IF('1. Autorización'!$I$6=\"Sur\",'CUENTAS CONTABLES'!D56,IF('1. Autorización'!$I$6=\"Colegio Americano del Sur\",'CUENTAS CONTABLES'!E56,'CUENTAS CONTABLES'!B56)))","v":"1-2-1-003-01-06"}]
["BANEX NO RESTRINGIDO (INT.X COBRAR S/INV.)","1-1-1-003-08-11","4-1-1-003-08-11","3-1-1-003-08-11","7-1-1-003-08-11",{"$f":"IF('1. Autorización'!$I$6=\"Altiplano\",'CUENTAS CONTABLES'!C57,IF('1. Autorización'!$I$6=\"Sur\",'CUENTAS CONTABLES'!D57,IF('1. Autorización'!$I$6=\"Colegio Americano del Sur\",'CUENTAS CONTABLES'!E57,'CUENTAS CONTABLES'!B57)))","v":"1-1-1-003-08-11"}]
["BANEX TEMPORAL.RESTRINGIDO (INT.X COBRAR S/INV)","1-1-1-003-08-12","4-1-1-003-08-12","3-1-1-003-08-12","7-1-1-003-08-12",{"$f":"IF('1. Autorización'!$I$6=\"Altiplano\",'CUENTAS CONTABLES'!C58,IF('1. Autorización'!$I$6=\"Sur\",'CUENTAS CONTABLES'!D58,IF('1. Autorización'!$I$6=\"Colegio Americano del Sur\",'CUENTAS CONTABLES'!E58,'CUENTAS CONTABLES'!B58)))","v":"1-1-1-003-08-12"}]
["BANRURAL FONDOS RESTRINGIDOS","1-2-1-005-02-03","4-2-1-005-02-03","3-2-1-005-02-03","7-2-1-005-02-03",{"$f":"IF('1. Autorización'!$I$6=\"Altiplano\",'CUENTAS CONTABLES'!C59,IF('1. Autorización'!$I$6=\"Sur\",'CUENTAS CONTABLES'!D59,IF('1. Autorización'!$I$6=\"Colegio Americano del Sur\",'CUENTAS CONTABLES'!E59,'CUENTAS CONTABLES'!B59)))","v":"1-2-1-005-02-03"}]
["BCO CUSCATLAN NO RESTRINGIDO (INT.X COB. INV.)","1-1-1-003-08-05","4-1-1-003-08-05","3-1-1-003-08-05","7-1-1-003-08-05",{"$f":"IF('1. Autorización'!$I$6=\"Altiplano\",'CUENTAS CONTABLES'!C60,IF('1. Autorización'!$I$6=\"Sur\",'CUENTAS CONTABLES'!D60,IF('1. Autorización'!$I$6=\"Colegio Americano del Sur\",'CUENTAS CONTABLES'!E60,'CUENTAS CONTABLES'!B60)))","v":"1-1-1-003-08-05"}]
["BCO CUSCATLAN TEMPORAL.RESTRINGIDO (INT.X COB INV)","1-1-1-003-08-06","4-1-1-003-08-06","3-1-1-003-08-06","7-1-1-003-08-06",{"$f":"IF('1. Autorización'!$I$6=\"Altiplano\",'CUENTAS CONTABLES'!C61,IF('1. Autorización'!$I$6=\"Sur\",'CUENTAS CONTABLES'!D61,IF('1. Autorización'!$I$6=\"Colegio Americano del Sur\",'CUENTAS CONTABLES'!E61,'CUENTAS CONTABLES'!B61)))","v":"1-1-1-003-08-06"}]
["BCO G&T CONTINENTAL NO RESTRINGIDO (INT X COB.)","1-1-1-003-08-03","4-1-1-003-08-03","3-1-1-003-08-03","7-1-1-003-08-03",{"$f":"IF('1. Autorización'!$I$6=\"Altiplano\",'CUENTAS CONTABLES'!C62,IF('1. Autorización'!$I$6=\"Sur\",'CUENTAS CONTABLES'!D62,IF('1. Autorización'!$I$6=\"Colegio Americano del Sur\",'CUENTAS CONTABLES'!E62,'CUENTAS CONTABLES'!B62)))","v":"1-1-1-003-08-03"}]
["BCO G&T CONTINENTAL TEMPORAL.RESTRINGIDO (INTXCOB)","1-1-1-003-08-04","4-1-1-003-08-04","3-1-1-003-08-04","7-1-1-003-08-04",{"$f":"IF('1. Autorización'!$I$6=\"Altiplano\",'CUENTAS CONTABLES'!C63,IF('1. Autorización'!$I$6=\"Sur\",'CUENTAS CONTABLES'!D63,IF('1. Autorización'!$I$6=\"Colegio Americano del Sur\",'CUENTAS CONTABLES'!E63,'CUENTAS CONTABLES'!B63)))","v":"1-1-1-003-08-04"}]
["BCO INDUSTRIAL TEMPORAL. RESTRINGIDO (INTXCOBRAR)","1-1-1-003-08-02","4-1-1-003-08-02","3-1-1-003-08-02","7-1-1-003-08-02",{"$f":"IF('1. Autorización'!$I$6=\"Altiplano\",'CUENTAS CONTABLES'!C64,IF('1. Autorización'!$I$6=\"Sur\",'CUENTAS CONTABLES'!D64,IF('1. Autorización'!$I$6=\"Colegio Americano del Sur\",'CUENTAS CONTABLES'!E64,'CUENTAS CONTABLES'!B64)))","v":"1-1-1-003-08-02"}]
["BCO REFORMADOR NO RESTRINGIDO (INT.X COB INV)","1-1-1-003-08-07","4-1-1-003-08-07","3-1-1-003-08-07","7-1-1-003-08-07",{"$f":"IF('1. Autorización'!$I$6=\"Altiplano\",'CUENTAS CONTABLES'!C65,IF('1. Autorización'!$I$6=\"Sur\",'CUENTAS CONTABLES'!D65,IF('1. Autorización'!$I$6=\"Colegio Americano del Sur\",'CUENTAS CONTABLES'!E65,'CUENTAS CONTABLES'!B65)))","v":"1-1-1-003-08-07"}]
["BCO REFORMADOR TEMPORAL.RESTRINGIDO(INTXCOB.INV)","1-1-1-003-08-08","4-1-1-003-08-08","3-1-1-003-08-08","7-1-1-003-08-08",{"$f":"IF('1. Autorización'!$I$6=\"Altiplano\",'CUENTAS CONTABLES'!C66,IF('1. Autorización'!$I$6=\"Sur\",'CUENTAS CONTABLES'!D66,IF('1. Autorización'!$I$6=\"Colegio Americano del Sur\",'CUENTAS CONTABLES'!E66,'CUENTAS CONTABLES'!B66)))","v":"1-1-1-003-08-08"}]
["BI NO RESTRINGIDO (DIVIDENDOS X COBRAR ACC)","1-1-1-003-08-25","4-1-1-003-08-25","3-1-1-003-08-25","7-1-1-003-08-25",{"$f":"IF('1. Autorización'!$I$6=\"Altiplano\",'CUENTAS CONTABLES'!C67,IF('1. Autorización'!$I$6=\"Sur\",'CUENTAS CONTABLES'!D67,IF('1. Autorización'!$I$6=\"Colegio Americano del Sur\",'CUENTAS CONTABLES'!E67,'CUENTAS CONTABLES'!B67)))","v":"1-1-1-003-08-25"}]
["BOLETO DE ORNATO","1-2-1-003-01-07","4-2-1-003-01-07","3-2-1-003-01-07","7-2-1-003-01-07",{"$f":"IF('1. Autorización'!$I$6=\"Altiplano\",'CUENTAS CONTABLES'!C68,IF('1. Autorización'!$I$6=\"Sur\",'CUENTAS CONTABLES'!D68,IF('1. Autorización'!$I$6=\"Colegio Americano del Sur\",'CUENTAS CONTABLES'!E68,'CUENTAS CONTABLES'!B68)))","v":"1-2-1-003-01-07"}]
["BOLETOS AEREOS","1-6-1-004-01-01","4-6-1-004-01-01","3-6-1-004-01-01","7-6-1-004-01-01",{"$f":"IF('1. Autorización'!$I$6=\"Altiplano\",'CUENTAS CONTABLES'!C69,IF('1. Autorización'!$I$6=\"Sur\",'CUENTAS CONTABLES'!D69,IF('1. Autorización'!$I$6=\"Colegio Americano del Sur\",'CUENTAS CONTABLES'!E69,'CUENTAS CONTABLES'!B69)))","v":"1-6-1-004-01-01"}]
["BONIFICACION DECRETO 42-92(BONO 14)","1-6-1-001-03-03","4-6-1-001-03-03","3-6-1-001-03-03","7-6-1-001-03-03",{"$f":"IF('1. Autorización'!$I$6=\"Altiplano\",'CUENTAS CONTABLES'!C70,IF('1. Autorización'!$I$6=\"Sur\",'CUENTAS CONTABLES'!D70,IF('1. Autorización'!$I$6=\"Colegio Americano del Sur\",'CUENTAS CONTABLES'!E70,'CUENTAS CONTABLES'!B70)))","v":"1-6-1-001-03-03"}]
["BONIFICACION INCENTIVO DECRETO(37-2001)","1-6-1-001-01-02","4-6-1-001-01-02","3-6-1-001-01-02","7-6-1-001-01-02",{"$f":"IF('1. Autorización'!$I$6=\"Altiplano\",'CUENTAS CONTABLES'!C71,IF('1. Autorización'!$I$6=\"Sur\",'CUENTAS CONTABLES'!D71,IF('1. Autorización'!$I$6=\"Colegio Americano del Sur\",'CUENTAS CONTABLES'!E71,'CUENTAS CONTABLES'!B71)))","v":"1-6-1-001-01-02"}]
["BONO DE DESEMPEÑO","1-6-1-001-03-06","4-6-1-001-03-06","3-6-1-001-03-06","7-6-1-001-03-06",{"$f":"IF('1. Autorización'!$I$6=\"Altiplano\",'CUENTAS CONTABLES'!C72,IF('1. Autorización'!$I$6=\"Sur\",'CUENTAS CONTABLES'!D72,IF('1. Autorización'!$I$6=\"Colegio Americano del Sur\",'CUENTAS CONTABLES'!E72,'CUENTAS CONTABLES'!B72)))","v":"1-6-1-001-03-06"}]
["BONOS EMITIDOS (PRESTAMOS CAG)","1-2-2-003-01-03","4-2-2-003-01-03","3-2-2-003-01-03","7-2-2-003-01-03",{"$f":"IF('1. Autorización'!$I$6=\"Altiplano\",'CUENTAS CONTABLES'!C73,IF('1. Autorización'!$I$6=\"Sur\",'CUENTAS CONTABLES'!D73,IF('1. Autorización'!$I$6=\"Colegio Americano del Sur\",'CUENTAS CONTABLES'!E73,'CUENTAS CONTABLES'!B73)))","v":"1-2-2-003-01-03"}]
["BONOS EMITIDOS CAG","1-2-2-003-01-02","4-2-2-003-01-02","3-2-2-003-01-02","7-2-2-003-01-02",{"$f":"IF('1. Autorización'!$I$6=\"Altiplano\",'CUENTAS CONTABLES'!C74,IF('1. Autorización'!$I$6=\"Sur\",'CUENTAS CONTABLES'!D74,IF('1. Autorización'!$I$6=\"Colegio Americano del Sur\",'CUENTAS CONTABLES'!E74,'CUENTAS CONTABLES'!B74)))","v":"1-2-2-003-01-02"}]
["BONOS EMITIDOS FUVG","1-2-2-003-01-01","4-2-2-003-01-01","3-2-2-003-01-01","7-2-2-003-01-01",{"$f":"IF('1. Autorización'!$I$6=\"Altiplano\",'CUENTAS CONTABLES'!C75,IF('1. Autorización'!$I$6=\"Sur\",'CUENTAS CONTABLES'!D75,IF('1. Autorización'!$I$6=\"Colegio Americano del Sur\",'CUENTAS CONTABLES'!E75,'CUENTAS CONTABLES'!B75)))","v":"1-2-2-003-01-01"}]
["CAJA CHICA $","1-1-1-001-01-02","4-1-1-001-01-02","3-1-1-001-01-02","7-1-1-001-01-02",{"$f":"IF('1. Autorización'!$I$6=\"Altiplano\",'CUENTAS CONTABLES'!C76,IF('1. Autorización'!$I$6=\"Sur\",'CUENTAS CONTABLES'!D76,IF('1. Autorización'!$I$6=\"Colegio Americano del Sur\",'CUENTAS CONTABLES'!E76,'CUENTAS CONTABLES'!B76)))","v":"1-1-1-001-01-02"}]
["CAJA CHICA $ VIRTUAL PARA LEGALIZACIONES","1-1-1-001-01-98","4-1-1-001-01-98","3-1-1-001-01-98","7-1-1-001-01-98",{"$f":"IF('1. Autorización'!$I$6=\"Altiplano\",'CUENTAS CONTABLES'!C77,IF('1. Autorización'!$I$6=\"Sur\",'CUENTAS CONTABLES'!D77,IF('1. Autorización'!$I$6=\"Colegio Americano del Sur\",'CUENTAS CONTABLES'!E77,'CUENTAS CONTABLES'!B77)))","v":"1-1-1-001-01-98"}]
["CAJA CHICA Q","1-1-1-001-01-01","4-1-1-001-01-01","3-1-1-001-01-01","7-1-1-001-01-01",{"$f":"IF('1. Autorización'!$I$6=\"Altiplano\",'CUENTAS CONTABLES'!C78,IF('1. Autorización'!$I$6=\"Sur\",'CUENTAS CONTABLES'!D78,IF('1. Autorización'!$I$6=\"Colegio Americano del Sur\",'CUENTAS CONTABLES'!E78,'CUENTAS CONTABLES'!B78)))","v":"1-1-1-001-01-01"}]
["CAJA CHICA Q VIRTUAL PARA LEGALIZACIONES","1-1-1-001-01-99","4-1-1-001-01-99","3-1-1-001-01-99","7-1-1-001-01-99",{"$f":"IF('1. Autorización'!$I$6=\"Altiplano\",'CUENTAS CONTABLES'!C79,IF('1. Autorización'!$I$6=\"Sur\",'CUENTAS CONTABLES'!D79,IF('1. Autorización'!$I$6=\"Colegio Americano del Sur\",'CUENTAS CONTABLES'!E79,'CUENTAS CONTABLES'!B79)))","v":"1-1-1-001-01-99"}]
["CAJA GENERAL $","1-1-1-001-01-05","4-1-1-001-01-05","3-1-1-001-01-05","7-1-1-001-01-05",{"$f":"IF('1. Autorización'!$I$6=\"Altiplano\",'CUENTAS CONTABLES'!C80,IF('1. Autorización'!$I$6=\"Sur\",'CUENTAS CONTABLES'!D80,IF('1. Autorización'!$I$6=\"Colegio Americano del Sur\",'CUENTAS CONTABLES'!E80,'CUENTAS CONTABLES'!B80)))","v":"1-1-1-001-01-05"}]
["CAJA GENERAL EUROS","1-1-1-001-01-04","4-1-1-001-01-04","3-1-1-001-01-04","7-1-1-001-01-04",{"$f":"IF('1. Autorización'!$I$6=\"Altiplano\",'CUENTAS CONTABLES'!C81,IF('1. Autorización'!$I$6=\"Sur\",'CUENTAS CONTABLES'!D81,IF('1. Autorización'!$I$6=\"Colegio Americano del Sur\",'CUENTAS CONTABLES'!E81,'CUENTAS CONTABLES'!B81)))","v":"1-1-1-001-01-04"}]
["CAJA GENERAL Q.","1-1-1-001-01-03","4-1-1-001-01-03","3-1-1-001-01-03","7-1-1-001-01-03",{"$f":"IF('1. Autorización'!$I$6=\"Altiplano\",'CUENTAS CONTABLES'!C82,IF('1. Autorización'!$I$6=\"Sur\",'CUENTAS CONTABLES'!D82,IF('1. Autorización'!$I$6=\"Colegio Americano del Sur\",'CUENTAS CONTABLES'!E82,'CUENTAS CONTABLES'!B82)))","v":"1-1-1-001-01-03"}]
["CAJA TRANSITORIA PARA CIERRE","1-1-1-001-01-97","4-1-1-001-01-97","3-1-1-001-01-97","7-1-1-001-01-97",{"$f":"IF('1. Autorización'!$I$6=\"Altiplano\",'CUENTAS CONTABLES'!C83,IF('1. Autorización'!$I$6=\"Sur\",'CUENTAS CONTABLES'!D83,IF('1. Autorización'!$I$6=\"Colegio Americano del Sur\",'CUENTAS CONTABLES'!E83,'CUENTAS CONTABLES'!B83)))","v":"1-1-1-001-01-97"}]
["CERTIFICACIONES","1-5-1-001-02-03","4-5-1-001-02-03","3-5-1-001-02-03","7-5-1-001-02-03",{"$f":"IF('1. Autorización'!$I$6=\"Altiplano\",'CUENTAS CONTABLES'!C84,IF('1. Autorización'!$I$6=\"Sur\",'CUENTAS CONTABLES'!D84,IF('1. Autorización'!$I$6=\"Colegio Americano del Sur\",'CUENTAS CONTABLES'!E84,'CUENTAS CONTABLES'!B84)))","v":"1-5-1-001-02-03"}]
["CHEQUES CADUCADOS NO REEMITIDOS","1-2-1-007-01-01","4-2-1-007-01-01","3-2-1-007-01-01","7-2-1-007-01-01",{"$f":"IF('1. Autorización'!$I$6=\"Altiplano\",'CUENTAS CONTABLES'!C85,IF('1. Autorización'!$I$6=\"Sur\",'CUENTAS CONTABLES'!D85,IF('1. Autorización'!$I$6=\"Colegio Americano del Sur\",'CUENTAS CONTABLES'!E85,'CUENTAS CONTABLES'!B85)))","v":"1-2-1-007-01-01"}]
["CHEQUES CADUCADOS Y REIMPRESOS","1-2-1-007-01-02","4-2-1-007-01-02","3-2-1-007-01-02","7-2-1-007-01-02",{"$f":"IF('1. Autorización'!$I$6=\"Altiplano\",'CUENTAS CONTABLES'!C86,IF('1. Autorización'!$I$6=\"Sur\",'CUENTAS CONTABLES'!D86,IF('1. Autorización'!$I$6=\"Colegio Americano del Sur\",'CUENTAS CONTABLES'!E86,'CUENTAS CONTABLES'!B86)))","v":"1-2-1-007-01-02"}]
["CHEQUES RECHAZADOS","1-1-1-003-01-23","4-1-1-003-01-23","3-1-1-003-01-23","7-1-1-003-01-23",{"$f":"IF('1. Autorización'!$I$6=\"Altiplano\",'CUENTAS CONTABLES'!C87,IF('1. Autorización'!$I$6=\"Sur\",'CUENTAS CONTABLES'!D87,IF('1. Autorización'!$I$6=\"Colegio Americano del Sur\",'CUENTAS CONTABLES'!E87,'CUENTAS CONTABLES'!B87)))","v":"1-1-1-003-01-23"}]
["CITIBANK","1-6-1-008-01-02","4-6-1-008-01-02","3-6-1-008-01-02","7-6-1-008-01-02",{"$f":"IF('1. Autorización'!$I$6=\"Altiplano\",'CUENTAS CONTABLES'!C88,IF('1. Autorización'!$I$6=\"Sur\",'CUENTAS CONTABLES'!D88,IF('1. Autorización'!$I$6=\"Colegio Americano del Sur\",'CUENTAS CONTABLES'!E88,'CUENTAS CONTABLES'!B88)))","v":"1-6-1-008-01-02"}]
["CITIBANK NO RESTRINGIDO (INT.X COBRAR S/INV)","1-1-1-003-08-17","4-1-1-003-08-17","3-1-1-003-08-17","7-1-1-003-08-17",{"$f":"IF('1. Autorización'!$I$6=\"Altiplano\",'CUENTAS CONTABLES'!C89,IF('1. Autorización'!$I$6=\"Sur\",'CUENTAS CONTABLES'!D89,IF('1. Autorización'!$I$6=\"Colegio Americano del Sur\",'CUENTAS CONTABLES'!E89,'CUENTAS CONTABLES'!B89)))","v":"1-1-1-003-08-17"}]
["CITIBANK TEMPORAL.RESTRINGIDO (INTXCOBRAR S/INV)","1-1-1-003-08-18","4-1-1-003-08-18","3-1-1-003-08-18","7-1-1-003-08-18",{"$f":"IF('1. Autorización'!$I$6=\"Altiplano\",'CUENTAS CONTABLES'!C90,IF('1. Autorización'!$I$6=\"Sur\",'CUENTAS CONTABLES'!D90,IF('1. Autorización'!$I$6=\"Colegio Americano del Sur\",'CUENTAS CONTABLES'!E90,'CUENTAS CONTABLES'!B90)))","v":"1-1-1-003-08-18"}]
["COMBUSTIBLES Y LUBRICANTES","1-6-1-005-02-16","4-6-1-005-02-16","3-6-1-005-02-16","7-6-1-005-02-16",{"$f":"IF('1. Autorización'!$I$6=\"Altiplano\",'CUENTAS CONTABLES'!C91,IF('1. Autorización'!$I$6=\"Sur\",'CUENTAS CONTABLES'!D91,IF('1. Autorización'!$I$6=\"Colegio Americano del Sur\",'CUENTAS CONTABLES'!E91,'CUENTAS CONTABLES'!B91)))","v":"1-6-1-005-02-16"}]
["CONSTRUCCIONES Y REMODELACIONES (TEMP)","1-1-3-001-03-02","4-1-3-001-03-02","3-1-3-001-03-02","7-1-3-001-03-02",{"$f":"IF('1. Autorización'!$I$6=\"Altiplano\",'CUENTAS CONTABLES'!C92,IF('1. Autorización'!$I$6=\"Sur\",'CUENTAS CONTABLES'!D92,IF('1. Autorización'!$I$6=\"Colegio Americano del Sur\",'CUENTAS CONTABLES'!E92,'CUENTAS CONTABLES'!B92)))","v":"1-1-3-001-03-02"}]
["CONSTRUCCIONES Y REMODELACIONES EN PROCESO","1-1-3-001-03-01","4-1-3-001-03-01","3-1-3-001-03-01","7-1-3-001-03-01",{"$f":"IF('1. Autorización'!$I$6=\"Altiplano\",'CUENTAS CONTABLES'!C93,IF('1. Autorización'!$I$6=\"Sur\",'CUENTAS CONTABLES'!D93,IF('1. Autorización'!$I$6=\"Colegio Americano del Sur\",'CUENTAS CONTABLES'!E93,'CUENTAS CONTABLES'!B93)))","v":"1-1-3-001-03-01"}]
["CONSUMO DE AGUA POTABLE","1-6-1-003-01-03","4-6-1-003-01-03","3-6-1-003-01-03","7-6-1-003-01-03",{"$f":"IF('1. Autorización'!$I$6=\"Altiplano\",'CUENTAS CONTABLES'!C94,IF('1. Autorización'!$I$6=\"Sur\",'CUENTAS CONTABLES'!D94,IF('1. Autorización'!$I$6=\"Colegio Americano del Sur\",'CUENTAS CONTABLES'!E94,'CUENTAS CONTABLES'!B94)))","v":"1-6-1-003-01-03"}]
["CONSUMO DE ELECTRICIDAD","1-6-1-003-01-02","4-6-1-003-01-02","3-6-1-003-01-02","7-6-1-003-01-02",{"$f":"IF('1. Autorización'!$I$6=\"Altiplano\",'CUENTAS CONTABLES'!C95,IF('1. Autorización'!$I$6=\"Sur\",'CUENTAS CONTABLES'!D95,IF('1. Autorización'!$I$6=\"Colegio Americano del Sur\",'CUENTAS CONTABLES'!E95,'CUENTAS CONTABLES'!B95)))","v":"1-6-1-003-01-02"}]
["CONVALIDACIONES","1-5-1-001-01-03","4-5-1-001-01-03","3-5-1-001-01-03","7-5-1-001-01-03",{"$f":"IF('1. Autorización'!$I$6=\"Altiplano\",'CUENTAS CONTABLES'!C96,IF('1. Autorización'!$I$6=\"Sur\",'CUENTAS CONTABLES'!D96,IF('1. Autorización'!$I$6=\"Colegio Americano del Sur\",'CUENTAS CONTABLES'!E96,'CUENTAS CONTABLES'!B96)))","v":"1-5-1-001-01-03"}]
["COOPERATIVA IXCANIL","1-2-1-003-01-04","4-2-1-003-01-04","3-2-1-003-01-04","7-2-1-003-01-04",{"$f":"IF('1. Autorización'!$I$6=\"Altiplano\",'CUENTAS CONTABLES'!C97,IF('1. Autorización'!$I$6=\"Sur\",'CUENTAS CONTABLES'!D97,IF('1. Autorización'!$I$6=\"Colegio Americano del Sur\",'CUENTAS CONTABLES'!E97,'CUENTAS CONTABLES'!B97)))","v":"1-2-1-003-01-04"}]
["CRÉDITO FISCAL IVA","1-1-1-003-09-01","4-1-1-003-09-01","3-1-1-003-09-01","7-1-1-003-09-01",{"$f":"IF('1. Autorización'!$I$6=\"Altiplano\",'CUENTAS CONTABLES'!C98,IF('1. Autorización'!$I$6=\"Sur\",'CUENTAS CONTABLES'!D98,IF('1. Autorización'!$I$6=\"Colegio Americano del Sur\",'CUENTAS CONTABLES'!E98,'CUENTAS CONTABLES'!B98)))","v":"1-1-1-003-09-01"}]
["CREDITOS BANCARIOS EN TRANSITO","1-2-1-001-01-06","4-2-1-001-01-06","3-2-1-001-01-06","7-2-1-001-01-06",{"$f":"IF('1. Autorización'!$I$6=\"Altiplano\",'CUENTAS CONTABLES'!C99,IF('1. Autorización'!$I$6=\"Sur\",'CUENTAS CONTABLES'!D99,IF('1. Autorización'!$I$6=\"Colegio Americano del Sur\",'CUENTAS CONTABLES'!E99,'CUENTAS CONTABLES'!B99)))","v":"1-2-1-001-01-06"}]
["CREDITOS LARGO PLAZO","1-1-2-002-02-02","4-1-2-002-02-02","3-1-2-002-02-02","7-1-2-002-02-02",{"$f":"IF('1. Autorización'!$I$6=\"Altiplano\",'CUENTAS CONTABLES'!C100,IF('1. Autorización'!$I$6=\"Sur\",'CUENTAS CONTABLES'!D100,IF('1. Autorización'!$I$6=\"Colegio Americano del Sur\",'CUENTAS CONTABLES'!E100,'CUENTAS CONTABLES'!B100)))","v":"1-1-2-002-02-02"}]
["CTA POR PAGAR TRANSITORIA TERCEROS (ACADEMICO)","1-2-1-001-04-92","4-2-1-001-04-92","3-2-1-001-04-92","7-2-1-001-04-92",{"$f":"IF('1. Autorización'!$I$6=\"Altiplano\",'CUENTAS CONTABLES'!C101,IF('1. Autorización'!$I$6=\"Sur\",'CUENTAS CONTABLES'!D101,IF('1. Autorización'!$I$6=\"Colegio Americano del Sur\",'CUENTAS CONTABLES'!E101,'CUENTAS CONTABLES'!B101)))","v":"1-2-1-001-04-92"}]
["CTA X COB FONDO BECAS A SEDE","1-1-1-003-07-05","4-1-1-003-07-05","3-1-1-003-07-05","7-1-1-003-07-05",{"$f":"IF('1. Autorización'!$I$6=\"Altiplano\",'CUENTAS CONTABLES'!C102,IF('1. Autorización'!$I$6=\"Sur\",'CUENTAS CONTABLES'!D102,IF('1. Autorización'!$I$6=\"Colegio Americano del Sur\",'CUENTAS CONTABLES'!E102,'CUENTAS CONTABLES'!B102)))","v":"1-1-1-003-07-05"}]
["CTA X COB FONDOS (CON RUBROS) A SEDE","1-1-1-003-07-04","4-1-1-003-07-04","3-1-1-003-07-04","7-1-1-003-07-04",{"$f":"IF('1. Autorización'!$I$6=\"Altiplano\",'CUENTAS CONTABLES'!C103,IF('1. Autorización'!$I$6=\"Sur\",'CUENTAS CONTABLES'!D103,IF('1. Autorización'!$I$6=\"Colegio Americano del Sur\",'CUENTAS CONTABLES'!E103,'CUENTAS CONTABLES'!B103)))","v":"1-1-1-003-07-04"}]
["CTA X COB FONDOS A SEDE","1-1-1-003-07-03","4-1-1-003-07-03","3-1-1-003-07-03","7-1-1-003-07-03",{"$f":"IF('1. Autorización'!$I$6=\"Altiplano\",'CUENTAS CONTABLES'!C104,IF('1. Autorización'!$I$6=\"Sur\",'CUENTAS CONTABLES'!D104,IF('1. Autorización'!$I$6=\"Colegio Americano del Sur\",'CUENTAS CONTABLES'!E104,'CUENTAS CONTABLES'!B104)))","v":"1-1-1-003-07-03"}]
["CTA X COB PROY OAII (CON PRESU) A SEDE","1-1-1-003-07-02","4-1-1-003-07-02","3-1-1-003-07-02","7-1-1-003-07-02",{"$f":"IF('1. Autorización'!$I$6=\"Altiplano\",'CUENTAS CONTABLES'!C105,IF('1. Autorización'!$I$6=\"Sur\",'CUENTAS CONTABLES'!D105,IF('1. Autorización'!$I$6=\"Colegio Americano del Sur\",'CUENTAS CONTABLES'!E105,'CUENTAS CONTABLES'!B105)))","v":"1-1-1-003-07-02"}]
["CTA X COB PROY OAII (SIN PRESU) A SEDE","1-1-1-003-07-01","4-1-1-003-07-01","3-1-1-003-07-01","7-1-1-003-07-01",{"$f":"IF('1. Autorización'!$I$6=\"Altiplano\",'CUENTAS CONTABLES'!C106,IF('1. Autorización'!$I$6=\"Sur\",'CUENTAS CONTABLES'!D106,IF('1. Autorización'!$I$6=\"Colegio Americano del Sur\",'CUENTAS CONTABLES'!E106,'CUENTAS CONTABLES'!B106)))","v":"1-1-1-003-07-01"}]
["CTA X COB PROYECTO A PROYECTO","1-1-1-003-06-06","4-1-1-003-06-06","3-1-1-003-06-06","7-1-1-003-06-06",{"$f":"IF('1. Autorización'!$I$6=\"Altiplano\",'CUENTAS CONTABLES'!C107,IF('1. Autorización'!$I$6=\"Sur\",'CUENTAS CONTABLES'!D107,IF('1. Autorización'!$I$6=\"Colegio Americano del Sur\",'CUENTAS CONTABLES'!E107,'CUENTAS CONTABLES'!B107)))","v":"1-1-1-003-06-06"}]
["CTA X COB RELACIONADAS (NO REST)","1-1-1-003-02-01","4-1-1-003-02-01","3-1-1-003-02-01","7-1-1-003-02-01",{"$f":"IF('1. Autorización'!$I$6=\"Altiplano\",'CUENTAS CONTABLES'!C108,IF('1. Autorización'!$I$6=\"Sur\",'CUENTAS CONTABLES'!D108,IF('1. Autorización'!$I$6=\"Colegio Americano del Sur\",'CUENTAS CONTABLES'!E108,'CUENTAS CONTABLES'!B108)))","v":"1-1-1-003-02-01"}]
["CTA X COB RELACIONADAS (TEMP REST)","1-1-1-003-03-01","4-1-1-003-03-01","3-1-1-003-03-01","7-1-1-003-03-01",{"$f":"IF('1. Autorización'!$I$6=\"Altiplano\",'CUENTAS CONTABLES'!C109,IF('1. Autorización'!$I$6=\"Sur\",'CUENTAS CONTABLES'!D109,IF('1. Autorización'!$I$6=\"Colegio Americano del Sur\",'CUENTAS CONTABLES'!E109,'CUENTAS CONTABLES'!B109)))","v":"1-1-1-003-03-01"}]
["CTA X COB SEDE A FONDO BECAS","1-1-1-003-06-05","4-1-1-003-06-05","3-1-1-003-06-05","7-1-1-003-06-05",{"$f":"IF('1. Autorización'!$I$6=\"Altiplano\",'CUENTAS CONTABLES'!C110,IF('1. Autorización'!$I$6=\"Sur\",'CUENTAS CONTABLES'!D110,IF('1. Autorización'!$I$6=\"Colegio Americano del Sur\",'CUENTAS CONTABLES'!E110,'CUENTAS CONTABLES'!B110)))","v":"1-1-1-003-06-05"}]
["CTA X COB SEDE A FONDOS","1-1-1-003-06-03","4-1-1-003-06-03","3-1-1-003-06-03","7-1-1-003-06-03",{"$f":"IF('1. Autorización'!$I$6=\"Altiplano\",'CUENTAS CONTABLES'!C111,IF('1. Autorización'!$I$6=\"Sur\",'CUENTAS CONTABLES'!D111,IF('1. Autorización'!$I$6=\"Colegio Americano del Sur\",'CUENTAS CONTABLES'!E111,'CUENTAS CONTABLES'!B111)))","v":"1-1-1-003-06-03"}]
["CTA X COB SEDE A FONDOS (CON RUBROS)","1-1-1-003-06-04","4-1-1-003-06-04","3-1-1-003-06-04","7-1-1-003-06-04",{"$f":"IF('1. Autorización'!$I$6=\"Altiplano\",'CUENTAS CONTABLES'!C112,IF('1. Autorización'!$I$6=\"Sur\",'CUENTAS CONTABLES'!D112,IF('1. Autorización'!$I$6=\"Colegio Americano del Sur\",'CUENTAS CONTABLES'!E112,'CUENTAS CONTABLES'!B112)))","v":"1-1-1-003-06-04"}]
["CTA X COB SEDE A PROY OAII (CON PRESU)","1-1-1-003-06-02","4-1-1-003-06-02","3-1-1-003-06-02","7-1-1-003-06-02",{"$f":"IF('1. Autorización'!$I$6=\"Altiplano\",'CUENTAS CONTABLES'!C113,IF('1. Autorización'!$I$6=\"Sur\",'CUENTAS CONTABLES'!D113,IF('1. Autorización'!$I$6=\"Colegio Americano del Sur\",'CUENTAS CONTABLES'!E113,'CUENTAS CONTABLES'!B113)))","v":"1-1-1-003-06-02"}]
["CTA X COB SEDE A PROY OAII (SIN PRESU)","1-1-1-003-06-01","4-1-1-003-06-01","3-1-1-003-06-01","7-1-1-003-06-01",{"$f":"IF('1. Autorización'!$I$6=\"Altiplano\",'CUENTAS CONTABLES'!C114,IF('1. Autorización'!$I$6=\"Sur\",'CUENTAS CONTABLES'!D114,IF('1. Autorización'!$I$6=\"Colegio Americano del Sur\",'CUENTAS CONTABLES'!E114,'CUENTAS CONTABLES'!B114)))","v":"1-1-1-003-06-01"}]
["CTA X COB TRANSITORIA FONDOS (CON RUBROS) A SEDE","1-1-1-003-07-96","4-1-1-003-07-96","3-1-1-003-07-96","7-1-1-003-07-96",{"$f":"IF('1. Autorización'!$I$6=\"Altiplano\",'CUENTAS CONTABLES'!C115,IF('1. Autorización'!$I$6=\"Sur\",'CUENTAS CONTABLES'!D115,IF('1. Autorización'!$I$6=\"Colegio Americano del Sur\",'CUENTAS CONTABLES'!E115,'CUENTAS CONTABLES'!B115)))","v":"1-1-1-003-07-96"}]
["CTA X COB TRANSITORIA FONDOS A SEDE","1-1-1-003-07-97","4-1-1-003-07-97","3-1-1-003-07-97","7-1-1-003-07-97",{"$f":"IF('1. Autorización'!$I$6=\"Altiplano\",'CUENTAS CONTABLES'!C116,IF('1. Autorización'!$I$6=\"Sur\",'CUENTAS CONTABLES'!D116,IF('1. Autorización'!$I$6=\"Colegio Americano del Sur\",'CUENTAS CONTABLES'!E116,'CUENTAS CONTABLES'!B116)))","v":"1-1-1-003-07-97"}]
["CTA X COB TRANSITORIA FONDOS BECAS A SEDE","1-1-1-003-07-95","4-1-1-003-07-95","3-1-1-003-07-95","7-1-1-003-07-95",{"$f":"IF('1. Autorización'!$I$6=\"Altiplano\",'CUENTAS CONTABLES'!C117,IF('1. Autorización'!$I$6=\"Sur\",'CUENTAS CONTABLES'!D117,IF('1. Autorización'!$I$6=\"Colegio Americano del Sur\",'CUENTAS CONTABLES'!E117,'CUENTAS CONTABLES'!B117)))","v":"1-1-1-003-07-95"}]
["CTA X COB TRANSITORIA LIQUIDACIONES","1-1-1-003-06-93","4-1-1-003-06-93","3-1-1-003-06-93","7-1-1-003-06-93",{"$f":"IF('1. Autorización'!$I$6=\"Altiplano\",'CUENTAS CONTABLES'!C118,IF('1. Autorización'!$I$6=\"Sur\",'CUENTAS CONTABLES'!D118,IF('1. Autorización'!$I$6=\"Colegio Americano del Sur\",'CUENTAS CONTABLES'!E118,'CUENTAS CONTABLES'!B118)))","v":"1-1-1-003-06-93"}]
["CTA X COB TRANSITORIA OAII (SIN PRESU) A SEDE","1-1-1-003-07-99","4-1-1-003-07-99","3-1-1-003-07-99","7-1-1-003-07-99",{"$f":"IF('1. Autorización'!$I$6=\"Altiplano\",'CUENTAS CONTABLES'!C119,IF('1. Autorización'!$I$6=\"Sur\",'CUENTAS CONTABLES'!D119,IF('1. Autorización'!$I$6=\"Colegio Americano del Sur\",'CUENTAS CONTABLES'!E119,'CUENTAS CONTABLES'!B119)))","v":"1-1-1-003-07-99"}]
["CTA X COB TRANSITORIA PRO A PRO","1-1-1-003-06-94","4-1-1-003-06-94","3-1-1-003-06-94","7-1-1-003-06-94",{"$f":"IF('1. Autorización'!$I$6=\"Altiplano\",'CUENTAS CONTABLES'!C120,IF('1. Autorización'!$I$6=\"Sur\",'CUENTAS CONTABLES'!D120,IF('1. Autorización'!$I$6=\"Colegio Americano del Sur\",'CUENTAS CONTABLES'!E120,'CUENTAS CONTABLES'!B120)))","v":"1-1-1-003-06-94"}]
["CTA X COB TRANSITORIA PROY OAII (CON PRESU) A SEDE","1-1-1-003-07-98","4-1-1-003-07-98","3-1-1-003-07-98","7-1-1-003-07-98",{"$f":"IF('1. Autorización'!$I$6=\"Altiplano\",'CUENTAS CONTABLES'!C121,IF('1. Autorización'!$I$6=\"Sur\",'CUENTAS CONTABLES'!D121,IF('1. Autorización'!$I$6=\"Colegio Americano del Sur\",'CUENTAS CONTABLES'!E121,'CUENTAS CONTABLES'!B121)))","v":"1-1-1-003-07-98"}]
["CTA X COB TRANSITORIA RELACIONADA (NO REST)","1-1-1-003-02-02","4-1-1-003-02-02","3-1-1-003-02-02","7-1-1-003-02-02",{"$f":"IF('1. Autorización'!$I$6=\"Altiplano\",'CUENTAS CONTABLES'!C122,IF('1. Autorización'!$I$6=\"Sur\",'CUENTAS CONTABLES'!D122,IF('1. Autorización'!$I$6=\"Colegio Americano del Sur\",'CUENTAS CONTABLES'!E122,'CUENTAS CONTABLES'!B122)))","v":"1-1-1-003-02-02"}]
["CTA X COB TRANSITORIA RELACIONADAS (TEMP REST)","1-1-1-003-03-02","4-1-1-003-03-02","3-1-1-003-03-02","7-1-1-003-03-02",{"$f":"IF('1. Autorización'!$I$6=\"Altiplano\",'CUENTAS CONTABLES'!C123,IF('1. Autorización'!$I$6=\"Sur\",'CUENTAS CONTABLES'!D123,IF('1. Autorización'!$I$6=\"Colegio Americano del Sur\",'CUENTAS CONTABLES'!E123,'CUENTAS CONTABLES'!B123)))","v":"1-1-1-003-03-02"}]
["CTA X COB TRANSITORIA SEDE A FONDO BECAS","1-1-1-003-06-95","4-1-1-003-06-95","3-1-1-003-06-95","7-1-1-003-06-95",{"$f":"IF('1. Autorización'!$I$6=\"Altiplano\",'CUENTAS CONTABLES'!C124,IF('1. Autorización'!$I$6=\"Sur\",'CUENTAS CONTABLES'!D124,IF('1. Autorización'!$I$6=\"Colegio Americano del Sur\",'CUENTAS CONTABLES'!E124,'CUENTAS CONTABLES'!B124)))","v":"1-1-1-003-06-95"}]
["CTA X COB TRANSITORIA SEDE A FONDOS","1-1-1-003-06-97","4-1-1-003-06-97","3-1-1-003-06-97","7-1-1-003-06-97",{"$f":"IF('1. Autorización'!$I$6=\"Altiplano\",'CUENTAS CONTABLES'!C125,IF('1. Autorización'!$I$6=\"Sur\",'CUENTAS CONTABLES'!D125,IF('1. Autorización'!$I$6=\"Colegio Americano del Sur\",'CUENTAS CONTABLES'!E125,'CUENTAS CONTABLES'!B125)))","v":"1-1-1-003-06-97"}]
["CTA X COB TRANSITORIA SEDE A FONDOS (CON RUBROS)","1-1-1-003-06-96","4-1-1-003-06-96","3-1-1-003-06-96","7-1-1-003-06-96",{"$f":"IF('1. Autorización'!$I$6=\"Altiplano\",'CUENTAS CONTABLES'!C126,IF('1. Autorización'!$I$6=\"Sur\",'CUENTAS CONTABLES'!D126,IF('1. Autorización'!$I$6=\"Colegio Americano del Sur\",'CUENTAS CONTABLES'!E126,'CUENTAS CONTABLES'!B126)))","v":"1-1-1-003-06-96"}]
["CTA X COB TRANSITORIA SEDE A PROY OAII (CON PRESU)","1-1-1-003-06-98","4-1-1-003-06-98","3-1-1-003-06-98","7-1-1-003-06-98",{"$f":"IF('1. Autorización'!$I$6=\"Altiplano\",'CUENTAS CONTABLES'!C127,IF('1. Autorización'!$I$6=\"Sur\",'CUENTAS CONTABLES'!D127,IF('1. Autorización'!$I$6=\"Colegio Americano del Sur\",'CUENTAS CONTABLES'!E127,'CUENTAS CONTABLES'!B127)))","v":"1-1-1-003-06-98"}]
["CTA X COB TRANSITORIA SEDE A PROY OAII (SIN PRESU)","1-1-1-003-06-99","4-1-1-003-06-99","3-1-1-003-06-99","7-1-1-003-06-99",{"$f":"IF('1. Autorización'!$I$6=\"Altiplano\",'CUENTAS CONTABLES'!C128,IF('1. Autorización'!$I$6=\"Sur\",'CUENTAS CONTABLES'!D128,IF('1. Autorización'!$I$6=\"Colegio Americano del Sur\",'CUENTAS CONTABLES'!E128,'CUENTAS CONTABLES'!B128)))","v":"1-1-1-003-06-99"}]
["CTA X PAG FONDO BECAS A SEDE","1-2-1-001-04-05","4-2-1-001-04-05","3-2-1-001-04-05","7-2-1-001-04-05",{"$f":"IF('1. Autorización'!$I$6=\"Altiplano\",'CUENTAS CONTABLES'!C129,IF('1. Autorización'!$I$6=\"Sur\",'CUENTAS CONTABLES'!D129,IF('1. Autorización'!$I$6=\"Colegio Americano del Sur\",'CUENTAS CONTABLES'!E129,'CUENTAS CONTABLES'!B129)))","v":"1-2-1-001-04-05"}]
["CTA X PAG FONDOS (CON RUBROS) A SEDE","1-2-1-001-04-04","4-2-1-001-04-04","3-2-1-001-04-04","7-2-1-001-04-04",{"$f":"IF('1. Autorización'!$I$6=\"Altiplano\",'CUENTAS CONTABLES'!C130,IF('1. Autorización'!$I$6=\"Sur\",'CUENTAS CONTABLES'!D130,IF('1. Autorización'!$I$6=\"Colegio Americano del Sur\",'CUENTAS CONTABLES'!E130,'CUENTAS CONTABLES'!B130)))","v":"1-2-1-001-04-04"}]
["CTA X PAG FONDOS A SEDE","1-2-1-001-04-03","4-2-1-001-04-03","3-2-1-001-04-03","7-2-1-001-04-03",{"$f":"IF('1. Autorización'!$I$6=\"Altiplano\",'CUENTAS CONTABLES'!C131,IF('1. Autorización'!$I$6=\"Sur\",'CUENTAS CONTABLES'!D131,IF('1. Autorización'!$I$6=\"Colegio Americano del Sur\",'CUENTAS CONTABLES'!E131,'CUENTAS CONTABLES'!B131)))","v":"1-2-1-001-04-03"}]
["CTA X PAG PROY OAII (CON PRESU) A SEDE","1-2-1-001-04-02","4-2-1-001-04-02","3-2-1-001-04-02","7-2-1-001-04-02",{"$f":"IF('1. Autorización'!$I$6=\"Altiplano\",'CUENTAS CONTABLES'!C132,IF('1. Autorización'!$I$6=\"Sur\",'CUENTAS CONTABLES'!D132,IF('1. Autorización'!$I$6=\"Colegio Americano del Sur\",'CUENTAS CONTABLES'!E132,'CUENTAS CONTABLES'!B132)))","v":"1-2-1-001-04-02"}]
["CTA X PAG PROY OAII (SIN PRESU) A SEDE","1-2-1-001-04-01","4-2-1-001-04-01","3-2-1-001-04-01","7-2-1-001-04-01",{"$f":"IF('1. Autorización'!$I$6=\"Altiplano\",'CUENTAS CONTABLES'!C133,IF('1. Autorización'!$I$6=\"Sur\",'CUENTAS CONTABLES'!D133,IF('1. Autorización'!$I$6=\"Colegio Americano del Sur\",'CUENTAS CONTABLES'!E133,'CUENTAS CONTABLES'!B133)))","v":"1-2-1-001-04-01"}]
["CTA X PAG RELACIONADAS (NO REST)","1-2-1-001-07-01","4-2-1-001-07-01","3-2-1-001-07-01","7-2-1-001-07-01",{"$f":"IF('1. Autorización'!$I$6=\"Altiplano\",'CUENTAS CONTABLES'!C134,IF('1. Autorización'!$I$6=\"Sur\",'CUENTAS CONTABLES'!D134,IF('1. Autorización'!$I$6=\"Colegio Americano del Sur\",'CUENTAS CONTABLES'!E134,'CUENTAS CONTABLES'!B134)))","v":"1-2-1-001-07-01"}]
["CTA X PAG RELACIONADAS (TEMP REST)","1-2-1-001-08-01","4-2-1-001-08-01","3-2-1-001-08-01","7-2-1-001-08-01",{"$f":"IF('1. Autorización'!$I$6=\"Altiplano\",'CUENTAS CONTABLES'!C135,IF('1. Autorización'!$I$6=\"Sur\",'CUENTAS CONTABLES'!D135,IF('1. Autorización'!$I$6=\"Colegio Americano del Sur\",'CUENTAS CONTABLES'!E135,'CUENTAS CONTABLES'!B135)))","v":"1-2-1-001-08-01"}]
["CTA X PAG SEDE A FONDO BECAS","1-2-1-001-05-05","4-2-1-001-05-05","3-2-1-001-05-05","7-2-1-001-05-05",{"$f":"IF('1. Autorización'!$I$6=\"Altiplano\",'CUENTAS CONTABLES'!C136,IF('1. Autorización'!$I$6=\"Sur\",'CUENTAS CONTABLES'!D136,IF('1. Autorización'!$I$6=\"Colegio Americano del Sur\",'CUENTAS CONTABLES'!E136,'CUENTAS CONTABLES'!B136)))","v":"1-2-1-001-05-05"}]
["CTA X PAG SEDE A FONDOS","1-2-1-001-05-03","4-2-1-001-05-03","3-2-1-001-05-03","7-2-1-001-05-03",{"$f":"IF('1. Autorización'!$I$6=\"Altiplano\",'CUENTAS CONTABLES'!C137,IF('1. Autorización'!$I$6=\"Sur\",'CUENTAS CONTABLES'!D137,IF('1. Autorización'!$I$6=\"Colegio Americano del Sur\",'CUENTAS CONTABLES'!E137,'CUENTAS CONTABLES'!B137)))","v":"1-2-1-001-05-03"}]
["CTA X PAG SEDE A FONDOS (CON RUBROS)","1-2-1-001-05-04","4-2-1-001-05-04","3-2-1-001-05-04","7-2-1-001-05-04",{"$f":"IF('1. Autorización'!$I$6=\"Altiplano\",'CUENTAS CONTABLES'!C138,IF('1. Autorización'!$I$6=\"Sur\",'CUENTAS CONTABLES'!D138,IF('1. Autorización'!$I$6=\"Colegio Americano del Sur\",'CUENTAS CONTABLES'!E138,'CUENTAS CONTABLES'!B138)))","v":"1-2-1-001-05-04"}]
["CTA X PAG SEDE A PROY OAII (CON PRESU)","1-2-1-001-05-02","4-2-1-001-05-02","3-2-1-001-05-02","7-2-1-001-05-02",{"$f":"IF('1. Autorización'!$I$6=\"Altiplano\",'CUENTAS CONTABLES'!C139,IF('1. Autorización'!$I$6=\"Sur\",'CUENTAS CONTABLES'!D139,IF('1. Autorización'!$I$6=\"Colegio Americano del Sur\",'CUENTAS CONTABLES'!E139,'CUENTAS CONTABLES'!B139)))","v":"1-2-1-001-05-02"}]
["CTA X PAG SEDE A PROY OAII (SIN PRESU)","1-2-1-001-05-01","4-2-1-001-05-01","3-2-1-001-05-01","7-2-1-001-05-01",{"$f":"IF('1. Autorización'!$I$6=\"Altiplano\",'CUENTAS CONTABLES'!C140,IF('1. Autorización'!$I$6=\"Sur\",'CUENTAS CONTABLES'!D140,IF('1. Autorización'!$I$6=\"Colegio Americano del Sur\",'CUENTAS CONTABLES'!E140,'CUENTAS CONTABLES'!B140)))","v":"1-2-1-001-05-01"}]
["CTA X PAG TEMPORAL RELACIONADA (NO REST)","1-2-1-001-07-02","4-2-1-001-07-02","3-2-1-001-07-02","7-2-1-001-07-02",{"$f":"IF('1. Autorización'!$I$6=\"Altiplano\",'CUENTAS CONTABLES'!C141,IF('1. Autorización'!$I$6=\"Sur\",'CUENTAS CONTABLES'!D141,IF('1. Autorización'!$I$6=\"Colegio Americano del Sur\",'CUENTAS CONTABLES'!E141,'CUENTAS CONTABLES'!B141)))","v":"1-2-1-001-07-02"}]
["CTA X PAG TRANSITORIA A TERCEROS","1-2-1-001-04-93","4-2-1-001-04-93","3-2-1-001-04-93","7-2-1-001-04-93",{"$f":"IF('1. Autorización'!$I$6=\"Altiplano\",'CUENTAS CONTABLES'!C142,IF('1. Autorización'!$I$6=\"Sur\",'CUENTAS CONTABLES'!D142,IF('1. Autorización'!$I$6=\"Colegio Americano del Sur\",'CUENTAS CONTABLES'!E142,'CUENTAS CONTABLES'!B142)))","v":"1-2-1-001-04-93"}]
["CTA X PAG TRANSITORIA FONDOS (CON RUBROS) A SEDE","1-2-1-001-04-96","4-2-1-001-04-96","3-2-1-001-04-96","7-2-1-001-04-96",{"$f":"IF('1. Autorización'!$I$6=\"Altiplano\",'CUENTAS CONTABLES'!C143,IF('1. Autorización'!$I$6=\"Sur\",'CUENTAS CONTABLES'!D143,IF('1. Autorización'!$I$6=\"Colegio Americano del Sur\",'CUENTAS CONTABLES'!E143,'CUENTAS CONTABLES'!B143)))","v":"1-2-1-001-04-96"}]
["CTA X PAG TRANSITORIA FONDOS A SEDE","1-2-1-001-04-97","4-2-1-001-04-97","3-2-1-001-04-97","7-2-1-001-04-97",{"$f":"IF('1. Autorización'!$I$6=\"Altiplano\",'CUENTAS CONTABLES'!C144,IF('1. Autorización'!$I$6=\"Sur\",'CUENTAS CONTABLES'!D144,IF('1. Autorización'!$I$6=\"Colegio Americano del Sur\",'CUENTAS CONTABLES'!E144,'CUENTAS CONTABLES'!B144)))","v":"1-2-1-001-04-97"}]
["CTA X PAG TRANSITORIA FONDOS BECAS A SEDE","1-2-1-001-04-95","4-2-1-001-04-95","3-2-1-001-04-95","7-2-1-001-04-95",{"$f":"IF('1. Autorización'!$I$6=\"Altiplano\",'CUENTAS CONTABLES'!C145,IF('1. Autorización'!$I$6=\"Sur\",'CUENTAS CONTABLES'!D145,IF('1. Autorización'!$I$6=\"Colegio Americano del Sur\",'CUENTAS CONTABLES'!E145,'CUENTAS CONTABLES'!B145)))","v":"1-2-1-001-04-95"}]
["CTA X PAG TRANSITORIA PRO A PRO","1-2-1-001-04-94","4-2-1-001-04-94","3-2-1-001-04-94","7-2-1-001-04-94",{"$f":"IF('1. Autorización'!$I$6=\"Altiplano\",'CUENTAS CONTABLES'!C146,IF('1. Autorización'!$I$6=\"Sur\",'CUENTAS CONTABLES'!D146,IF('1. Autorización'!$I$6=\"Colegio Americano del Sur\",'CUENTAS CONTABLES'!E146,'CUENTAS CONTABLES'!B146)))","v":"1-2-1-001-04-94"}]
["CTA X PAG TRANSITORIA PROY OAII (CON PRESU) A SEDE","1-2-1-001-04-98","4-2-1-001-04-98","3-2-1-001-04-98","7-2-1-001-04-98",{"$f":"IF('1. Autorización'!$I$6=\"Altiplano\",'CUENTAS CONTABLES'!C147,IF('1. Autorización'!$I$6=\"Sur\",'CUENTAS CONTABLES'!D147,IF('1. Autorización'!$I$6=\"Colegio Americano del Sur\",'CUENTAS CONTABLES'!E147,'CUENTAS CONTABLES'!B147)))","v":"1-2-1-001-04-98"}]
["CTA X PAG TRANSITORIA PROY OAII (SIN PRESU) A SEDE","1-2-1-001-04-99","4-2-1-001-04-99","3-2-1-001-04-99","7-2-1-001-04-99",{"$f":"IF('1. Autorización'!$I$6=\"Altiplano\",'CUENTAS CONTABLES'!C148,IF('1. Autorización'!$I$6=\"Sur\",'CUENTAS CONTABLES'!D148,IF('1. Autorización'!$I$6=\"Colegio Americano del Sur\",'CUENTAS CONTABLES'!E148,'CUENTAS CONTABLES'!B148)))","v":"1-2-1-001-04-99"}]
["CTA X PAG TRANSITORIA SEDE A FONDO BECAS","1-2-1-001-05-95","4-2-1-001-05-95","3-2-1-001-05-95","7-2-1-001-05-95",{"$f":"IF('1. Autorización'!$I$6=\"Altiplano\",'CUENTAS CONTABLES'!C149,IF('1. Autorización'!$I$6=\"Sur\",'CUENTAS CONTABLES'!D149,IF('1. Autorización'!$I$6=\"Colegio Americano del Sur\",'CUENTAS CONTABLES'!E149,'CUENTAS CONTABLES'!B149)))","v":"1-2-1-001-05-95"}]
["CTA X PAG TRANSITORIA SEDE A FONDOS","1-2-1-001-05-97","4-2-1-001-05-97","3-2-1-001-05-97","7-2-1-001-05-97",{"$f":"IF('1. Autorización'!$I$6=\"Altiplano\",'CUENTAS CONTABLES'!C150,IF('1. Autorización'!$I$6=\"Sur\",'CUENTAS CONTABLES'!D150,IF('1. Autorización'!$I$6=\"Colegio Americano del Sur\",'CUENTAS CONTABLES'!E150,'CUENTAS CONTABLES'!B150)))","v":"1-2-1-001-05-97"}]
["CTA X PAG TRANSITORIA SEDE A FONDOS (CON RUBROS)","1-2-1-001-05-96","4-2-1-001-05-96","3-2-1-001-05-96","7-2-1-001-05-96",{"$f":"IF('1. Autorización'!$I$6=\"Altiplano\",'CUENTAS CONTABLES'!C151,IF('1. Autorización'!$I$6=\"Sur\",'CUENTAS CONTABLES'!D151,IF('1. Autorización'!$I$6=\"Colegio Americano del Sur\",'CUENTAS CONTABLES'!E151,'CUENTAS CONTABLES'!B151)))","v":"1-2-1-001-05-96"}]
["CTA X PAG TRANSITORIA SEDE A PROY OAII (CON PRESU)","1-2-1-001-05-98","4-2-1-001-05-98","3-2-1-001-05-98","7-2-1-001-05-98",{"$f":"IF('1. Autorización'!$I$6=\"Altiplano\",'CUENTAS CONTABLES'!C152,IF('1. Autorización'!$I$6=\"Sur\",'CUENTAS CONTABLES'!D152,IF('1. Autorización'!$I$6=\"Colegio Americano del Sur\",'CUENTAS CONTABLES'!E152,'CUENTAS CONTABLES'!B152)))","v":"1-2-1-001-05-98"}]
["CTA X PAG TRANSITORIA SEDE A PROY OAII (SIN PRESU)","1-2-1-001-05-99","4-2-1-001-05-99","3-2-1-001-05-99","7-2-1-001-05-99",{"$f":"IF('1. Autorización'!$I$6=\"Altiplano\",'CUENTAS CONTABLES'!C153,IF('1. Autorización'!$I$6=\"Sur\",'CUENTAS CONTABLES'!D153,IF('1. Autorización'!$I$6=\"Colegio Americano del Sur\",'CUENTAS CONTABLES'!E153,'CUENTAS CONTABLES'!B153)))","v":"1-2-1-001-05-99"}]
["CTA X PAGAR  PROYECTO A PROYECTO","1-2-1-001-04-06","4-2-1-001-04-06","3-2-1-001-04-06","7-2-1-001-04-06",{"$f":"IF('1. Autorización'!$I$6=\"Altiplano\",'CUENTAS CONTABLES'!C154,IF('1. Autorización'!$I$6=\"Sur\",'CUENTAS CONTABLES'!D154,IF('1. Autorización'!$I$6=\"Colegio Americano del Sur\",'CUENTAS CONTABLES'!E154,'CUENTAS CONTABLES'!B154)))","v":"1-2-1-001-04-06"}]
["CTA X PAGAR TEMPORAL RELACIONADAS (TEMP REST)","1-2-1-001-08-02","4-2-1-001-08-02","3-2-1-001-08-02","7-2-1-001-08-02",{"$f":"IF('1. Autorización'!$I$6=\"Altiplano\",'CUENTAS CONTABLES'!C155,IF('1. Autorización'!$I$6=\"Sur\",'CUENTAS CONTABLES'!D155,IF('1. Autorización'!$I$6=\"Colegio Americano del Sur\",'CUENTAS CONTABLES'!E155,'CUENTAS CONTABLES'!B155)))","v":"1-2-1-001-08-02"}]
["CUENTA POR PAGAR TRANSITORIA","1-2-1-001-01-97","4-2-1-001-01-97","3-2-1-001-01-97","7-2-1-001-01-97",{"$f":"IF('1. Autorización'!$I$6=\"Altiplano\",'CUENTAS CONTABLES'!C156,IF('1. Autorización'!$I$6=\"Sur\",'CUENTAS CONTABLES'!D156,IF('1. Autorización'!$I$6=\"Colegio Americano del Sur\",'CUENTAS CONTABLES'!E156,'CUENTAS CONTABLES'!B156)))","v":"1-2-1-001-01-97"}]
["CUENTA TRANSITORIA PARA LEGALIZACION","1-1-1-001-99-99","4-1-1-001-99-99","3-1-1-001-99-99","7-1-1-001-99-99",{"$f":"IF('1. Autorización'!$I$6=\"Altiplano\",'CUENTAS CONTABLES'!C157,IF('1. Autorización'!$I$6=\"Sur\",'CUENTAS CONTABLES'!D157,IF('1. Autorización'!$I$6=\"Colegio Americano del Sur\",'CUENTAS CONTABLES'!E157,'CUENTAS CONTABLES'!B157)))","v":"1-1-1-001-99-99"}]
["CUENTA TRANSITORIA PARA LEGALIZACIONES","1-1-1-003-01-96","4-1-1-003-01-96","3-1-1-003-01-96","7-1-1-003-01-96",{"$f":"IF('1. Autorización'!$I$6=\"Altiplano\",'CUENTAS CONTABLES'!C158,IF('1. Autorización'!$I$6=\"Sur\",'CUENTAS CONTABLES'!D158,IF('1. Autorización'!$I$6=\"Colegio Americano del Sur\",'CUENTAS CONTABLES'!E158,'CUENTAS CONTABLES'!B158)))","v":"1-1-1-003-01-96"}]
["CUENTA TRANSITORIA SEDES","1-1-1-003-05-99","4-1-1-003-05-99","3-1-1-003-05-99","7-1-1-003-05-99",{"$f":"IF('1. Autorización'!$I$6=\"Altiplano\",'CUENTAS CONTABLES'!C159,IF('1. Autorización'!$I$6=\"Sur\",'CUENTAS CONTABLES'!D159,IF('1. Autorización'!$I$6=\"Colegio Americano del Sur\",'CUENTAS CONTABLES'!E159,'CUENTAS CONTABLES'!B159)))","v":"1-1-1-003-05-99"}]
["CUENTA TRANSITORIA X COB CH RECHAZADO (OTROS)","1-1-1-003-01-95","4-1-1-003-01-95","3-1-1-003-01-95","7-1-1-003-01-95",{"$f":"IF('1. Autorización'!$I$6=\"Altiplano\",'CUENTAS CONTABLES'!C160,IF('1. Autorización'!$I$6=\"Sur\",'CUENTAS CONTABLES'!D160,IF('1. Autorización'!$I$6=\"Colegio Americano del Sur\",'CUENTAS CONTABLES'!E160,'CUENTAS CONTABLES'!B160)))","v":"1-1-1-003-01-95"}]
["CUENTA TRANSITORIA X COB CH.RECHAZADO (ESTUDIANTE)","1-1-1-003-01-94","4-1-1-003-01-94","3-1-1-003-01-94","7-1-1-003-01-94",{"$f":"IF('1. Autorización'!$I$6=\"Altiplano\",'CUENTAS CONTABLES'!C161,IF('1. Autorización'!$I$6=\"Sur\",'CUENTAS CONTABLES'!D161,IF('1. Autorización'!$I$6=\"Colegio Americano del Sur\",'CUENTAS CONTABLES'!E161,'CUENTAS CONTABLES'!B161)))","v":"1-1-1-003-01-94"}]
["CUENTAS INCOBRABLES","1-6-1-005-02-09","4-6-1-005-02-09","3-6-1-005-02-09","7-6-1-005-02-09",{"$f":"IF('1. Autorización'!$I$6=\"Altiplano\",'CUENTAS CONTABLES'!C162,IF('1. Autorización'!$I$6=\"Sur\",'CUENTAS CONTABLES'!D162,IF('1. Autorización'!$I$6=\"Colegio Americano del Sur\",'CUENTAS CONTABLES'!E162,'CUENTAS CONTABLES'!B162)))","v":"1-6-1-005-02-09"}]
["CUENTAS POR COBRAR  A FUVG","1-1-1-003-05-05","4-1-1-003-05-05","3-1-1-003-05-05","7-1-1-003-05-05",{"$f":"IF('1. Autorización'!$I$6=\"Altiplano\",'CUENTAS CONTABLES'!C163,IF('1. Autorización'!$I$6=\"Sur\",'CUENTAS CONTABLES'!D163,IF('1. Autorización'!$I$6=\"Colegio Americano del Sur\",'CUENTAS CONTABLES'!E163,'CUENTAS CONTABLES'!B163)))","v":"1-1-1-003-05-05"}]
["CUENTAS POR COBRAR  A PROESUR","1-1-1-003-05-03","4-1-1-003-05-03","3-1-1-003-05-03","7-1-1-003-05-03",{"$f":"IF('1. Autorización'!$I$6=\"Altiplano\",'CUENTAS CONTABLES'!C164,IF('1. Autorización'!$I$6=\"Sur\",'CUENTAS CONTABLES'!D164,IF('1. Autorización'!$I$6=\"Colegio Americano del Sur\",'CUENTAS CONTABLES'!E164,'CUENTAS CONTABLES'!B164)))","v":"1-1-1-003-05-03"}]
["CUENTAS POR COBRAR ASAZGUA","1-1-2-002-02-04","4-1-2-002-02-04","3-1-2-002-02-04","7-1-2-002-02-04",{"$f":"IF('1. Autorización'!$I$6=\"Altiplano\",'CUENTAS CONTABLES'!C165,IF('1. Autorización'!$I$6=\"Sur\",'CUENTAS CONTABLES'!D165,IF('1. Autorización'!$I$6=\"Colegio Americano del Sur\",'CUENTAS CONTABLES'!E165,'CUENTAS CONTABLES'!B165)))","v":"1-1-2-002-02-04"}]
["CUENTAS POR COBRAR ASISTENCIA TECNICA","1-1-1-003-03-03","4-1-1-003-03-03","3-1-1-003-03-03","7-1-1-003-03-03",{"$f":"IF('1. Autorización'!$I$6=\"Altiplano\",'CUENTAS CONTABLES'!C166,IF('1. Autorización'!$I$6=\"Sur\",'CUENTAS CONTABLES'!D166,IF('1. Autorización'!$I$6=\"Colegio Americano del Sur\",'CUENTAS CONTABLES'!E166,'CUENTAS CONTABLES'!B166)))","v":"1-1-1-003-03-03"}]
["CUENTAS POR LIQUIDAR","1-1-4-001-01-02","4-1-4-001-01-02","3-1-4-001-01-02","7-1-4-001-01-02",{"$f":"IF('1. Autorización'!$I$6=\"Altiplano\",'CUENTAS CONTABLES'!C167,IF('1. Autorización'!$I$6=\"Sur\",'CUENTAS CONTABLES'!D167,IF('1. Autorización'!$I$6=\"Colegio Americano del Sur\",'CUENTAS CONTABLES'!E167,'CUENTAS CONTABLES'!B167)))","v":"1-1-4-001-01-02"}]
["CUENTAS POR LIQUIDAR (DEFINITIVA)","1-1-4-001-01-07","4-1-4-001-01-07","3-1-4-001-01-07","7-1-4-001-01-07",{"$f":"IF('1. Autorización'!$I$6=\"Altiplano\",'CUENTAS CONTABLES'!C168,IF('1. Autorización'!$I$6=\"Sur\",'CUENTAS CONTABLES'!D168,IF('1. Autorización'!$I$6=\"Colegio Americano del Sur\",'CUENTAS CONTABLES'!E168,'CUENTAS CONTABLES'!B168)))","v":"1-1-4-001-01-07"}]
["CUENTAS POR LIQUIDAR BANCO INDUSTRIAL (C. CH.)","1-1-4-001-01-03","4-1-4-001-01-03","3-1-4-001-01-03","7-1-4-001-01-03",{"$f":"IF('1. Autorización'!$I$6=\"Altiplano\",'CUENTAS CONTABLES'!C169,IF('1. Autorización'!$I$6=\"Sur\",'CUENTAS CONTABLES'!D169,IF('1. Autorización'!$I$6=\"Colegio Americano del Sur\",'CUENTAS CONTABLES'!E169,'CUENTAS CONTABLES'!B169)))","v":"1-1-4-001-01-03"}]
["CUENTAS POR LIQUIDAR INVENTARIO COLLEGE BOARD","1-2-3-001-01-01","4-2-3-001-01-01","3-2-3-001-01-01","1-2-3-001-01-01",{"$f":"IF('1. Autorización'!$I$6=\"Altiplano\",'CUENTAS CONTABLES'!C170,IF('1. Autorización'!$I$6=\"Sur\",'CUENTAS CONTABLES'!D170,IF('1. Autorización'!$I$6=\"Colegio Americano del Sur\",'CUENTAS CONTABLES'!E170,'CUENTAS CONTABLES'!B170)))","v":"1-2-3-001-01-01"}]
["CUENTAS POR PAGAR A CAS","1-2-1-001-03-06","4-2-1-001-03-06","3-2-1-001-03-06","7-2-1-001-03-06",{"$f":"IF('1. Autorización'!$I$6=\"Altiplano\",'CUENTAS CONTABLES'!C171,IF('1. Autorización'!$I$6=\"Sur\",'CUENTAS CONTABLES'!D171,IF('1. Autorización'!$I$6=\"Colegio Americano del Sur\",'CUENTAS CONTABLES'!E171,'CUENTAS CONTABLES'!B171)))","v":"1-2-1-001-03-06"}]
["CUENTAS POR PAGAR A ESTUDIANTES","1-2-1-001-01-05","4-2-1-001-01-05","3-2-1-001-01-05","7-2-1-001-01-05",{"$f":"IF('1. Autorización'!$I$6=\"Altiplano\",'CUENTAS CONTABLES'!C172,IF('1. Autorización'!$I$6=\"Sur\",'CUENTAS CONTABLES'!D172,IF('1. Autorización'!$I$6=\"Colegio Americano del Sur\",'CUENTAS CONTABLES'!E172,'CUENTAS CONTABLES'!B172)))","v":"1-2-1-001-01-05"}]
["CUENTAS POR PAGAR A NOMBRE DE TERCEROS","1-2-1-001-01-04","4-2-1-001-01-04","3-2-1-001-01-04","7-2-1-001-01-04",{"$f":"IF('1. Autorización'!$I$6=\"Altiplano\",'CUENTAS CONTABLES'!C173,IF('1. Autorización'!$I$6=\"Sur\",'CUENTAS CONTABLES'!D173,IF('1. Autorización'!$I$6=\"Colegio Americano del Sur\",'CUENTAS CONTABLES'!E173,'CUENTAS CONTABLES'!B173)))","v":"1-2-1-001-01-04"}]
["CUENTAS POR PAGAR EMPLEADOS","1-2-1-007-02-01","4-2-1-007-02-01","3-2-1-007-02-01","7-2-1-007-02-01",{"$f":"IF('1. Autorización'!$I$6=\"Altiplano\",'CUENTAS CONTABLES'!C174,IF('1. Autorización'!$I$6=\"Sur\",'CUENTAS CONTABLES'!D174,IF('1. Autorización'!$I$6=\"Colegio Americano del Sur\",'CUENTAS CONTABLES'!E174,'CUENTAS CONTABLES'!B174)))","v":"1-2-1-007-02-01"}]
["CUENTAS POR PAGAR LIQUIDACIONES","1-2-1-001-01-03","4-2-1-001-01-03","3-2-1-001-01-03","7-2-1-001-01-03",{"$f":"IF('1. Autorización'!$I$6=\"Altiplano\",'CUENTAS CONTABLES'!C175,IF('1. Autorización'!$I$6=\"Sur\",'CUENTAS CONTABLES'!D175,IF('1. Autorización'!$I$6=\"Colegio Americano del Sur\",'CUENTAS CONTABLES'!E175,'CUENTAS CONTABLES'!B175)))","v":"1-2-1-001-01-03"}]
["CUENTAS POR PAGAR PROVEEDORES DE BIENES","1-2-1-001-01-01","4-2-1-001-01-01","3-2-1-001-01-01","7-2-1-001-01-01",{"$f":"IF('1. Autorización'!$I$6=\"Altiplano\",'CUENTAS CONTABLES'!C176,IF('1. Autorización'!$I$6=\"Sur\",'CUENTAS CONTABLES'!D176,IF('1. Autorización'!$I$6=\"Colegio Americano del Sur\",'CUENTAS CONTABLES'!E176,'CUENTAS CONTABLES'!B176)))","v":"1-2-1-001-01-01"}]
["CUENTAS POR PAGAR PROVEEDORES DE SERVICIOS","1-2-1-001-01-02","4-2-1-001-01-02","3-2-1-001-01-02","7-2-1-001-01-02",{"$f":"IF('1. Autorización'!$I$6=\"Altiplano\",'CUENTAS CONTABLES'!C177,IF('1. Autorización'!$I$6=\"Sur\",'CUENTAS CONTABLES'!D177,IF('1. Autorización'!$I$6=\"Colegio Americano del Sur\",'CUENTAS CONTABLES'!E177,'CUENTAS CONTABLES'!B177)))","v":"1-2-1-001-01-02"}]
["CUENTAS POR PAGAR TARJETA CUSCATLAN","1-2-1-001-06-01","4-2-1-001-06-01","3-2-1-001-06-01","7-2-1-001-06-01",{"$f":"IF('1. Autorización'!$I$6=\"Altiplano\",'CUENTAS CONTABLES'!C178,IF('1. Autorización'!$I$6=\"Sur\",'CUENTAS CONTABLES'!D178,IF('1. Autorización'!$I$6=\"Colegio Americano del Sur\",'CUENTAS CONTABLES'!E178,'CUENTAS CONTABLES'!B178)))","v":"1-2-1-001-06-01"}]
["CUENTAS POR PAGAR TRANSITORIA (NOMINAS)","1-2-1-003-01-99","4-2-1-003-01-99","3-2-1-003-01-99","7-2-1-003-01-99",{"$f":"IF('1. Autorización'!$I$6=\"Altiplano\",'CUENTAS CONTABLES'!C179,IF('1. Autorización'!$I$6=\"Sur\",'CUENTAS CONTABLES'!D179,IF('1. Autorización'!$I$6=\"Colegio Americano del Sur\",'CUENTAS CONTABLES'!E179,'CUENTAS CONTABLES'!B179)))","v":"1-2-1-003-01-99"}]
["CUOTA LABORAL IGSS","1-2-1-003-01-05","4-2-1-003-01-05","3-2-1-003-01-05","7-2-1-003-01-05",{"$f":"IF('1. Autorización'!$I$6=\"Altiplano\",'CUENTAS CONTABLES'!C180,IF('1. Autorización'!$I$6=\"Sur\",'CUENTAS CONTABLES'!D180,IF('1. Autorización'!$I$6=\"Colegio Americano del Sur\",'CUENTAS CONTABLES'!E180,'CUENTAS CONTABLES'!B180)))","v":"1-2-1-003-01-05"}]
["CUOTA PATRONAL IGSS","1-6-1-001-04-06","4-6-1-001-04-06","3-6-1-001-04-06","7-6-1-001-04-06",{"$f":"IF('1. Autorización'!$I$6=\"Altiplano\",'CUENTAS CONTABLES'!C181,IF('1. Autorización'!$I$6=\"Sur\",'CUENTAS CONTABLES'!D181,IF('1. Autorización'!$I$6=\"Colegio Americano del Sur\",'CUENTAS CONTABLES'!E181,'CUENTAS CONTABLES'!B181)))","v":"1-6-1-001-04-06"}]
["CUOTAS","1-5-1-001-01-02","4-5-1-001-01-02","3-5-1-001-01-02","7-5-1-001-01-02",{"$f":"IF('1. Autorización'!$I$6=\"Altiplano\",'CUENTAS CONTABLES'!C182,IF('1. Autorización'!$I$6=\"Sur\",'CUENTAS CONTABLES'!D182,IF('1. Autorización'!$I$6=\"Colegio Americano del Sur\",'CUENTAS CONTABLES'!E182,'CUENTAS CONTABLES'!B182)))","v":"1-5-1-001-01-02"}]
["CUOTAS AÑOS ANTERIORES","1-5-1-001-02-10","4-5-1-001-02-10","3-5-1-001-02-10","7-5-1-001-02-10",{"$f":"IF('1. Autorización'!$I$6=\"Altiplano\",'CUENTAS CONTABLES'!C183,IF('1. Autorización'!$I$6=\"Sur\",'CUENTAS CONTABLES'!D183,IF('1. Autorización'!$I$6=\"Colegio Americano del Sur\",'CUENTAS CONTABLES'!E183,'CUENTAS CONTABLES'!B183)))","v":"1-5-1-001-02-10"}]
["CUOTAS Y SUSCRIPCIONES","1-6-1-003-02-06","4-6-1-003-02-06","3-6-1-003-02-06","7-6-1-003-02-06",{"$f":"IF('1. Autorización'!$I$6=\"Altiplano\",'CUENTAS CONTABLES'!C184,IF('1. Autorización'!$I$6=\"Sur\",'CUENTAS CONTABLES'!D184,IF('1. Autorización'!$I$6=\"Colegio Americano del Sur\",'CUENTAS CONTABLES'!E184,'CUENTAS CONTABLES'!B184)))","v":"1-6-1-003-02-06"}]
["CURSOS APROBADOS SIN CREDITOS ACADEMICOS","1-5-1-001-01-05","4-5-1-001-01-05","3-5-1-001-01-05","7-5-1-001-01-05",{"$f":"IF('1. Autorización'!$I$6=\"Altiplano\",'CUENTAS CONTABLES'!C185,IF('1. Autorización'!$I$6=\"Sur\",'CUENTAS CONTABLES'!D185,IF('1. Autorización'!$I$6=\"Colegio Americano del Sur\",'CUENTAS CONTABLES'!E185,'CUENTAS CONTABLES'!B185)))","v":"1-5-1-001-01-05"}]
["CURSOS SEMINARIOS Y EVENTOS","1-6-1-004-01-02","4-6-1-004-01-02","3-6-1-004-01-02","7-6-1-004-01-02",{"$f":"IF('1. Autorización'!$I$6=\"Altiplano\",'CUENTAS CONTABLES'!C186,IF('1. Autorización'!$I$6=\"Sur\",'CUENTAS CONTABLES'!D186,IF('1. Autorización'!$I$6=\"Colegio Americano del Sur\",'CUENTAS CONTABLES'!E186,'CUENTAS CONTABLES'!B186)))","v":"1-6-1-004-01-02"}]
["CUSCATLAN BANK NO RESTRINGIDO (INT.X COB.S/INV)","1-1-1-003-08-13","4-1-1-003-08-13","3-1-1-003-08-13","7-1-1-003-08-13",{"$f":"IF('1. Autorización'!$I$6=\"Altiplano\",'CUENTAS CONTABLES'!C187,IF('1. Autorización'!$I$6=\"Sur\",'CUENTAS CONTABLES'!D187,IF('1. Autorización'!$I$6=\"Colegio Americano del Sur\",'CUENTAS CONTABLES'!E187,'CUENTAS CONTABLES'!B187)))","v":"1-1-1-003-08-13"}]
["CUSCATLAN BANK TEMPORAL.RESTRINGIDO (INTXCOB.INV)","1-1-1-003-08-14","4-1-1-003-08-14","3-1-1-003-08-14","7-1-1-003-08-14",{"$f":"IF('1. Autorización'!$I$6=\"Altiplano\",'CUENTAS CONTABLES'!C188,IF('1. Autorización'!$I$6=\"Sur\",'CUENTAS CONTABLES'!D188,IF('1. Autorización'!$I$6=\"Colegio Americano del Sur\",'CUENTAS CONTABLES'!E188,'CUENTAS CONTABLES'!B188)))","v":"1-1-1-003-08-14"}]
["DEBITOS BANCARIOS EN TRANSITO","1-1-1-003-01-25","4-1-1-003-01-25","3-1-1-003-01-25","7-1-1-003-01-25",{"$f":"IF('1. Autorización'!$I$6=\"Altiplano\",'CUENTAS CONTABLES'!C189,IF('1. Autorización'!$I$6=\"Sur\",'CUENTAS CONTABLES'!D189,IF('1. Autorización'!$I$6=\"Colegio Americano del Sur\",'CUENTAS CONTABLES'!E189,'CUENTAS CONTABLES'!B189)))","v":"1-1-1-003-01-25"}]
["DEPOSITO DE AGUA POTABLE","1-1-4-001-02-02","4-1-4-001-02-02","3-1-4-001-02-02","7-1-4-001-02-02",{"$f":"IF('1. Autorización'!$I$6=\"Altiplano\",'CUENTAS CONTABLES'!C190,IF('1. Autorización'!$I$6=\"Sur\",'CUENTAS CONTABLES'!D190,IF('1. Autorización'!$I$6=\"Colegio Americano del Sur\",'CUENTAS CONTABLES'!E190,'CUENTAS CONTABLES'!B190)))","v":"1-1-4-001-02-02"}]
["DEPOSITO DE ARRENDAMIENTOS","1-1-4-001-02-04","4-1-4-001-02-04","3-1-4-001-02-04","7-1-4-001-02-04",{"$f":"IF('1. Autorización'!$I$6=\"Altiplano\",'CUENTAS CONTABLES'!C191,IF('1. Autorización'!$I$6=\"Sur\",'CUENTAS CONTABLES'!D191,IF('1. Autorización'!$I$6=\"Colegio Americano del Sur\",'CUENTAS CONTABLES'!E191,'CUENTAS CONTABLES'!B191)))","v":"1-1-4-001-02-04"}]
["DEPOSITO DE ENERGIA ELECTRICA","1-1-4-001-02-01","4-1-4-001-02-01","3-1-4-001-02-01","7-1-4-001-02-01",{"$f":"IF('1. Autorización'!$I$6=\"Altiplano\",'CUENTAS CONTABLES'!C192,IF('1. Autorización'!$I$6=\"Sur\",'CUENTAS CONTABLES'!D192,IF('1. Autorización'!$I$6=\"Colegio Americano del Sur\",'CUENTAS CONTABLES'!E192,'CUENTAS CONTABLES'!B192)))","v":"1-1-4-001-02-01"}]
["DEPOSITO DE TELEFONOS","1-1-4-001-02-03","4-1-4-001-02-03","3-1-4-001-02-03","7-1-4-001-02-03",{"$f":"IF('1. Autorización'!$I$6=\"Altiplano\",'CUENTAS CONTABLES'!C193,IF('1. Autorización'!$I$6=\"Sur\",'CUENTAS CONTABLES'!D193,IF('1. Autorización'!$I$6=\"Colegio Americano del Sur\",'CUENTAS CONTABLES'!E193,'CUENTAS CONTABLES'!B193)))","v":"1-1-4-001-02-03"}]
["DEPOSITOS EN CUSTODIA","1-1-4-001-02-06","4-1-4-001-02-06","3-1-4-001-02-06","7-1-4-001-02-06",{"$f":"IF('1. Autorización'!$I$6=\"Altiplano\",'CUENTAS CONTABLES'!C194,IF('1. Autorización'!$I$6=\"Sur\",'CUENTAS CONTABLES'!D194,IF('1. Autorización'!$I$6=\"Colegio Americano del Sur\",'CUENTAS CONTABLES'!E194,'CUENTAS CONTABLES'!B194)))","v":"1-1-4-001-02-06"}]
["DEPOSITOS VARIOS POR PAGAR","1-2-1-009-01-02","4-2-1-009-01-02","3-2-1-009-01-02","7-2-1-009-01-02",{"$f":"IF('1. Autorización'!$I$6=\"Altiplano\",'CUENTAS CONTABLES'!C195,IF('1. Autorización'!$I$6=\"Sur\",'CUENTAS CONTABLES'!D195,IF('1. Autorización'!$I$6=\"Colegio Americano del Sur\",'CUENTAS CONTABLES'!E195,'CUENTAS CONTABLES'!B195)))","v":"1-2-1-009-01-02"}]
["DEPRE ACUM  MOBILIARIO GENERAL  (TEMP)","1-1-3-001-04-98","4-1-3-001-04-98","3-1-3-001-04-98","7-1-3-001-04-98",{"$f":"IF('1. Autorización'!$I$6=\"Altiplano\",'CUENTAS CONTABLES'!C196,IF('1. Autorización'!$I$6=\"Sur\",'CUENTAS CONTABLES'!D196,IF('1. Autorización'!$I$6=\"Colegio Americano del Sur\",'CUENTAS CONTABLES'!E196,'CUENTAS CONTABLES'!B196)))","v":"1-1-3-001-04-98"}]
["DEPRE ACUM EQUIPO COMPUTACION (TEMP)","1-1-3-001-08-98","4-1-3-001-08-98","3-1-3-001-08-98","7-1-3-001-08-98",{"$f":"IF('1. Autorización'!$I$6=\"Altiplano\",'CUENTAS CONTABLES'!C197,IF('1. Autorización'!$I$6=\"Sur\",'CUENTAS CONTABLES'!D197,IF('1. Autorización'!$I$6=\"Colegio Americano del Sur\",'CUENTAS CONTABLES'!E197,'CUENTAS CONTABLES'!B197)))","v":"1-1-3-001-08-98"}]
["DEPRE ACUM EQUIPO DE COMPUTACION","1-1-3-001-08-99","4-1-3-001-08-99","3-1-3-001-08-99","7-1-3-001-08-99",{"$f":"IF('1. Autorización'!$I$6=\"Altiplano\",'CUENTAS CONTABLES'!C198,IF('1. Autorización'!$I$6=\"Sur\",'CUENTAS CONTABLES'!D198,IF('1. Autorización'!$I$6=\"Colegio Americano del Sur\",'CUENTAS CONTABLES'!E198,'CUENTAS CONTABLES'!B198)))","v":"1-1-3-001-08-99"}]
["DEPRE ACUM EQUIPO GENERAL","1-1-3-001-05-99","4-1-3-001-05-99","3-1-3-001-05-99","7-1-3-001-05-99",{"$f":"IF('1. Autorización'!$I$6=\"Altiplano\",'CUENTAS CONTABLES'!C199,IF('1. Autorización'!$I$6=\"Sur\",'CUENTAS CONTABLES'!D199,IF('1. Autorización'!$I$6=\"Colegio Americano del Sur\",'CUENTAS CONTABLES'!E199,'CUENTAS CONTABLES'!B199)))","v":"1-1-3-001-05-99"}]
["DEPRE ACUM EQUIPO GENERAL (TEMP)","1-1-3-001-05-98","4-1-3-001-05-98","3-1-3-001-05-98","7-1-3-001-05-98",{"$f":"IF('1. Autorización'!$I$6=\"Altiplano\",'CUENTAS CONTABLES'!C200,IF('1. Autorización'!$I$6=\"Sur\",'CUENTAS CONTABLES'!D200,IF('1. Autorización'!$I$6=\"Colegio Americano del Sur\",'CUENTAS CONTABLES'!E200,'CUENTAS CONTABLES'!B200)))","v":"1-1-3-001-05-98"}]
["DEPRE ACUM MAQUINARIA","1-1-3-001-07-99","4-1-3-001-07-99","3-1-3-001-07-99","7-1-3-001-07-99",{"$f":"IF('1. Autorización'!$I$6=\"Altiplano\",'CUENTAS CONTABLES'!C201,IF('1. Autorización'!$I$6=\"Sur\",'CUENTAS CONTABLES'!D201,IF('1. Autorización'!$I$6=\"Colegio Americano del Sur\",'CUENTAS CONTABLES'!E201,'CUENTAS CONTABLES'!B201)))","v":"1-1-3-001-07-99"}]
["DEPRE ACUM MAQUINARIA (TEMP)","1-1-3-001-07-98","4-1-3-001-07-98","3-1-3-001-07-98","7-1-3-001-07-98",{"$f":"IF('1. Autorización'!$I$6=\"Altiplano\",'CUENTAS CONTABLES'!C202,IF('1. Autorización'!$I$6=\"Sur\",'CUENTAS CONTABLES'!D202,IF('1. Autorización'!$I$6=\"Colegio Americano del Sur\",'CUENTAS CONTABLES'!E202,'CUENTAS CONTABLES'!B202)))","v":"1-1-3-001-07-98"}]
["DEPRE ACUM MOBILIARIO GENERAL","1-1-3-001-04-99","4-1-3-001-04-99","3-1-3-001-04-99","7-1-3-001-04-99",{"$f":"IF('1. Autorización'!$I$6=\"Altiplano\",'CUENTAS CONTABLES'!C203,IF('1. Autorización'!$I$6=\"Sur\",'CUENTAS CONTABLES'!D203,IF('1. Autorización'!$I$6=\"Colegio Americano del Sur\",'CUENTAS CONTABLES'!E203,'CUENTAS CONTABLES'!B203)))","v":"1-1-3-001-04-99"}]
["DEPRE ACUM VEHICULOS","1-1-3-001-06-99","4-1-3-001-06-99","3-1-3-001-06-99","7-1-3-001-06-99",{"$f":"IF('1. Autorización'!$I$6=\"Altiplano\",'CUENTAS CONTABLES'!C204,IF('1. Autorización'!$I$6=\"Sur\",'CUENTAS CONTABLES'!D204,IF('1. Autorización'!$I$6=\"Colegio Americano del Sur\",'CUENTAS CONTABLES'!E204,'CUENTAS CONTABLES'!B204)))","v":"1-1-3-001-06-99"}]
["DEPRE ACUM VEHICULOS (BUSES Y OTROS)","1-1-3-001-06-97","4-1-3-001-06-97","3-1-3-001-06-97","7-1-3-001-06-97",{"$f":"IF('1. Autorización'!$I$6=\"Altiplano\",'CUENTAS CONTABLES'!C205,IF('1. Autorización'!$I$6=\"Sur\",'CUENTAS CONTABLES'!D205,IF('1. Autorización'!$I$6=\"Colegio Americano del Sur\",'CUENTAS CONTABLES'!E205,'CUENTAS CONTABLES'!B205)))","v":"1-1-3-001-06-97"}]
["DEPRE ACUM VEHICULOS (TEMP)","1-1-3-001-06-98","4-1-3-001-06-98","3-1-3-001-06-98","7-1-3-001-06-98",{"$f":"IF('1. Autorización'!$I$6=\"Altiplano\",'CUENTAS CONTABLES'!C206,IF('1. Autorización'!$I$6=\"Sur\",'CUENTAS CONTABLES'!D206,IF('1. Autorización'!$I$6=\"Colegio Americano del Sur\",'CUENTAS CONTABLES'!E206,'CUENTAS CONTABLES'!B206)))","v":"1-1-3-001-06-98"}]
["DEPRECIACION ACUM EDIFICIOS E INSTALACIONES","1-1-3-001-02-99","4-1-3-001-02-99","3-1-3-001-02-99","7-1-3-001-02-99",{"$f":"IF('1. Autorización'!$I$6=\"Altiplano\",'CUENTAS CONTABLES'!C207,IF('1. Autorización'!$I$6=\"Sur\",'CUENTAS CONTABLES'!D207,IF('1. Autorización'!$I$6=\"Colegio Americano del Sur\",'CUENTAS CONTABLES'!E207,'CUENTAS CONTABLES'!B207)))","v":"1-1-3-001-02-99"}]
["DEPRECIACION ACUMULADA EDIF E INSTALACIONES (TEMP)","1-1-3-001-02-98","4-1-3-001-02-98","3-1-3-001-02-98","7-1-3-001-02-98",{"$f":"IF('1. Autorización'!$I$6=\"Altiplano\",'CUENTAS CONTABLES'!C208,IF('1. Autorización'!$I$6=\"Sur\",'CUENTAS CONTABLES'!D208,IF('1. Autorización'!$I$6=\"Colegio Americano del Sur\",'CUENTAS CONTABLES'!E208,'CUENTAS CONTABLES'!B208)))","v":"1-1-3-001-02-98"}]
["DEPRECIACIONES","1-6-1-005-02-10","4-6-1-005-02-10","3-6-1-005-02-10","7-6-1-005-02-10",{"$f":"IF('1. Autorización'!$I$6=\"Altiplano\",'CUENTAS CONTABLES'!C209,IF('1. Autorización'!$I$6=\"Sur\",'CUENTAS CONTABLES'!D209,IF('1. Autorización'!$I$6=\"Colegio Americano del Sur\",'CUENTAS CONTABLES'!E209,'CUENTAS CONTABLES'!B209)))","v":"1-6-1-005-02-10"}]
["DESCUENTOS JUDICIALES","1-2-1-003-01-01","4-2-1-003-01-01","3-2-1-003-01-01","7-2-1-003-01-01",{"$f":"IF('1. Autorización'!$I$6=\"Altiplano\",'CUENTAS CONTABLES'!C210,IF('1. Autorización'!$I$6=\"Sur\",'CUENTAS CONTABLES'!D210,IF('1. Autorización'!$I$6=\"Colegio Americano del Sur\",'CUENTAS CONTABLES'!E210,'CUENTAS CONTABLES'!B210)))","v":"1-2-1-003-01-01"}]
["DEUDORES - ESTUDIANTES REGULARES $","1-1-1-003-01-02","4-1-1-003-01-02","3-1-1-003-01-02","7-1-1-003-01-02",{"$f":"IF('1. Autorización'!$I$6=\"Altiplano\",'CUENTAS CONTABLES'!C211,IF('1. Autorización'!$I$6=\"Sur\",'CUENTAS CONTABLES'!D211,IF('1. Autorización'!$I$6=\"Colegio Americano del Sur\",'CUENTAS CONTABLES'!E211,'CUENTAS CONTABLES'!B211)))","v":"1-1-1-003-01-02"}]
["DEUDORES - ESTUDIANTES REGULARES Q","1-1-1-003-01-01","4-1-1-003-01-01","3-1-1-003-01-01","7-1-1-003-01-01",{"$f":"IF('1. Autorización'!$I$6=\"Altiplano\",'CUENTAS CONTABLES'!C212,IF('1. Autorización'!$I$6=\"Sur\",'CUENTAS CONTABLES'!D212,IF('1. Autorización'!$I$6=\"Colegio Americano del Sur\",'CUENTAS CONTABLES'!E212,'CUENTAS CONTABLES'!B212)))","v":"1-1-1-003-01-01"}]
["DEUDORES ARRENDAMIENTO","1-1-1-003-01-19","4-1-1-003-01-19","3-1-1-003-01-19","7-1-1-003-01-19",{"$f":"IF('1. Autorización'!$I$6=\"Altiplano\",'CUENTAS CONTABLES'!C213,IF('1. Autorización'!$I$6=\"Sur\",'CUENTAS CONTABLES'!D213,IF('1. Autorización'!$I$6=\"Colegio Americano del Sur\",'CUENTAS CONTABLES'!E213,'CUENTAS CONTABLES'!B213)))","v":"1-1-1-003-01-19"}]
["DEUDORES COLABORADORES","1-1-1-003-01-24","4-1-1-003-01-24","3-1-1-003-01-24","7-1-1-003-01-24",{"$f":"IF('1. Autorización'!$I$6=\"Altiplano\",'CUENTAS CONTABLES'!C214,IF('1. Autorización'!$I$6=\"Sur\",'CUENTAS CONTABLES'!D214,IF('1. Autorización'!$I$6=\"Colegio Americano del Sur\",'CUENTAS CONTABLES'!E214,'CUENTAS CONTABLES'!B214)))","v":"1-1-1-003-01-24"}]
["DEUDORES COLABORADORES (TRANSITORIA)","1-1-1-003-01-93","4-1-1-003-01-93","3-1-1-003-01-93","7-1-1-003-01-93",{"$f":"IF('1. Autorización'!$I$6=\"Altiplano\",'CUENTAS CONTABLES'!C215,IF('1. Autorización'!$I$6=\"Sur\",'CUENTAS CONTABLES'!D215,IF('1. Autorización'!$I$6=\"Colegio Americano del Sur\",'CUENTAS CONTABLES'!E215,'CUENTAS CONTABLES'!B215)))","v":"1-1-1-003-01-93"}]
["DEUDORES COLLEGE BOARD","1-1-1-003-01-14","4-1-1-003-01-14","3-1-1-003-01-14","7-1-1-003-01-14",{"$f":"IF('1. Autorización'!$I$6=\"Altiplano\",'CUENTAS CONTABLES'!C216,IF('1. Autorización'!$I$6=\"Sur\",'CUENTAS CONTABLES'!D216,IF('1. Autorización'!$I$6=\"Colegio Americano del Sur\",'CUENTAS CONTABLES'!E216,'CUENTAS CONTABLES'!B216)))","v":"1-1-1-003-01-14"}]
["DEUDORES DE SERVICIOS","1-1-1-003-01-09","4-1-1-003-01-09","3-1-1-003-01-09","7-1-1-003-01-09",{"$f":"IF('1. Autorización'!$I$6=\"Altiplano\",'CUENTAS CONTABLES'!C217,IF('1. Autorización'!$I$6=\"Sur\",'CUENTAS CONTABLES'!D217,IF('1. Autorización'!$I$6=\"Colegio Americano del Sur\",'CUENTAS CONTABLES'!E217,'CUENTAS CONTABLES'!B217)))","v":"1-1-1-003-01-09"}]
["DEUDORES DOMINIOS GT","1-1-1-003-01-13","4-1-1-003-01-13","3-1-1-003-01-13","7-1-1-003-01-13",{"$f":"IF('1. Autorización'!$I$6=\"Altiplano\",'CUENTAS CONTABLES'!C218,IF('1. Autorización'!$I$6=\"Sur\",'CUENTAS CONTABLES'!D218,IF('1. Autorización'!$I$6=\"Colegio Americano del Sur\",'CUENTAS CONTABLES'!E218,'CUENTAS CONTABLES'!B218)))","v":"1-1-1-003-01-13"}]
["DEUDORES DONANTE  BECA","1-1-1-003-01-18","4-1-1-003-01-18","3-1-1-003-01-18","7-1-1-003-01-18",{"$f":"IF('1. Autorización'!$I$6=\"Altiplano\",'CUENTAS CONTABLES'!C219,IF('1. Autorización'!$I$6=\"Sur\",'CUENTAS CONTABLES'!D219,IF('1. Autorización'!$I$6=\"Colegio Americano del Sur\",'CUENTAS CONTABLES'!E219,'CUENTAS CONTABLES'!B219)))","v":"1-1-1-003-01-18"}]
["DEUDORES DONANTES DE PROYECTOS","1-1-1-003-01-16","4-1-1-003-01-16","3-1-1-003-01-16","7-1-1-003-01-16",{"$f":"IF('1. Autorización'!$I$6=\"Altiplano\",'CUENTAS CONTABLES'!C220,IF('1. Autorización'!$I$6=\"Sur\",'CUENTAS CONTABLES'!D220,IF('1. Autorización'!$I$6=\"Colegio Americano del Sur\",'CUENTAS CONTABLES'!E220,'CUENTAS CONTABLES'!B220)))","v":"1-1-1-003-01-16"}]
["DEUDORES DONANTES FONDOS","1-1-1-003-01-17","4-1-1-003-01-17","3-1-1-003-01-17","7-1-1-003-01-17",{"$f":"IF('1. Autorización'!$I$6=\"Altiplano\",'CUENTAS CONTABLES'!C221,IF('1. Autorización'!$I$6=\"Sur\",'CUENTAS CONTABLES'!D221,IF('1. Autorización'!$I$6=\"Colegio Americano del Sur\",'CUENTAS CONTABLES'!E221,'CUENTAS CONTABLES'!B221)))","v":"1-1-1-003-01-17"}]
["DEUDORES EDUCACION CONTINUA","1-1-1-003-01-04","4-1-1-003-01-04","3-1-1-003-01-04","7-1-1-003-01-04",{"$f":"IF('1. Autorización'!$I$6=\"Altiplano\",'CUENTAS CONTABLES'!C222,IF('1. Autorización'!$I$6=\"Sur\",'CUENTAS CONTABLES'!D222,IF('1. Autorización'!$I$6=\"Colegio Americano del Sur\",'CUENTAS CONTABLES'!E222,'CUENTAS CONTABLES'!B222)))","v":"1-1-1-003-01-04"}]
["DEUDORES EMPLEADOS (REEMBOLSOS POR LIQUIDAR)","1-1-1-003-01-08","4-1-1-003-01-08","3-1-1-003-01-08","7-1-1-003-01-08",{"$f":"IF('1. Autorización'!$I$6=\"Altiplano\",'CUENTAS CONTABLES'!C223,IF('1. Autorización'!$I$6=\"Sur\",'CUENTAS CONTABLES'!D223,IF('1. Autorización'!$I$6=\"Colegio Americano del Sur\",'CUENTAS CONTABLES'!E223,'CUENTAS CONTABLES'!B223)))","v":"1-1-1-003-01-08"}]
["DEUDORES EMPLEADOS TRANSITORIA (REEMBOLSOS POR LIQ","1-1-1-003-01-99","4-1-1-003-01-99","3-1-1-003-01-99","7-1-1-003-01-99",{"$f":"IF('1. Autorización'!$I$6=\"Altiplano\",'CUENTAS CONTABLES'!C224,IF('1. Autorización'!$I$6=\"Sur\",'CUENTAS CONTABLES'!D224,IF('1. Autorización'!$I$6=\"Colegio Americano del Sur\",'CUENTAS CONTABLES'!E224,'CUENTAS CONTABLES'!B224)))","v":"1-1-1-003-01-99"}]
["DEUDORES ESTUDIANTES TRANSITORIA (COMPRAS - CXC)","1-1-1-003-01-97","4-1-1-003-01-97","3-1-1-003-01-97","7-1-1-003-01-97",{"$f":"IF('1. Autorización'!$I$6=\"Altiplano\",'CUENTAS CONTABLES'!C225,IF('1. Autorización'!$I$6=\"Sur\",'CUENTAS CONTABLES'!D225,IF('1. Autorización'!$I$6=\"Colegio Americano del Sur\",'CUENTAS CONTABLES'!E225,'CUENTAS CONTABLES'!B225)))","v":"1-1-1-003-01-97"}]
["DEUDORES INTERESES SOBRE AYUDAS FINANC.REEMBOLS.","1-1-1-003-01-12","4-1-1-003-01-12","3-1-1-003-01-12","7-1-1-003-01-12",{"$f":"IF('1. Autorización'!$I$6=\"Altiplano\",'CUENTAS CONTABLES'!C226,IF('1. Autorización'!$I$6=\"Sur\",'CUENTAS CONTABLES'!D226,IF('1. Autorización'!$I$6=\"Colegio Americano del Sur\",'CUENTAS CONTABLES'!E226,'CUENTAS CONTABLES'!B226)))","v":"1-1-1-003-01-12"}]
["DEUDORES POR AYUDA FINANCIERA REEMBOLSABLES (L.P)","1-1-2-002-01-01","4-1-2-002-01-01","3-1-2-002-01-01","7-1-2-002-01-01",{"$f":"IF('1. Autorización'!$I$6=\"Altiplano\",'CUENTAS CONTABLES'!C227,IF('1. Autorización'!$I$6=\"Sur\",'CUENTAS CONTABLES'!D227,IF('1. Autorización'!$I$6=\"Colegio Americano del Sur\",'CUENTAS CONTABLES'!E227,'CUENTAS CONTABLES'!B227)))","v":"1-1-2-002-01-01"}]
["DEUDORES POR CAPITAL  AYUDAS FINANC. REEMBOLSABLE","1-1-1-003-01-11","4-1-1-003-01-11","3-1-1-003-01-11","7-1-1-003-01-11",{"$f":"IF('1. Autorización'!$I$6=\"Altiplano\",'CUENTAS CONTABLES'!C228,IF('1. Autorización'!$I$6=\"Sur\",'CUENTAS CONTABLES'!D228,IF('1. Autorización'!$I$6=\"Colegio Americano del Sur\",'CUENTAS CONTABLES'!E228,'CUENTAS CONTABLES'!B228)))","v":"1-1-1-003-01-11"}]
["DEUDORES POR MATERIAL PROMOCIONAL","1-1-1-003-01-07","4-1-1-003-01-07","3-1-1-003-01-07","7-1-1-003-01-07",{"$f":"IF('1. Autorización'!$I$6=\"Altiplano\",'CUENTAS CONTABLES'!C229,IF('1. Autorización'!$I$6=\"Sur\",'CUENTAS CONTABLES'!D229,IF('1. Autorización'!$I$6=\"Colegio Americano del Sur\",'CUENTAS CONTABLES'!E229,'CUENTAS CONTABLES'!B229)))","v":"1-1-1-003-01-07"}]
["DEUDORES POR PRUEBAS PSICOMETRICAS","1-1-1-003-01-05","4-1-1-003-01-05","3-1-1-003-01-05","7-1-1-003-01-05",{"$f":"IF('1. Autorización'!$I$6=\"Altiplano\",'CUENTAS CONTABLES'!C230,IF('1. Autorización'!$I$6=\"Sur\",'CUENTAS CONTABLES'!D230,IF('1. Autorización'!$I$6=\"Colegio Americano del Sur\",'CUENTAS CONTABLES'!E230,'CUENTAS CONTABLES'!B230)))","v":"1-1-1-003-01-05"}]
["DEUDORES SERVICIOS DE POES","1-1-1-003-01-06","4-1-1-003-01-06","3-1-1-003-01-06","7-1-1-003-01-06",{"$f":"IF('1. Autorización'!$I$6=\"Altiplano\",'CUENTAS CONTABLES'!C231,IF('1. Autorización'!$I$6=\"Sur\",'CUENTAS CONTABLES'!D231,IF('1. Autorización'!$I$6=\"Colegio Americano del Sur\",'CUENTAS CONTABLES'!E231,'CUENTAS CONTABLES'!B231)))","v":"1-1-1-003-01-06"}]
["DEUDORES TARJETAS DE CREDITO","1-1-1-003-01-20","4-1-1-003-01-20","3-1-1-003-01-20","7-1-1-003-01-20",{"$f":"IF('1. Autorización'!$I$6=\"Altiplano\",'CUENTAS CONTABLES'!C232,IF('1. Autorización'!$I$6=\"Sur\",'CUENTAS CONTABLES'!D232,IF('1. Autorización'!$I$6=\"Colegio Americano del Sur\",'CUENTAS CONTABLES'!E232,'CUENTAS CONTABLES'!B232)))","v":"1-1-1-003-01-20"}]
["DEUDORES TARJETAS DE CREDITO (COMISION E IVA)","1-1-1-003-01-21","4-1-1-003-01-21","3-1-1-003-01-21","7-1-1-003-01-21",{"$f":"IF('1. Autorización'!$I$6=\"Altiplano\",'CUENTAS CONTABLES'!C233,IF('1. Autorización'!$I$6=\"Sur\",'CUENTAS CONTABLES'!D233,IF('1. Autorización'!$I$6=\"Colegio Americano del Sur\",'CUENTAS CONTABLES'!E233,'CUENTAS CONTABLES'!B233)))","v":"1-1-1-003-01-21"}]
["DEUDORES VARIOS","1-1-1-003-01-15","4-1-1-003-01-15","3-1-1-003-01-15","7-1-1-003-01-15",{"$f":"IF('1. Autorización'!$I$6=\"Altiplano\",'CUENTAS CONTABLES'!C234,IF('1. Autorización'!$I$6=\"Sur\",'CUENTAS CONTABLES'!D234,IF('1. Autorización'!$I$6=\"Colegio Americano del Sur\",'CUENTAS CONTABLES'!E234,'CUENTAS CONTABLES'!B234)))","v":"1-1-1-003-01-15"}]
["DEUDORES VARIOS TRANSITORIA","1-1-1-003-01-98","4-1-1-003-01-98","3-1-1-003-01-98","7-1-1-003-01-98",{"$f":"IF('1. Autorización'!$I$6=\"Altiplano\",'CUENTAS CONTABLES'!C235,IF('1. Autorización'!$I$6=\"Sur\",'CUENTAS CONTABLES'!D235,IF('1. Autorización'!$I$6=\"Colegio Americano del Sur\",'CUENTAS CONTABLES'!E235,'CUENTAS CONTABLES'!B235)))","v":"1-1-1-003-01-98"}]
["DIFERENCIAL CAMBIARIO","1-6-1-008-02-01","4-6-1-008-02-01","3-6-1-008-02-01","7-6-1-008-02-01",{"$f":"IF('1. Autorización'!$I$6=\"Altiplano\",'CUENTAS CONTABLES'!C236,IF('1. Autorización'!$I$6=\"Sur\",'CUENTAS CONTABLES'!D236,IF('1. Autorización'!$I$6=\"Colegio Americano del Sur\",'CUENTAS CONTABLES'!E236,'CUENTAS CONTABLES'!B236)))","v":"1-6-1-008-02-01"}]
["DIMENSION CAPITAL NO RESTRIGIDO (INT X COB INV)","1-1-1-003-08-21","4-1-1-003-08-21","3-1-1-003-08-21","7-1-1-003-08-21",{"$f":"IF('1. Autorización'!$I$6=\"Altiplano\",'CUENTAS CONTABLES'!C237,IF('1. Autorización'!$I$6=\"Sur\",'CUENTAS CONTABLES'!D237,IF('1. Autorización'!$I$6=\"Colegio Americano del Sur\",'CUENTAS CONTABLES'!E237,'CUENTAS CONTABLES'!B237)))","v":"1-1-1-003-08-21"}]
["DIMENSION CAPITAL TEM RESTRIN (INT X COB INV)","1-1-1-003-08-22","4-1-1-003-08-22","3-1-1-003-08-22","7-1-1-003-08-22",{"$f":"IF('1. Autorización'!$I$6=\"Altiplano\",'CUENTAS CONTABLES'!C238,IF('1. Autorización'!$I$6=\"Sur\",'CUENTAS CONTABLES'!D238,IF('1. Autorización'!$I$6=\"Colegio Americano del Sur\",'CUENTAS CONTABLES'!E238,'CUENTAS CONTABLES'!B238)))","v":"1-1-1-003-08-22"}]
["DOCUMENTACION Y EQUIPAJE","1-6-1-007-02-03","4-6-1-007-02-03","3-6-1-007-02-03","7-6-1-007-02-03",{"$f":"IF('1. Autorización'!$I$6=\"Altiplano\",'CUENTAS CONTABLES'!C239,IF('1. Autorización'!$I$6=\"Sur\",'CUENTAS CONTABLES'!D239,IF('1. Autorización'!$I$6=\"Colegio Americano del Sur\",'CUENTAS CONTABLES'!E239,'CUENTAS CONTABLES'!B239)))","v":"1-6-1-007-02-03"}]
["DOMINIO GT","1-5-1-004-01-01","4-5-1-004-01-01","3-5-1-004-01-01","7-5-1-004-01-01",{"$f":"IF('1. Autorización'!$I$6=\"Altiplano\",'CUENTAS CONTABLES'!C240,IF('1. Autorización'!$I$6=\"Sur\",'CUENTAS CONTABLES'!D240,IF('1. Autorización'!$I$6=\"Colegio Americano del Sur\",'CUENTAS CONTABLES'!E240,'CUENTAS CONTABLES'!B240)))","v":"1-5-1-004-01-01"}]
["DONACION GASTO-FONDO DE BECAS","1-6-1-005-02-01","4-6-1-005-02-01","3-6-1-005-02-01","7-6-1-005-02-01",{"$f":"IF('1. Autorización'!$I$6=\"Altiplano\",'CUENTAS CONTABLES'!C241,IF('1. Autorización'!$I$6=\"Sur\",'CUENTAS CONTABLES'!D241,IF('1. Autorización'!$I$6=\"Colegio Americano del Sur\",'CUENTAS CONTABLES'!E241,'CUENTAS CONTABLES'!B241)))","v":"1-6-1-005-02-01"}]
["DONACIONES (BECAS/PRESTAMO BID)","1-6-1-008-03-01","4-6-1-008-03-01","3-6-1-008-03-01","7-6-1-008-03-01",{"$f":"IF('1. Autorización'!$I$6=\"Altiplano\",'CUENTAS CONTABLES'!C242,IF('1. Autorización'!$I$6=\"Sur\",'CUENTAS CONTABLES'!D242,IF('1. Autorización'!$I$6=\"Colegio Americano del Sur\",'CUENTAS CONTABLES'!E242,'CUENTAS CONTABLES'!B242)))","v":"1-6-1-008-03-01"}]
["DONACIONES ASHA","1-5-1-002-02-01","4-5-1-002-02-01","3-5-1-002-02-01","7-5-1-002-02-01",{"$f":"IF('1. Autorización'!$I$6=\"Altiplano\",'CUENTAS CONTABLES'!C243,IF('1. Autorización'!$I$6=\"Sur\",'CUENTAS CONTABLES'!D243,IF('1. Autorización'!$I$6=\"Colegio Americano del Sur\",'CUENTAS CONTABLES'!E243,'CUENTAS CONTABLES'!B243)))","v":"1-5-1-002-02-01"}]
["DONACIONES BECAS MIEMBROS DE LA FUVG","1-5-1-002-01-03","4-5-1-002-01-03","3-5-1-002-01-03","7-5-1-002-01-03",{"$f":"IF('1. Autorización'!$I$6=\"Altiplano\",'CUENTAS CONTABLES'!C244,IF('1. Autorización'!$I$6=\"Sur\",'CUENTAS CONTABLES'!D244,IF('1. Autorización'!$I$6=\"Colegio Americano del Sur\",'CUENTAS CONTABLES'!E244,'CUENTAS CONTABLES'!B244)))","v":"1-5-1-002-01-03"}]
["DONACIONES EN ESPECIE - INGRESO","1-5-1-002-02-03","4-5-1-002-02-03","3-5-1-002-02-03","7-5-1-002-02-03",{"$f":"IF('1. Autorización'!$I$6=\"Altiplano\",'CUENTAS CONTABLES'!C245,IF('1. Autorización'!$I$6=\"Sur\",'CUENTAS CONTABLES'!D245,IF('1. Autorización'!$I$6=\"Colegio Americano del Sur\",'CUENTAS CONTABLES'!E245,'CUENTAS CONTABLES'!B245)))","v":"1-5-1-002-02-03"}]
["DONACIONES EN ESPECIE -GASTO (SIN PRESUPUESTO)","1-6-1-005-02-15","4-6-1-005-02-15","3-6-1-005-02-15","7-6-1-005-02-15",{"$f":"IF('1. Autorización'!$I$6=\"Altiplano\",'CUENTAS CONTABLES'!C246,IF('1. Autorización'!$I$6=\"Sur\",'CUENTAS CONTABLES'!D246,IF('1. Autorización'!$I$6=\"Colegio Americano del Sur\",'CUENTAS CONTABLES'!E246,'CUENTAS CONTABLES'!B246)))","v":"1-6-1-005-02-15"}]
["DONACIONES GASTO","1-6-1-005-02-02","4-6-1-005-02-02","3-6-1-005-02-02","7-6-1-005-02-02",{"$f":"IF('1. Autorización'!$I$6=\"Altiplano\",'CUENTAS CONTABLES'!C247,IF('1. Autorización'!$I$6=\"Sur\",'CUENTAS CONTABLES'!D247,IF('1. Autorización'!$I$6=\"Colegio Americano del Sur\",'CUENTAS CONTABLES'!E247,'CUENTAS CONTABLES'!B247)))","v":"1-6-1-005-02-02"}]
["DONACIONES GASTO CONSULTORIA","1-6-1-005-02-03","4-6-1-005-02-03","3-6-1-005-02-03","7-6-1-005-02-03",{"$f":"IF('1. Autorización'!$I$6=\"Altiplano\",'CUENTAS CONTABLES'!C248,IF('1. Autorización'!$I$6=\"Sur\",'CUENTAS CONTABLES'!D248,IF('1. Autorización'!$I$6=\"Colegio Americano del Sur\",'CUENTAS CONTABLES'!E248,'CUENTAS CONTABLES'!B248)))","v":"1-6-1-005-02-03"}]
["DONACIONES PARA BECAS","1-5-1-002-01-01","4-5-1-002-01-01","3-5-1-002-01-01","7-5-1-002-01-01",{"$f":"IF('1. Autorización'!$I$6=\"Altiplano\",'CUENTAS CONTABLES'!C249,IF('1. Autorización'!$I$6=\"Sur\",'CUENTAS CONTABLES'!D249,IF('1. Autorización'!$I$6=\"Colegio Americano del Sur\",'CUENTAS CONTABLES'!E249,'CUENTAS CONTABLES'!B249)))","v":"1-5-1-002-01-01"}]
["DONACIONES PARA CRÉDITOS ESTUDIANTES","1-5-1-002-01-02","4-5-1-002-01-02","3-5-1-002-01-02","7-5-1-002-01-02",{"$f":"IF('1. Autorización'!$I$6=\"Altiplano\",'CUENTAS CONTABLES'!C250,IF('1. Autorización'!$I$6=\"Sur\",'CUENTAS CONTABLES'!D250,IF('1. Autorización'!$I$6=\"Colegio Americano del Sur\",'CUENTAS CONTABLES'!E250,'CUENTAS CONTABLES'!B250)))","v":"1-5-1-002-01-02"}]
["DONACIONES VARIAS","1-5-1-002-02-02","4-5-1-002-02-02","3-5-1-002-02-02","7-5-1-002-02-02",{"$f":"IF('1. Autorización'!$I$6=\"Altiplano\",'CUENTAS CONTABLES'!C251,IF('1. Autorización'!$I$6=\"Sur\",'CUENTAS CONTABLES'!D251,IF('1. Autorización'!$I$6=\"Colegio Americano del Sur\",'CUENTAS CONTABLES'!E251,'CUENTAS CONTABLES'!B251)))","v":"1-5-1-002-02-02"}]
["EDIFICIOS E INSTALACIONES","1-1-3-001-02-01","4-1-3-001-02-01","3-1-3-001-02-01","7-1-3-001-02-01",{"$f":"IF('1. Autorización'!$I$6=\"Altiplano\",'CUENTAS CONTABLES'!C252,IF('1. Autorización'!$I$6=\"Sur\",'CUENTAS CONTABLES'!D252,IF('1. Autorización'!$I$6=\"Colegio Americano del Sur\",'CUENTAS CONTABLES'!E252,'CUENTAS CONTABLES'!B252)))","v":"1-1-3-001-02-01"}]
["EDIFICIOS E INSTALACIONES (TEMPORAL)","1-1-3-001-02-02","4-1-3-001-02-02","3-1-3-001-02-02","7-1-3-001-02-02",{"$f":"IF('1. Autorización'!$I$6=\"Altiplano\",'CUENTAS CONTABLES'!C253,IF('1. Autorización'!$I$6=\"Sur\",'CUENTAS CONTABLES'!D253,IF('1. Autorización'!$I$6=\"Colegio Americano del Sur\",'CUENTAS CONTABLES'!E253,'CUENTAS CONTABLES'!B253)))","v":"1-1-3-001-02-02"}]
["EDIFICIOS E INSTALACIONES CONSTRUIDOS","1-1-4-001-03-01","4-1-4-001-03-01","3-1-4-001-03-01","7-1-4-001-03-01",{"$f":"IF('1. Autorización'!$I$6=\"Altiplano\",'CUENTAS CONTABLES'!C254,IF('1. Autorización'!$I$6=\"Sur\",'CUENTAS CONTABLES'!D254,IF('1. Autorización'!$I$6=\"Colegio Americano del Sur\",'CUENTAS CONTABLES'!E254,'CUENTAS CONTABLES'!B254)))","v":"1-1-4-001-03-01"}]
["EDUCACIÓN CONTINUA","1-5-1-001-01-11","4-5-1-001-01-11","3-5-1-001-01-11","7-5-1-001-01-11",{"$f":"IF('1. Autorización'!$I$6=\"Altiplano\",'CUENTAS CONTABLES'!C255,IF('1. Autorización'!$I$6=\"Sur\",'CUENTAS CONTABLES'!D255,IF('1. Autorización'!$I$6=\"Colegio Americano del Sur\",'CUENTAS CONTABLES'!E255,'CUENTAS CONTABLES'!B255)))","v":"1-5-1-001-01-11"}]
["EQUIPO COMPUTACION","1-1-3-001-08-01","4-1-3-001-08-01","3-1-3-001-08-01","7-1-3-001-08-01",{"$f":"IF('1. Autorización'!$I$6=\"Altiplano\",'CUENTAS CONTABLES'!C256,IF('1. Autorización'!$I$6=\"Sur\",'CUENTAS CONTABLES'!D256,IF('1. Autorización'!$I$6=\"Colegio Americano del Sur\",'CUENTAS CONTABLES'!E256,'CUENTAS CONTABLES'!B256)))","v":"1-1-3-001-08-01"}]
["EQUIPO COMPUTACION (TEMPORAL)","1-1-3-001-08-02","4-1-3-001-08-02","3-1-3-001-08-02","7-1-3-001-08-02",{"$f":"IF('1. Autorización'!$I$6=\"Altiplano\",'CUENTAS CONTABLES'!C257,IF('1. Autorización'!$I$6=\"Sur\",'CUENTAS CONTABLES'!D257,IF('1. Autorización'!$I$6=\"Colegio Americano del Sur\",'CUENTAS CONTABLES'!E257,'CUENTAS CONTABLES'!B257)))","v":"1-1-3-001-08-02"}]
["EQUIPO GENERAL","1-1-3-001-05-01","4-1-3-001-05-01","3-1-3-001-05-01","7-1-3-001-05-01",{"$f":"IF('1. Autorización'!$I$6=\"Altiplano\",'CUENTAS CONTABLES'!C258,IF('1. Autorización'!$I$6=\"Sur\",'CUENTAS CONTABLES'!D258,IF('1. Autorización'!$I$6=\"Colegio Americano del Sur\",'CUENTAS CONTABLES'!E258,'CUENTAS CONTABLES'!B258)))","v":"1-1-3-001-05-01"}]
["EQUIPO GENERAL (TEMPORAL)","1-1-3-001-05-02","4-1-3-001-05-02","3-1-3-001-05-02","7-1-3-001-05-02",{"$f":"IF('1. Autorización'!$I$6=\"Altiplano\",'CUENTAS CONTABLES'!C259,IF('1. Autorización'!$I$6=\"Sur\",'CUENTAS CONTABLES'!D259,IF('1. Autorización'!$I$6=\"Colegio Americano del Sur\",'CUENTAS CONTABLES'!E259,'CUENTAS CONTABLES'!B259)))","v":"1-1-3-001-05-02"}]
["ESTACIONAMIENTO","1-5-1-001-02-02","4-5-1-001-02-02","3-5-1-001-02-02","7-5-1-001-02-02",{"$f":"IF('1. Autorización'!$I$6=\"Altiplano\",'CUENTAS CONTABLES'!C260,IF('1. Autorización'!$I$6=\"Sur\",'CUENTAS CONTABLES'!D260,IF('1. Autorización'!$I$6=\"Colegio Americano del Sur\",'CUENTAS CONTABLES'!E260,'CUENTAS CONTABLES'!B260)))","v":"1-5-1-001-02-02"}]
["ESTIMACION DE CTAS INCOBRABLES DE CARTERA DE EST.","1-1-1-003-10-01","4-1-1-003-10-01","3-1-1-003-10-01","7-1-1-003-10-01",{"$f":"IF('1. Autorización'!$I$6=\"Altiplano\",'CUENTAS CONTABLES'!C261,IF('1. Autorización'!$I$6=\"Sur\",'CUENTAS CONTABLES'!D261,IF('1. Autorización'!$I$6=\"Colegio Americano del Sur\",'CUENTAS CONTABLES'!E261,'CUENTAS CONTABLES'!B261)))","v":"1-1-1-003-10-01"}]
["ESTIMACION DE CTAS INCOBRABLES DE OTROS DEUDORES","1-1-1-003-10-02","4-1-1-003-10-02","3-1-1-003-10-02","7-1-1-003-10-02",{"$f":"IF('1. Autorización'!$I$6=\"Altiplano\",'CUENTAS CONTABLES'!C262,IF('1. Autorización'!$I$6=\"Sur\",'CUENTAS CONTABLES'!D262,IF('1. Autorización'!$I$6=\"Colegio Americano del Sur\",'CUENTAS CONTABLES'!E262,'CUENTAS CONTABLES'!B262)))","v":"1-1-1-003-10-02"}]
["ESTIPENDIOS","1-6-1-007-01-01","4-6-1-007-01-01","3-6-1-007-01-01","7-6-1-007-01-01",{"$f":"IF('1. Autorización'!$I$6=\"Altiplano\",'CUENTAS CONTABLES'!C263,IF('1. Autorización'!$I$6=\"Sur\",'CUENTAS CONTABLES'!D263,IF('1. Autorización'!$I$6=\"Colegio Americano del Sur\",'CUENTAS CONTABLES'!E263,'CUENTAS CONTABLES'!B263)))","v":"1-6-1-007-01-01"}]
["EXÁMENES  DE SUFICIENCIA","1-5-1-001-01-09","4-5-1-001-01-09","3-5-1-001-01-09","7-5-1-001-01-09",{"$f":"IF('1. Autorización'!$I$6=\"Altiplano\",'CUENTAS CONTABLES'!C264,IF('1. Autorización'!$I$6=\"Sur\",'CUENTAS CONTABLES'!D264,IF('1. Autorización'!$I$6=\"Colegio Americano del Sur\",'CUENTAS CONTABLES'!E264,'CUENTAS CONTABLES'!B264)))","v":"1-5-1-001-01-09"}]
["EXÁMENES DE ADMISIÓN","1-5-1-001-01-07","4-5-1-001-01-07","3-5-1-001-01-07","7-5-1-001-01-07",{"$f":"IF('1. Autorización'!$I$6=\"Altiplano\",'CUENTAS CONTABLES'!C265,IF('1. Autorización'!$I$6=\"Sur\",'CUENTAS CONTABLES'!D265,IF('1. Autorización'!$I$6=\"Colegio Americano del Sur\",'CUENTAS CONTABLES'!E265,'CUENTAS CONTABLES'!B265)))","v":"1-5-1-001-01-07"}]
["EXÁMENES DE GRADUACIÓN","1-5-1-001-01-08","4-5-1-001-01-08","3-5-1-001-01-08","7-5-1-001-01-08",{"$f":"IF('1. Autorización'!$I$6=\"Altiplano\",'CUENTAS CONTABLES'!C266,IF('1. Autorización'!$I$6=\"Sur\",'CUENTAS CONTABLES'!D266,IF('1. Autorización'!$I$6=\"Colegio Americano del Sur\",'CUENTAS CONTABLES'!E266,'CUENTAS CONTABLES'!B266)))","v":"1-5-1-001-01-08"}]
["EXÁMENES DE RECUPERACIÓN","1-5-1-001-01-10","4-5-1-001-01-10","3-5-1-001-01-10","7-5-1-001-01-10",{"$f":"IF('1. Autorización'!$I$6=\"Altiplano\",'CUENTAS CONTABLES'!C267,IF('1. Autorización'!$I$6=\"Sur\",'CUENTAS CONTABLES'!D267,IF('1. Autorización'!$I$6=\"Colegio Americano del Sur\",'CUENTAS CONTABLES'!E267,'CUENTAS CONTABLES'!B267)))","v":"1-5-1-001-01-10"}]
["EXONERACIONES","1-6-1-005-02-18","4-6-1-005-02-18","3-6-1-005-02-18","7-6-1-005-02-18",{"$f":"IF('1. Autorización'!$I$6=\"Altiplano\",'CUENTAS CONTABLES'!C268,IF('1. Autorización'!$I$6=\"Sur\",'CUENTAS CONTABLES'!D268,IF('1. Autorización'!$I$6=\"Colegio Americano del Sur\",'CUENTAS CONTABLES'!E268,'CUENTAS CONTABLES'!B268)))","v":"1-6-1-005-02-18"}]
["FDOS PERMANENTEMENTE RESTRINGIDOS","1-3-1-001-03-01","4-3-1-001-03-01","3-3-1-001-03-01","7-3-1-001-03-01",{"$f":"IF('1. Autorización'!$I$6=\"Altiplano\",'CUENTAS CONTABLES'!C269,IF('1. Autorización'!$I$6=\"Sur\",'CUENTAS CONTABLES'!D269,IF('1. Autorización'!$I$6=\"Colegio Americano del Sur\",'CUENTAS CONTABLES'!E269,'CUENTAS CONTABLES'!B269)))","v":"1-3-1-001-03-01"}]
["FICA","1-6-1-007-01-02","4-6-1-007-01-02","3-6-1-007-01-02","7-6-1-007-01-02",{"$f":"IF('1. Autorización'!$I$6=\"Altiplano\",'CUENTAS CONTABLES'!C270,IF('1. Autorización'!$I$6=\"Sur\",'CUENTAS CONTABLES'!D270,IF('1. Autorización'!$I$6=\"Colegio Americano del Sur\",'CUENTAS CONTABLES'!E270,'CUENTAS CONTABLES'!B270)))","v":"1-6-1-007-01-02"}]
["FONDO DE EMERGENCIA","1-6-1-005-02-12","4-6-1-005-02-12","3-6-1-005-02-12","7-6-1-005-02-12",{"$f":"IF('1. Autorización'!$I$6=\"Altiplano\",'CUENTAS CONTABLES'!C271,IF('1. Autorización'!$I$6=\"Sur\",'CUENTAS CONTABLES'!D271,IF('1. Autorización'!$I$6=\"Colegio Americano del Sur\",'CUENTAS CONTABLES'!E271,'CUENTAS CONTABLES'!B271)))","v":"1-6-1-005-02-12"}]
["FONDO PARA BECAS","1-2-1-002-02-02","4-2-1-002-02-02","3-2-1-002-02-02","7-2-1-002-02-02",{"$f":"IF('1. Autorización'!$I$6=\"Altiplano\",'CUENTAS CONTABLES'!C272,IF('1. Autorización'!$I$6=\"Sur\",'CUENTAS CONTABLES'!D272,IF('1. Autorización'!$I$6=\"Colegio Americano del Sur\",'CUENTAS CONTABLES'!E272,'CUENTAS CONTABLES'!B272)))","v":"1-2-1-002-02-02"}]
["FONDOS DE PROYECTOS DAP  (SIN PRESUPUESTO)","1-2-1-002-02-01","4-2-1-002-02-01","3-2-1-002-02-01","7-2-1-002-02-01",{"$f":"IF('1. Autorización'!$I$6=\"Altiplano\",'CUENTAS CONTABLES'!C273,IF('1. Autorización'!$I$6=\"Sur\",'CUENTAS CONTABLES'!D273,IF('1. Autorización'!$I$6=\"Colegio Americano del Sur\",'CUENTAS CONTABLES'!E273,'CUENTAS CONTABLES'!B273)))","v":"1-2-1-002-02-01"}]
["FONDOS DE PROYECTOS OAII (GASTOS)","1-2-1-002-02-07","4-2-1-002-02-07","3-2-1-002-02-07","7-2-1-002-02-07",{"$f":"IF('1. Autorización'!$I$6=\"Altiplano\",'CUENTAS CONTABLES'!C274,IF('1. Autorización'!$I$6=\"Sur\",'CUENTAS CONTABLES'!D274,IF('1. Autorización'!$I$6=\"Colegio Americano del Sur\",'CUENTAS CONTABLES'!E274,'CUENTAS CONTABLES'!B274)))","v":"1-2-1-002-02-07"}]
["FONDOS DE PROYECTOS OAII (INGRESOS)","1-2-1-002-02-06","4-2-1-002-02-06","3-2-1-002-02-06","7-2-1-002-02-06",{"$f":"IF('1. Autorización'!$I$6=\"Altiplano\",'CUENTAS CONTABLES'!C275,IF('1. Autorización'!$I$6=\"Sur\",'CUENTAS CONTABLES'!D275,IF('1. Autorización'!$I$6=\"Colegio Americano del Sur\",'CUENTAS CONTABLES'!E275,'CUENTAS CONTABLES'!B275)))","v":"1-2-1-002-02-06"}]
["FONDOS INSTITUCIONALES","1-2-1-002-01-01","4-2-1-002-01-01","3-2-1-002-01-01","7-2-1-002-01-01",{"$f":"IF('1. Autorización'!$I$6=\"Altiplano\",'CUENTAS CONTABLES'!C276,IF('1. Autorización'!$I$6=\"Sur\",'CUENTAS CONTABLES'!D276,IF('1. Autorización'!$I$6=\"Colegio Americano del Sur\",'CUENTAS CONTABLES'!E276,'CUENTAS CONTABLES'!B276)))","v":"1-2-1-002-01-01"}]
["FONDOS PARA CATEDRAS","1-2-1-002-02-04","4-2-1-002-02-04","3-2-1-002-02-04","7-2-1-002-02-04",{"$f":"IF('1. Autorización'!$I$6=\"Altiplano\",'CUENTAS CONTABLES'!C277,IF('1. Autorización'!$I$6=\"Sur\",'CUENTAS CONTABLES'!D277,IF('1. Autorización'!$I$6=\"Colegio Americano del Sur\",'CUENTAS CONTABLES'!E277,'CUENTAS CONTABLES'!B277)))","v":"1-2-1-002-02-04"}]
["FONDOS PARA CREDITOS","1-2-1-002-02-03","4-2-1-002-02-03","3-2-1-002-02-03","7-2-1-002-02-03",{"$f":"IF('1. Autorización'!$I$6=\"Altiplano\",'CUENTAS CONTABLES'!C278,IF('1. Autorización'!$I$6=\"Sur\",'CUENTAS CONTABLES'!D278,IF('1. Autorización'!$I$6=\"Colegio Americano del Sur\",'CUENTAS CONTABLES'!E278,'CUENTAS CONTABLES'!B278)))","v":"1-2-1-002-02-03"}]
["FONDOS TEMPORALMENTE RESTRINGIDOS TRANSITORIA","1-2-1-002-02-99","4-2-1-002-02-99","3-2-1-002-02-99","7-2-1-002-02-99",{"$f":"IF('1. Autorización'!$I$6=\"Altiplano\",'CUENTAS CONTABLES'!C279,IF('1. Autorización'!$I$6=\"Sur\",'CUENTAS CONTABLES'!D279,IF('1. Autorización'!$I$6=\"Colegio Americano del Sur\",'CUENTAS CONTABLES'!E279,'CUENTAS CONTABLES'!B279)))","v":"1-2-1-002-02-99"}]
["FOTOCOPIAS","1-5-1-004-01-02","4-5-1-004-01-02","3-5-1-004-01-02","7-5-1-004-01-02",{"$f":"IF('1. Autorización'!$I$6=\"Altiplano\",'CUENTAS CONTABLES'!C280,IF('1. Autorización'!$I$6=\"Sur\",'CUENTAS CONTABLES'!D280,IF('1. Autorización'!$I$6=\"Colegio Americano del Sur\",'CUENTAS CONTABLES'!E280,'CUENTAS CONTABLES'!B280)))","v":"1-5-1-004-01-02"}]
["FOTOCOPIAS, REPROD, ENCUADERNACION  DE MATERIALES","1-6-1-002-02-01","4-6-1-002-02-01","3-6-1-002-02-01","7-6-1-002-02-01",{"$f":"IF('1. Autorización'!$I$6=\"Altiplano\",'CUENTAS CONTABLES'!C281,IF('1. Autorización'!$I$6=\"Sur\",'CUENTAS CONTABLES'!D281,IF('1. Autorización'!$I$6=\"Colegio Americano del Sur\",'CUENTAS CONTABLES'!E281,'CUENTAS CONTABLES'!B281)))","v":"1-6-1-002-02-01"}]
["G&T CONTINENTAL","1-6-1-008-01-03","4-6-1-008-01-03","3-6-1-008-01-03","7-6-1-008-01-03",{"$f":"IF('1. Autorización'!$I$6=\"Altiplano\",'CUENTAS CONTABLES'!C282,IF('1. Autorización'!$I$6=\"Sur\",'CUENTAS CONTABLES'!D282,IF('1. Autorización'!$I$6=\"Colegio Americano del Sur\",'CUENTAS CONTABLES'!E282,'CUENTAS CONTABLES'!B282)))","v":"1-6-1-008-01-03"}]
["GANANCIA EN VENTA DE ACTIVOS FIJOS","1-5-1-004-02-05","4-5-1-004-02-05","3-5-1-004-02-05","7-5-1-004-02-05",{"$f":"IF('1. Autorización'!$I$6=\"Altiplano\",'CUENTAS CONTABLES'!C283,IF('1. Autorización'!$I$6=\"Sur\",'CUENTAS CONTABLES'!D283,IF('1. Autorización'!$I$6=\"Colegio Americano del Sur\",'CUENTAS CONTABLES'!E283,'CUENTAS CONTABLES'!B283)))","v":"1-5-1-004-02-05"}]
["GASTO ANTICIPADO VACUNAS","1-1-4-001-01-06","4-1-4-001-01-06","3-1-4-001-01-06","7-1-4-001-01-06",{"$f":"IF('1. Autorización'!$I$6=\"Altiplano\",'CUENTAS CONTABLES'!C284,IF('1. Autorización'!$I$6=\"Sur\",'CUENTAS CONTABLES'!D284,IF('1. Autorización'!$I$6=\"Colegio Americano del Sur\",'CUENTAS CONTABLES'!E284,'CUENTAS CONTABLES'!B284)))","v":"1-1-4-001-01-06"}]
["GASTOS ANTICIPADOS","1-1-4-001-02-05","4-1-4-001-02-05","3-1-4-001-02-05","7-1-4-001-02-05",{"$f":"IF('1. Autorización'!$I$6=\"Altiplano\",'CUENTAS CONTABLES'!C285,IF('1. Autorización'!$I$6=\"Sur\",'CUENTAS CONTABLES'!D285,IF('1. Autorización'!$I$6=\"Colegio Americano del Sur\",'CUENTAS CONTABLES'!E285,'CUENTAS CONTABLES'!B285)))","v":"1-1-4-001-02-05"}]
["GASTOS ANTICIPADOS POR CAMBIO DE SISTEMA","1-1-4-001-01-04","4-1-4-001-01-04","3-1-4-001-01-04","7-1-4-001-01-04",{"$f":"IF('1. Autorización'!$I$6=\"Altiplano\",'CUENTAS CONTABLES'!C286,IF('1. Autorización'!$I$6=\"Sur\",'CUENTAS CONTABLES'!D286,IF('1. Autorización'!$I$6=\"Colegio Americano del Sur\",'CUENTAS CONTABLES'!E286,'CUENTAS CONTABLES'!B286)))","v":"1-1-4-001-01-04"}]
["GASTOS ANTICIPADOS PROYECTOS POR CAMBIO SISTEMA","1-1-4-001-01-05","4-1-4-001-01-05","3-1-4-001-01-05","7-1-4-001-01-05",{"$f":"IF('1. Autorización'!$I$6=\"Altiplano\",'CUENTAS CONTABLES'!C287,IF('1. Autorización'!$I$6=\"Sur\",'CUENTAS CONTABLES'!D287,IF('1. Autorización'!$I$6=\"Colegio Americano del Sur\",'CUENTAS CONTABLES'!E287,'CUENTAS CONTABLES'!B287)))","v":"1-1-4-001-01-05"}]
["GASTOS DE BIBLIOTECA","1-6-1-005-02-05","4-6-1-005-02-05","3-6-1-005-02-05","7-6-1-005-02-05",{"$f":"IF('1. Autorización'!$I$6=\"Altiplano\",'CUENTAS CONTABLES'!C288,IF('1. Autorización'!$I$6=\"Sur\",'CUENTAS CONTABLES'!D288,IF('1. Autorización'!$I$6=\"Colegio Americano del Sur\",'CUENTAS CONTABLES'!E288,'CUENTAS CONTABLES'!B288)))","v":"1-6-1-005-02-05"}]
["GASTOS DE GRADUACION","1-6-1-005-02-13","4-6-1-005-02-13","3-6-1-005-02-13","7-6-1-005-02-13",{"$f":"IF('1. Autorización'!$I$6=\"Altiplano\",'CUENTAS CONTABLES'!C289,IF('1. Autorización'!$I$6=\"Sur\",'CUENTAS CONTABLES'!D289,IF('1. Autorización'!$I$6=\"Colegio Americano del Sur\",'CUENTAS CONTABLES'!E289,'CUENTAS CONTABLES'!B289)))","v":"1-6-1-005-02-13"}]
["GASTOS DE REPRESENTACION","1-6-1-004-01-03","4-6-1-004-01-03","3-6-1-004-01-03","7-6-1-004-01-03",{"$f":"IF('1. Autorización'!$I$6=\"Altiplano\",'CUENTAS CONTABLES'!C290,IF('1. Autorización'!$I$6=\"Sur\",'CUENTAS CONTABLES'!D290,IF('1. Autorización'!$I$6=\"Colegio Americano del Sur\",'CUENTAS CONTABLES'!E290,'CUENTAS CONTABLES'!B290)))","v":"1-6-1-004-01-03"}]
["GASTOS POR REUNIONES Y VISITANTES","1-6-1-005-02-17","4-6-1-005-02-17","3-6-1-005-02-17","7-6-1-005-02-17",{"$f":"IF('1. Autorización'!$I$6=\"Altiplano\",'CUENTAS CONTABLES'!C291,IF('1. Autorización'!$I$6=\"Sur\",'CUENTAS CONTABLES'!D291,IF('1. Autorización'!$I$6=\"Colegio Americano del Sur\",'CUENTAS CONTABLES'!E291,'CUENTAS CONTABLES'!B291)))","v":"1-6-1-005-02-17"}]
["GASTOS RELACIONADOS","1-6-1-005-02-20","4-6-1-005-02-20","3-6-1-005-02-20","7-6-1-005-02-20",{"$f":"IF('1. Autorización'!$I$6=\"Altiplano\",'CUENTAS CONTABLES'!C292,IF('1. Autorización'!$I$6=\"Sur\",'CUENTAS CONTABLES'!D292,IF('1. Autorización'!$I$6=\"Colegio Americano del Sur\",'CUENTAS CONTABLES'!E292,'CUENTAS CONTABLES'!B292)))","v":"1-6-1-005-02-20"}]
["GRADUACIONES Y FESTEJOS","1-5-1-001-02-05","4-5-1-001-02-05","3-5-1-001-02-05","7-5-1-001-02-05",{"$f":"IF('1. Autorización'!$I$6=\"Altiplano\",'CUENTAS CONTABLES'!C293,IF('1. Autorización'!$I$6=\"Sur\",'CUENTAS CONTABLES'!D293,IF('1. Autorización'!$I$6=\"Colegio Americano del Sur\",'CUENTAS CONTABLES'!E293,'CUENTAS CONTABLES'!B293)))","v":"1-5-1-001-02-05"}]
["GTC BANK NO RESTRINGIDO (INT.X COBRAR INV)","1-1-1-003-08-15","4-1-1-003-08-15","3-1-1-003-08-15","7-1-1-003-08-15",{"$f":"IF('1. Autorización'!$I$6=\"Altiplano\",'CUENTAS CONTABLES'!C294,IF('1. Autorización'!$I$6=\"Sur\",'CUENTAS CONTABLES'!D294,IF('1. Autorización'!$I$6=\"Colegio Americano del Sur\",'CUENTAS CONTABLES'!E294,'CUENTAS CONTABLES'!B294)))","v":"1-1-1-003-08-15"}]
["GTC BANK TEMPORAL.RESTRINGIDO (INT.X COBRAR INV)","1-1-1-003-08-16","4-1-1-003-08-16","3-1-1-003-08-16","7-1-1-003-08-16",{"$f":"IF('1. Autorización'!$I$6=\"Altiplano\",'CUENTAS CONTABLES'!C295,IF('1. Autorización'!$I$6=\"Sur\",'CUENTAS CONTABLES'!D295,IF('1. Autorización'!$I$6=\"Colegio Americano del Sur\",'CUENTAS CONTABLES'!E295,'CUENTAS CONTABLES'!B295)))","v":"1-1-1-003-08-16"}]
["HONORARIOS SERVICIOS EXTERNOS","1-6-1-003-02-07","4-6-1-003-02-07","3-6-1-003-02-07","7-6-1-003-02-07",{"$f":"IF('1. Autorización'!$I$6=\"Altiplano\",'CUENTAS CONTABLES'!C296,IF('1. Autorización'!$I$6=\"Sur\",'CUENTAS CONTABLES'!D296,IF('1. Autorización'!$I$6=\"Colegio Americano del Sur\",'CUENTAS CONTABLES'!E296,'CUENTAS CONTABLES'!B296)))","v":"1-6-1-003-02-07"}]
["HONORARIOS SERVICIOS INTERNOS","1-6-1-001-02-01","4-6-1-001-02-01","3-6-1-001-02-01","7-6-1-001-02-01",{"$f":"IF('1. Autorización'!$I$6=\"Altiplano\",'CUENTAS CONTABLES'!C297,IF('1. Autorización'!$I$6=\"Sur\",'CUENTAS CONTABLES'!D297,IF('1. Autorización'!$I$6=\"Colegio Americano del Sur\",'CUENTAS CONTABLES'!E297,'CUENTAS CONTABLES'!B297)))","v":"1-6-1-001-02-01"}]
["HORAS EXTRAS","1-6-1-001-01-03","4-6-1-001-01-03","3-6-1-001-01-03","7-6-1-001-01-03",{"$f":"IF('1. Autorización'!$I$6=\"Altiplano\",'CUENTAS CONTABLES'!C298,IF('1. Autorización'!$I$6=\"Sur\",'CUENTAS CONTABLES'!D298,IF('1. Autorización'!$I$6=\"Colegio Americano del Sur\",'CUENTAS CONTABLES'!E298,'CUENTAS CONTABLES'!B298)))","v":"1-6-1-001-01-03"}]
["IMPRENTA Y OFFSET","1-6-1-003-02-04","4-6-1-003-02-04","3-6-1-003-02-04","7-6-1-003-02-04",{"$f":"IF('1. Autorización'!$I$6=\"Altiplano\",'CUENTAS CONTABLES'!C299,IF('1. Autorización'!$I$6=\"Sur\",'CUENTAS CONTABLES'!D299,IF('1. Autorización'!$I$6=\"Colegio Americano del Sur\",'CUENTAS CONTABLES'!E299,'CUENTAS CONTABLES'!B299)))","v":"1-6-1-003-02-04"}]
["IMPUESTOS Y CONTRIBUCIONES","1-6-1-005-02-14","4-6-1-005-02-14","3-6-1-005-02-14","7-6-1-005-02-14",{"$f":"IF('1. Autorización'!$I$6=\"Altiplano\",'CUENTAS CONTABLES'!C300,IF('1. Autorización'!$I$6=\"Sur\",'CUENTAS CONTABLES'!D300,IF('1. Autorización'!$I$6=\"Colegio Americano del Sur\",'CUENTAS CONTABLES'!E300,'CUENTAS CONTABLES'!B300)))","v":"1-6-1-005-02-14"}]
["INDEMNIZACIONES","1-6-1-001-03-01","4-6-1-001-03-01","3-6-1-001-03-01","7-6-1-001-03-01",{"$f":"IF('1. Autorización'!$I$6=\"Altiplano\",'CUENTAS CONTABLES'!C301,IF('1. Autorización'!$I$6=\"Sur\",'CUENTAS CONTABLES'!D301,IF('1. Autorización'!$I$6=\"Colegio Americano del Sur\",'CUENTAS CONTABLES'!E301,'CUENTAS CONTABLES'!B301)))","v":"1-6-1-001-03-01"}]
["INGRESOS DIFERIDOS POR CAMBIO SISTEMA","1-2-1-009-01-04","4-2-1-009-01-04","3-2-1-009-01-04","7-2-1-009-01-04",{"$f":"IF('1. Autorización'!$I$6=\"Altiplano\",'CUENTAS CONTABLES'!C302,IF('1. Autorización'!$I$6=\"Sur\",'CUENTAS CONTABLES'!D302,IF('1. Autorización'!$I$6=\"Colegio Americano del Sur\",'CUENTAS CONTABLES'!E302,'CUENTAS CONTABLES'!B302)))","v":"1-2-1-009-01-04"}]
["INGRESOS DIFERIDOS PROYECTOS X CAMBIO SISTEMA","1-2-1-009-01-05","4-2-1-009-01-05","3-2-1-009-01-05","7-2-1-009-01-05",{"$f":"IF('1. Autorización'!$I$6=\"Altiplano\",'CUENTAS CONTABLES'!C303,IF('1. Autorización'!$I$6=\"Sur\",'CUENTAS CONTABLES'!D303,IF('1. Autorización'!$I$6=\"Colegio Americano del Sur\",'CUENTAS CONTABLES'!E303,'CUENTAS CONTABLES'!B303)))","v":"1-2-1-009-01-05"}]
["INGRESOS RELACIONADOS","1-5-1-004-02-07","4-5-1-004-02-07","3-5-1-004-02-07","7-5-1-004-02-07",{"$f":"IF('1. Autorización'!$I$6=\"Altiplano\",'CUENTAS CONTABLES'!C304,IF('1. Autorización'!$I$6=\"Sur\",'CUENTAS CONTABLES'!D304,IF('1. Autorización'!$I$6=\"Colegio Americano del Sur\",'CUENTAS CONTABLES'!E304,'CUENTAS CONTABLES'!B304)))","v":"1-5-1-004-02-07"}]
["INGRESOS VARIOS POR APLICAR $","1-2-1-009-01-03","4-2-1-009-01-03","3-2-1-009-01-03","7-2-1-009-01-03",{"$f":"IF('1. Autorización'!$I$6=\"Altiplano\",'CUENTAS CONTABLES'!C305,IF('1. Autorización'!$I$6=\"Sur\",'CUENTAS CONTABLES'!D305,IF('1. Autorización'!$I$6=\"Colegio Americano del Sur\",'CUENTAS CONTABLES'!E305,'CUENTAS CONTABLES'!B305)))","v":"1-2-1-009-01-03"}]
["INGRESOS VARIOS POR APLICAR (EDUCON)","1-2-1-009-01-07","4-2-1-009-01-07","3-2-1-009-01-07","7-2-1-009-01-07",{"$f":"IF('1. Autorización'!$I$6=\"Altiplano\",'CUENTAS CONTABLES'!C306,IF('1. Autorización'!$I$6=\"Sur\",'CUENTAS CONTABLES'!D306,IF('1. Autorización'!$I$6=\"Colegio Americano del Sur\",'CUENTAS CONTABLES'!E306,'CUENTAS CONTABLES'!B306)))","v":"1-2-1-009-01-07"}]
["INGRESOS VARIOS POR APLICAR (RECARGOS POR MORA)","1-2-1-009-01-01","4-2-1-009-01-01","3-2-1-009-01-01","7-2-1-009-01-01",{"$f":"IF('1. Autorización'!$I$6=\"Altiplano\",'CUENTAS CONTABLES'!C307,IF('1. Autorización'!$I$6=\"Sur\",'CUENTAS CONTABLES'!D307,IF('1. Autorización'!$I$6=\"Colegio Americano del Sur\",'CUENTAS CONTABLES'!E307,'CUENTAS CONTABLES'!B307)))","v":"1-2-1-009-01-01"}]
["INSCRIPCIÓN EXTEMPORÁNEA","1-5-1-001-01-06","4-5-1-001-01-06","3-5-1-001-01-06","7-5-1-001-01-06",{"$f":"IF('1. Autorización'!$I$6=\"Altiplano\",'CUENTAS CONTABLES'!C308,IF('1. Autorización'!$I$6=\"Sur\",'CUENTAS CONTABLES'!D308,IF('1. Autorización'!$I$6=\"Colegio Americano del Sur\",'CUENTAS CONTABLES'!E308,'CUENTAS CONTABLES'!B308)))","v":"1-5-1-001-01-06"}]
["INTERESES BANCARIOS","1-5-1-003-01-02","4-5-1-003-01-02","3-5-1-003-01-02","7-5-1-003-01-02",{"$f":"IF('1. Autorización'!$I$6=\"Altiplano\",'CUENTAS CONTABLES'!C309,IF('1. Autorización'!$I$6=\"Sur\",'CUENTAS CONTABLES'!D309,IF('1. Autorización'!$I$6=\"Colegio Americano del Sur\",'CUENTAS CONTABLES'!E309,'CUENTAS CONTABLES'!B309)))","v":"1-5-1-003-01-02"}]
["INTERESES POR AYUDA FINANCIERA REEMBOLSABLE","1-5-1-001-04-01","4-5-1-001-04-01","3-5-1-001-04-01","7-5-1-001-04-01",{"$f":"IF('1. Autorización'!$I$6=\"Altiplano\",'CUENTAS CONTABLES'!C310,IF('1. Autorización'!$I$6=\"Sur\",'CUENTAS CONTABLES'!D310,IF('1. Autorización'!$I$6=\"Colegio Americano del Sur\",'CUENTAS CONTABLES'!E310,'CUENTAS CONTABLES'!B310)))","v":"1-5-1-001-04-01"}]
["INTERESES SOBRE PRESTAMO DEL BANCO INDUSTRIAL","1-2-2-001-02-02","4-2-2-001-02-02","3-2-2-001-02-02","7-2-2-001-02-02",{"$f":"IF('1. Autorización'!$I$6=\"Altiplano\",'CUENTAS CONTABLES'!C311,IF('1. Autorización'!$I$6=\"Sur\",'CUENTAS CONTABLES'!D311,IF('1. Autorización'!$I$6=\"Colegio Americano del Sur\",'CUENTAS CONTABLES'!E311,'CUENTAS CONTABLES'!B311)))","v":"1-2-2-001-02-02"}]
["INTERESES SOBRE PRESTAMOS DEL BANCO CUSCATLAN","1-2-2-001-02-01","4-2-2-001-02-01","3-2-2-001-02-01","7-2-2-001-02-01",{"$f":"IF('1. Autorización'!$I$6=\"Altiplano\",'CUENTAS CONTABLES'!C312,IF('1. Autorización'!$I$6=\"Sur\",'CUENTAS CONTABLES'!D312,IF('1. Autorización'!$I$6=\"Colegio Americano del Sur\",'CUENTAS CONTABLES'!E312,'CUENTAS CONTABLES'!B312)))","v":"1-2-2-001-02-01"}]
["INVENTARIO AGUA SALVAVIDAS","1-1-1-004-01-06","4-1-1-004-01-06","3-1-1-004-01-06","7-1-1-004-01-06",{"$f":"IF('1. Autorización'!$I$6=\"Altiplano\",'CUENTAS CONTABLES'!C313,IF('1. Autorización'!$I$6=\"Sur\",'CUENTAS CONTABLES'!D313,IF('1. Autorización'!$I$6=\"Colegio Americano del Sur\",'CUENTAS CONTABLES'!E313,'CUENTAS CONTABLES'!B313)))","v":"1-1-1-004-01-06"}]
["INVENTARIO ARTÍCULOS PROMOCIÓNALES","1-1-1-004-01-01","4-1-1-004-01-01","3-1-1-004-01-01","7-1-1-004-01-01",{"$f":"IF('1. Autorización'!$I$6=\"Altiplano\",'CUENTAS CONTABLES'!C314,IF('1. Autorización'!$I$6=\"Sur\",'CUENTAS CONTABLES'!D314,IF('1. Autorización'!$I$6=\"Colegio Americano del Sur\",'CUENTAS CONTABLES'!E314,'CUENTAS CONTABLES'!B314)))","v":"1-1-1-004-01-01"}]
["INVENTARIO COLLEGE BOARD","1-1-1-004-01-11","4-1-1-004-01-11","3-1-1-004-01-11","7-1-1-004-01-11",{"$f":"IF('1. Autorización'!$I$6=\"Altiplano\",'CUENTAS CONTABLES'!C315,IF('1. Autorización'!$I$6=\"Sur\",'CUENTAS CONTABLES'!D315,IF('1. Autorización'!$I$6=\"Colegio Americano del Sur\",'CUENTAS CONTABLES'!E315,'CUENTAS CONTABLES'!B315)))","v":"1-1-1-004-01-11"}]
["INVENTARIO COMBUSTIBLES","1-1-1-004-01-07","4-1-1-004-01-07","3-1-1-004-01-07","7-1-1-004-01-07",{"$f":"IF('1. Autorización'!$I$6=\"Altiplano\",'CUENTAS CONTABLES'!C316,IF('1. Autorización'!$I$6=\"Sur\",'CUENTAS CONTABLES'!D316,IF('1. Autorización'!$I$6=\"Colegio Americano del Sur\",'CUENTAS CONTABLES'!E316,'CUENTAS CONTABLES'!B316)))","v":"1-1-1-004-01-07"}]
["INVENTARIO HERRAMIENTAS","1-1-1-004-01-09","4-1-1-004-01-09","3-1-1-004-01-09","7-1-1-004-01-09",{"$f":"IF('1. Autorización'!$I$6=\"Altiplano\",'CUENTAS CONTABLES'!C317,IF('1. Autorización'!$I$6=\"Sur\",'CUENTAS CONTABLES'!D317,IF('1. Autorización'!$I$6=\"Colegio Americano del Sur\",'CUENTAS CONTABLES'!E317,'CUENTAS CONTABLES'!B317)))","v":"1-1-1-004-01-09"}]
["INVENTARIO IMPRENTA","1-1-1-004-01-12","4-1-1-004-01-12","3-1-1-004-01-12","7-1-1-004-01-12",{"$f":"IF('1. Autorización'!$I$6=\"Altiplano\",'CUENTAS CONTABLES'!C318,IF('1. Autorización'!$I$6=\"Sur\",'CUENTAS CONTABLES'!D318,IF('1. Autorización'!$I$6=\"Colegio Americano del Sur\",'CUENTAS CONTABLES'!E318,'CUENTAS CONTABLES'!B318)))","v":"1-1-1-004-01-12"}]
["INVENTARIO MATERIAL PSICOMETRICO","1-1-1-004-01-05","4-1-1-004-01-05","3-1-1-004-01-05","7-1-1-004-01-05",{"$f":"IF('1. Autorización'!$I$6=\"Altiplano\",'CUENTAS CONTABLES'!C319,IF('1. Autorización'!$I$6=\"Sur\",'CUENTAS CONTABLES'!D319,IF('1. Autorización'!$I$6=\"Colegio Americano del Sur\",'CUENTAS CONTABLES'!E319,'CUENTAS CONTABLES'!B319)))","v":"1-1-1-004-01-05"}]
["INVENTARIO MATERIALES DE IMPRENTA","1-1-1-004-01-02","4-1-1-004-01-02","3-1-1-004-01-02","7-1-1-004-01-02",{"$f":"IF('1. Autorización'!$I$6=\"Altiplano\",'CUENTAS CONTABLES'!C320,IF('1. Autorización'!$I$6=\"Sur\",'CUENTAS CONTABLES'!D320,IF('1. Autorización'!$I$6=\"Colegio Americano del Sur\",'CUENTAS CONTABLES'!E320,'CUENTAS CONTABLES'!B320)))","v":"1-1-1-004-01-02"}]
["INVENTARIO MATERIALES DE MANTENIMIENTO","1-1-1-004-01-04","4-1-1-004-01-04","3-1-1-004-01-04","7-1-1-004-01-04",{"$f":"IF('1. Autorización'!$I$6=\"Altiplano\",'CUENTAS CONTABLES'!C321,IF('1. Autorización'!$I$6=\"Sur\",'CUENTAS CONTABLES'!D321,IF('1. Autorización'!$I$6=\"Colegio Americano del Sur\",'CUENTAS CONTABLES'!E321,'CUENTAS CONTABLES'!B321)))","v":"1-1-1-004-01-04"}]
["INVENTARIO PAPELERÍA Y ÚTILES","1-1-1-004-01-03","4-1-1-004-01-03","3-1-1-004-01-03","7-1-1-004-01-03",{"$f":"IF('1. Autorización'!$I$6=\"Altiplano\",'CUENTAS CONTABLES'!C322,IF('1. Autorización'!$I$6=\"Sur\",'CUENTAS CONTABLES'!D322,IF('1. Autorización'!$I$6=\"Colegio Americano del Sur\",'CUENTAS CONTABLES'!E322,'CUENTAS CONTABLES'!B322)))","v":"1-1-1-004-01-03"}]
["INVENTARIO REPUESTOS","1-1-1-004-01-08","4-1-1-004-01-08","3-1-1-004-01-08","7-1-1-004-01-08",{"$f":"IF('1. Autorización'!$I$6=\"Altiplano\",'CUENTAS CONTABLES'!C323,IF('1. Autorización'!$I$6=\"Sur\",'CUENTAS CONTABLES'!D323,IF('1. Autorización'!$I$6=\"Colegio Americano del Sur\",'CUENTAS CONTABLES'!E323,'CUENTAS CONTABLES'!B323)))","v":"1-1-1-004-01-08"}]
["INVENTARIO SUMINISTROS DE COMPUTO","1-1-1-004-01-10","4-1-1-004-01-10","3-1-1-004-01-10","7-1-1-004-01-10",{"$f":"IF('1. Autorización'!$I$6=\"Altiplano\",'CUENTAS CONTABLES'!C324,IF('1. Autorización'!$I$6=\"Sur\",'CUENTAS CONTABLES'!D324,IF('1. Autorización'!$I$6=\"Colegio Americano del Sur\",'CUENTAS CONTABLES'!E324,'CUENTAS CONTABLES'!B324)))","v":"1-1-1-004-01-10"}]
["INVENTARIO TRANSITORIA","1-1-1-004-01-13","4-1-1-004-01-13","3-1-1-004-01-13","7-1-1-004-01-13",{"$f":"IF('1. Autorización'!$I$6=\"Altiplano\",'CUENTAS CONTABLES'!C325,IF('1. Autorización'!$I$6=\"Sur\",'CUENTAS CONTABLES'!D325,IF('1. Autorización'!$I$6=\"Colegio Americano del Sur\",'CUENTAS CONTABLES'!E325,'CUENTAS CONTABLES'!B325)))","v":"1-1-1-004-01-13"}]
["INVERISONES $ BANCO DE AMERICA CENTRAL PERMAN REST","1-1-2-001-02-18","4-1-2-001-02-18","3-1-2-001-02-18","7-1-2-001-02-18",{"$f":"IF('1. Autorización'!$I$6=\"Altiplano\",'CUENTAS CONTABLES'!C326,IF('1. Autorización'!$I$6=\"Sur\",'CUENTAS CONTABLES'!D326,IF('1. Autorización'!$I$6=\"Colegio Americano del Sur\",'CUENTAS CONTABLES'!E326,'CUENTAS CONTABLES'!B326)))","v":"1-1-2-001-02-18"}]
["INVERSION EN ACCIONES $ BI CAPITAL","1-1-2-001-02-92","4-1-2-001-02-92","3-1-2-001-02-92","7-1-2-001-02-92",{"$f":"IF('1. Autorización'!$I$6=\"Altiplano\",'CUENTAS CONTABLES'!C327,IF('1. Autorización'!$I$6=\"Sur\",'CUENTAS CONTABLES'!D327,IF('1. Autorización'!$I$6=\"Colegio Americano del Sur\",'CUENTAS CONTABLES'!E327,'CUENTAS CONTABLES'!B327)))","v":"1-1-2-001-02-92"}]
["INVERSION MONETARIA EN MONEDA EXTRANJERA (FNR)","1-1-2-001-04-01","4-1-2-001-04-01","3-1-2-001-04-01","7-1-2-001-04-01",{"$f":"IF('1. Autorización'!$I$6=\"Altiplano\",'CUENTAS CONTABLES'!C328,IF('1. Autorización'!$I$6=\"Sur\",'CUENTAS CONTABLES'!D328,IF('1. Autorización'!$I$6=\"Colegio Americano del Sur\",'CUENTAS CONTABLES'!E328,'CUENTAS CONTABLES'!B328)))","v":"1-1-2-001-04-01"}]
["INVERSION MONETARIA EN MONEDA LOCAL (FNR)","1-1-2-001-03-01","4-1-2-001-03-01","3-1-2-001-03-01","7-1-2-001-03-01",{"$f":"IF('1. Autorización'!$I$6=\"Altiplano\",'CUENTAS CONTABLES'!C329,IF('1. Autorización'!$I$6=\"Sur\",'CUENTAS CONTABLES'!D329,IF('1. Autorización'!$I$6=\"Colegio Americano del Sur\",'CUENTAS CONTABLES'!E329,'CUENTAS CONTABLES'!B329)))","v":"1-1-2-001-03-01"}]
["INVERSION MONETARIA EN MONEDA LOCAL (FTR)","1-1-2-001-03-05","4-1-2-001-03-05","3-1-2-001-03-05","7-1-2-001-03-05",{"$f":"IF('1. Autorización'!$I$6=\"Altiplano\",'CUENTAS CONTABLES'!C330,IF('1. Autorización'!$I$6=\"Sur\",'CUENTAS CONTABLES'!D330,IF('1. Autorización'!$I$6=\"Colegio Americano del Sur\",'CUENTAS CONTABLES'!E330,'CUENTAS CONTABLES'!B330)))","v":"1-1-2-001-03-05"}]
["INVERSION MONETARIA EN MONEDA LOCAL (PROYECTOS)","1-1-2-001-03-03","4-1-2-001-03-03","3-1-2-001-03-03","7-1-2-001-03-03",{"$f":"IF('1. Autorización'!$I$6=\"Altiplano\",'CUENTAS CONTABLES'!C331,IF('1. Autorización'!$I$6=\"Sur\",'CUENTAS CONTABLES'!D331,IF('1. Autorización'!$I$6=\"Colegio Americano del Sur\",'CUENTAS CONTABLES'!E331,'CUENTAS CONTABLES'!B331)))","v":"1-1-2-001-03-03"}]
["INVERSION MONETARIA MONEDA EXTRANJERA (FTR)","1-1-2-001-04-05","4-1-2-001-04-05","3-1-2-001-04-05","7-1-2-001-04-05",{"$f":"IF('1. Autorización'!$I$6=\"Altiplano\",'CUENTAS CONTABLES'!C332,IF('1. Autorización'!$I$6=\"Sur\",'CUENTAS CONTABLES'!D332,IF('1. Autorización'!$I$6=\"Colegio Americano del Sur\",'CUENTAS CONTABLES'!E332,'CUENTAS CONTABLES'!B332)))","v":"1-1-2-001-04-05"}]
["INVERSION MONETARIA MONEDA EXTRANJERA (PROYECTOS)","1-1-2-001-04-03","4-1-2-001-04-03","3-1-2-001-04-03","7-1-2-001-04-03",{"$f":"IF('1. Autorización'!$I$6=\"Altiplano\",'CUENTAS CONTABLES'!C333,IF('1. Autorización'!$I$6=\"Sur\",'CUENTAS CONTABLES'!D333,IF('1. Autorización'!$I$6=\"Colegio Americano del Sur\",'CUENTAS CONTABLES'!E333,'CUENTAS CONTABLES'!B333)))","v":"1-1-2-001-04-03"}]
["INVERSIONES $  BANCO AGROMERCANTIL","1-1-2-001-02-99","4-1-2-001-02-99","3-1-2-001-02-99","7-1-2-001-02-99",{"$f":"IF('1. Autorización'!$I$6=\"Altiplano\",'CUENTAS CONTABLES'!C334,IF('1. Autorización'!$I$6=\"Sur\",'CUENTAS CONTABLES'!D334,IF('1. Autorización'!$I$6=\"Colegio Americano del Sur\",'CUENTAS CONTABLES'!E334,'CUENTAS CONTABLES'!B334)))","v":"1-1-2-001-02-99"}]
["INVERSIONES $ AGROMERCANTIL NO RESTRINGIDO","1-1-2-001-02-01","4-1-2-001-02-01","3-1-2-001-02-01","7-1-2-001-02-01",{"$f":"IF('1. Autorización'!$I$6=\"Altiplano\",'CUENTAS CONTABLES'!C335,IF('1. Autorización'!$I$6=\"Sur\",'CUENTAS CONTABLES'!D335,IF('1. Autorización'!$I$6=\"Colegio Americano del Sur\",'CUENTAS CONTABLES'!E335,'CUENTAS CONTABLES'!B335)))","v":"1-1-2-001-02-01"}]
["INVERSIONES $ AGROMERCANTIL PERMANENTE RESTRINGIDO","1-1-2-001-02-03","4-1-2-001-02-03","3-1-2-001-02-03","7-1-2-001-02-03",{"$f":"IF('1. Autorización'!$I$6=\"Altiplano\",'CUENTAS CONTABLES'!C336,IF('1. Autorización'!$I$6=\"Sur\",'CUENTAS CONTABLES'!D336,IF('1. Autorización'!$I$6=\"Colegio Americano del Sur\",'CUENTAS CONTABLES'!E336,'CUENTAS CONTABLES'!B336)))","v":"1-1-2-001-02-03"}]
["INVERSIONES $ AGROMERCANTIL TEMPORAL RESTRINGIDO","1-1-2-001-02-02","4-1-2-001-02-02","3-1-2-001-02-02","7-1-2-001-02-02",{"$f":"IF('1. Autorización'!$I$6=\"Altiplano\",'CUENTAS CONTABLES'!C337,IF('1. Autorización'!$I$6=\"Sur\",'CUENTAS CONTABLES'!D337,IF('1. Autorización'!$I$6=\"Colegio Americano del Sur\",'CUENTAS CONTABLES'!E337,'CUENTAS CONTABLES'!B337)))","v":"1-1-2-001-02-02"}]
["INVERSIONES $ BAM PROYECTO USDA (TEMP.RESTRINGIDA)","1-1-2-001-02-19","4-1-2-001-02-19","3-1-2-001-02-19","7-1-2-001-02-19",{"$f":"IF('1. Autorización'!$I$6=\"Altiplano\",'CUENTAS CONTABLES'!C338,IF('1. Autorización'!$I$6=\"Sur\",'CUENTAS CONTABLES'!D338,IF('1. Autorización'!$I$6=\"Colegio Americano del Sur\",'CUENTAS CONTABLES'!E338,'CUENTAS CONTABLES'!B338)))","v":"1-1-2-001-02-19"}]
["INVERSIONES $ BANCO DE AMERICA CENTRAL","1-1-2-001-02-91","4-1-2-001-02-91","3-1-2-001-02-91","7-1-2-001-02-91",{"$f":"IF('1. Autorización'!$I$6=\"Altiplano\",'CUENTAS CONTABLES'!C339,IF('1. Autorización'!$I$6=\"Sur\",'CUENTAS CONTABLES'!D339,IF('1. Autorización'!$I$6=\"Colegio Americano del Sur\",'CUENTAS CONTABLES'!E339,'CUENTAS CONTABLES'!B339)))","v":"1-1-2-001-02-91"}]
["INVERSIONES $ BANCO DE AMERICA CENTRAL NO RESTRING","1-1-2-001-02-16","4-1-2-001-02-16","3-1-2-001-02-16","7-1-2-001-02-16",{"$f":"IF('1. Autorización'!$I$6=\"Altiplano\",'CUENTAS CONTABLES'!C340,IF('1. Autorización'!$I$6=\"Sur\",'CUENTAS CONTABLES'!D340,IF('1. Autorización'!$I$6=\"Colegio Americano del Sur\",'CUENTAS CONTABLES'!E340,'CUENTAS CONTABLES'!B340)))","v":"1-1-2-001-02-16"}]
["INVERSIONES $ BANCO DE AMERICA CENTRAL TEMP RESTRI","1-1-2-001-02-17","4-1-2-001-02-17","3-1-2-001-02-17","7-1-2-001-02-17",{"$f":"IF('1. Autorización'!$I$6=\"Altiplano\",'CUENTAS CONTABLES'!C341,IF('1. Autorización'!$I$6=\"Sur\",'CUENTAS CONTABLES'!D341,IF('1. Autorización'!$I$6=\"Colegio Americano del Sur\",'CUENTAS CONTABLES'!E341,'CUENTAS CONTABLES'!B341)))","v":"1-1-2-001-02-17"}]
["INVERSIONES $ BANCO INDUSTRIAL","1-1-2-001-02-89","4-1-2-001-02-89","3-1-2-001-02-89","7-1-2-001-02-89",{"$f":"IF('1. Autorización'!$I$6=\"Altiplano\",'CUENTAS CONTABLES'!C342,IF('1. Autorización'!$I$6=\"Sur\",'CUENTAS CONTABLES'!D342,IF('1. Autorización'!$I$6=\"Colegio Americano del Sur\",'CUENTAS CONTABLES'!E342,'CUENTAS CONTABLES'!B342)))","v":"1-1-2-001-02-89"}]
["INVERSIONES $ BANCO INDUSTRIAL NO RESTRINGIDO","1-1-2-001-02-04","4-1-2-001-02-04","3-1-2-001-02-04","7-1-2-001-02-04",{"$f":"IF('1. Autorización'!$I$6=\"Altiplano\",'CUENTAS CONTABLES'!C343,IF('1. Autorización'!$I$6=\"Sur\",'CUENTAS CONTABLES'!D343,IF('1. Autorización'!$I$6=\"Colegio Americano del Sur\",'CUENTAS CONTABLES'!E343,'CUENTAS CONTABLES'!B343)))","v":"1-1-2-001-02-04"}]
["INVERSIONES $ BANCO INDUSTRIAL PERMANENTE RESTRING","1-1-2-001-02-06","4-1-2-001-02-06","3-1-2-001-02-06","7-1-2-001-02-06",{"$f":"IF('1. Autorización'!$I$6=\"Altiplano\",'CUENTAS CONTABLES'!C344,IF('1. Autorización'!$I$6=\"Sur\",'CUENTAS CONTABLES'!D344,IF('1. Autorización'!$I$6=\"Colegio Americano del Sur\",'CUENTAS CONTABLES'!E344,'CUENTAS CONTABLES'!B344)))","v":"1-1-2-001-02-06"}]
["INVERSIONES $ BANCO INDUSTRIAL TEMPORAL RESTRINGID","1-1-2-001-02-05","4-1-2-001-02-05","3-1-2-001-02-05","7-1-2-001-02-05",{"$f":"IF('1. Autorización'!$I$6=\"Altiplano\",'CUENTAS CONTABLES'!C345,IF('1. Autorización'!$I$6=\"Sur\",'CUENTAS CONTABLES'!D345,IF('1. Autorización'!$I$6=\"Colegio Americano del Sur\",'CUENTAS CONTABLES'!E345,'CUENTAS CONTABLES'!B345)))","v":"1-1-2-001-02-05"}]
["INVERSIONES $ BANEX INTERNATIONAL BANK CORP","1-1-2-001-02-96","4-1-2-001-02-96","3-1-2-001-02-96","7-1-2-001-02-96",{"$f":"IF('1. Autorización'!$I$6=\"Altiplano\",'CUENTAS CONTABLES'!C346,IF('1. Autorización'!$I$6=\"Sur\",'CUENTAS CONTABLES'!D346,IF('1. Autorización'!$I$6=\"Colegio Americano del Sur\",'CUENTAS CONTABLES'!E346,'CUENTAS CONTABLES'!B346)))","v":"1-1-2-001-02-96"}]
["INVERSIONES $ CITIBANK","1-1-2-001-02-94","4-1-2-001-02-94","3-1-2-001-02-94","7-1-2-001-02-94",{"$f":"IF('1. Autorización'!$I$6=\"Altiplano\",'CUENTAS CONTABLES'!C347,IF('1. Autorización'!$I$6=\"Sur\",'CUENTAS CONTABLES'!D347,IF('1. Autorización'!$I$6=\"Colegio Americano del Sur\",'CUENTAS CONTABLES'!E347,'CUENTAS CONTABLES'!B347)))","v":"1-1-2-001-02-94"}]
["INVERSIONES $ CITIBANK NO RESTRINGIDO","1-1-2-001-02-13","4-1-2-001-02-13","3-1-2-001-02-13","7-1-2-001-02-13",{"$f":"IF('1. Autorización'!$I$6=\"Altiplano\",'CUENTAS CONTABLES'!C348,IF('1. Autorización'!$I$6=\"Sur\",'CUENTAS CONTABLES'!D348,IF('1. Autorización'!$I$6=\"Colegio Americano del Sur\",'CUENTAS CONTABLES'!E348,'CUENTAS CONTABLES'!B348)))","v":"1-1-2-001-02-13"}]
["INVERSIONES $ CITIBANK PERMANENT. RESTRINGIDO","1-1-2-001-02-15","4-1-2-001-02-15","3-1-2-001-02-15","7-1-2-001-02-15",{"$f":"IF('1. Autorización'!$I$6=\"Altiplano\",'CUENTAS CONTABLES'!C349,IF('1. Autorización'!$I$6=\"Sur\",'CUENTAS CONTABLES'!D349,IF('1. Autorización'!$I$6=\"Colegio Americano del Sur\",'CUENTAS CONTABLES'!E349,'CUENTAS CONTABLES'!B349)))","v":"1-1-2-001-02-15"}]
["INVERSIONES $ CITIBANK TEMP. RESTRINGIDO","1-1-2-001-02-14","4-1-2-001-02-14","3-1-2-001-02-14","7-1-2-001-02-14",{"$f":"IF('1. Autorización'!$I$6=\"Altiplano\",'CUENTAS CONTABLES'!C350,IF('1. Autorización'!$I$6=\"Sur\",'CUENTAS CONTABLES'!D350,IF('1. Autorización'!$I$6=\"Colegio Americano del Sur\",'CUENTAS CONTABLES'!E350,'CUENTAS CONTABLES'!B350)))","v":"1-1-2-001-02-14"}]
["INVERSIONES $ CUSCATLAN","1-1-2-001-02-98","4-1-2-001-02-98","3-1-2-001-02-98","7-1-2-001-02-98",{"$f":"IF('1. Autorización'!$I$6=\"Altiplano\",'CUENTAS CONTABLES'!C351,IF('1. Autorización'!$I$6=\"Sur\",'CUENTAS CONTABLES'!D351,IF('1. Autorización'!$I$6=\"Colegio Americano del Sur\",'CUENTAS CONTABLES'!E351,'CUENTAS CONTABLES'!B351)))","v":"1-1-2-001-02-98"}]
["INVERSIONES $ DIMENSION CAPITAL MANAGEMENT","1-1-2-001-02-95","4-1-2-001-02-95","3-1-2-001-02-95","7-1-2-001-02-95",{"$f":"IF('1. Autorización'!$I$6=\"Altiplano\",'CUENTAS CONTABLES'!C352,IF('1. Autorización'!$I$6=\"Sur\",'CUENTAS CONTABLES'!D352,IF('1. Autorización'!$I$6=\"Colegio Americano del Sur\",'CUENTAS CONTABLES'!E352,'CUENTAS CONTABLES'!B352)))","v":"1-1-2-001-02-95"}]
["INVERSIONES $ GTC BANK INC NO RESTRINGIDO","1-1-2-001-02-10","4-1-2-001-02-10","3-1-2-001-02-10","7-1-2-001-02-10",{"$f":"IF('1. Autorización'!$I$6=\"Altiplano\",'CUENTAS CONTABLES'!C353,IF('1. Autorización'!$I$6=\"Sur\",'CUENTAS CONTABLES'!D353,IF('1. Autorización'!$I$6=\"Colegio Americano del Sur\",'CUENTAS CONTABLES'!E353,'CUENTAS CONTABLES'!B353)))","v":"1-1-2-001-02-10"}]
["INVERSIONES $ GTC BANK INC PERMANENTE RESTRINGIDO","1-1-2-001-02-12","4-1-2-001-02-12","3-1-2-001-02-12","7-1-2-001-02-12",{"$f":"IF('1. Autorización'!$I$6=\"Altiplano\",'CUENTAS CONTABLES'!C354,IF('1. Autorización'!$I$6=\"Sur\",'CUENTAS CONTABLES'!D354,IF('1. Autorización'!$I$6=\"Colegio Americano del Sur\",'CUENTAS CONTABLES'!E354,'CUENTAS CONTABLES'!B354)))","v":"1-1-2-001-02-12"}]
["INVERSIONES $ GTC BANK INC TEMPORAL RESTRINGIDO","1-1-2-001-02-11","4-1-2-001-02-11","3-1-2-001-02-11","7-1-2-001-02-11",{"$f":"IF('1. Autorización'!$I$6=\"Altiplano\",'CUENTAS CONTABLES'!C355,IF('1. Autorización'!$I$6=\"Sur\",'CUENTAS CONTABLES'!D355,IF('1. Autorización'!$I$6=\"Colegio Americano del Sur\",'CUENTAS CONTABLES'!E355,'CUENTAS CONTABLES'!B355)))","v":"1-1-2-001-02-11"}]
["INVERSIONES $ GTC INC","1-1-2-001-02-97","4-1-2-001-02-97","3-1-2-001-02-97","7-1-2-001-02-97",{"$f":"IF('1. Autorización'!$I$6=\"Altiplano\",'CUENTAS CONTABLES'!C356,IF('1. Autorización'!$I$6=\"Sur\",'CUENTAS CONTABLES'!D356,IF('1. Autorización'!$I$6=\"Colegio Americano del Sur\",'CUENTAS CONTABLES'!E356,'CUENTAS CONTABLES'!B356)))","v":"1-1-2-001-02-97"}]
["INVERSIONES $ MERCOM BANK LTD NO RESTRINGIDA","1-1-2-001-02-22","4-1-2-001-02-22","3-1-2-001-02-22","7-1-2-001-02-22",{"$f":"IF('1. Autorización'!$I$6=\"Altiplano\",'CUENTAS CONTABLES'!C357,IF('1. Autorización'!$I$6=\"Sur\",'CUENTAS CONTABLES'!D357,IF('1. Autorización'!$I$6=\"Colegio Americano del Sur\",'CUENTAS CONTABLES'!E357,'CUENTAS CONTABLES'!B357)))","v":"1-1-2-001-02-22"}]
["INVERSIONES $ MERCOM BANK, LTD PERMANET. REST.","1-1-2-001-02-23","4-1-2-001-02-23","3-1-2-001-02-23","7-1-2-001-02-23",{"$f":"IF('1. Autorización'!$I$6=\"Altiplano\",'CUENTAS CONTABLES'!C358,IF('1. Autorización'!$I$6=\"Sur\",'CUENTAS CONTABLES'!D358,IF('1. Autorización'!$I$6=\"Colegio Americano del Sur\",'CUENTAS CONTABLES'!E358,'CUENTAS CONTABLES'!B358)))","v":"1-1-2-001-02-23"}]
["INVERSIONES $ MERCON BANK LTD TEMPORALMENTE RESTRI","1-1-2-001-02-21","4-1-2-001-02-21","3-1-2-001-02-21","7-1-2-001-02-21",{"$f":"IF('1. Autorización'!$I$6=\"Altiplano\",'CUENTAS CONTABLES'!C359,IF('1. Autorización'!$I$6=\"Sur\",'CUENTAS CONTABLES'!D359,IF('1. Autorización'!$I$6=\"Colegio Americano del Sur\",'CUENTAS CONTABLES'!E359,'CUENTAS CONTABLES'!B359)))","v":"1-1-2-001-02-21"}]
["INVERSIONES $ WESTRUST BANK","1-1-2-001-02-93","4-1-2-001-02-93","3-1-2-001-02-93","7-1-2-001-02-93",{"$f":"IF('1. Autorización'!$I$6=\"Altiplano\",'CUENTAS CONTABLES'!C360,IF('1. Autorización'!$I$6=\"Sur\",'CUENTAS CONTABLES'!D360,IF('1. Autorización'!$I$6=\"Colegio Americano del Sur\",'CUENTAS CONTABLES'!E360,'CUENTAS CONTABLES'!B360)))","v":"1-1-2-001-02-93"}]
["INVERSIONES $ WESTRUST BANK NO RESTRINGIDO","1-1-2-001-02-07","4-1-2-001-02-07","3-1-2-001-02-07","7-1-2-001-02-07",{"$f":"IF('1. Autorización'!$I$6=\"Altiplano\",'CUENTAS CONTABLES'!C361,IF('1. Autorización'!$I$6=\"Sur\",'CUENTAS CONTABLES'!D361,IF('1. Autorización'!$I$6=\"Colegio Americano del Sur\",'CUENTAS CONTABLES'!E361,'CUENTAS CONTABLES'!B361)))","v":"1-1-2-001-02-07"}]
["INVERSIONES $ WESTRUST BANK PERMANENTE RESTRINGIDO","1-1-2-001-02-09","4-1-2-001-02-09","3-1-2-001-02-09","7-1-2-001-02-09",{"$f":"IF('1. Autorización'!$I$6=\"Altiplano\",'CUENTAS CONTABLES'!C362,IF('1. Autorización'!$I$6=\"Sur\",'CUENTAS CONTABLES'!D362,IF('1. Autorización'!$I$6=\"Colegio Americano del Sur\",'CUENTAS CONTABLES'!E362,'CUENTAS CONTABLES'!B362)))","v":"1-1-2-001-02-09"}]
["INVERSIONES $ WESTRUST BANK TEMPORAL RESTRINGIDO","1-1-2-001-02-08","4-1-2-001-02-08","3-1-2-001-02-08","7-1-2-001-02-08",{"$f":"IF('1. Autorización'!$I$6=\"Altiplano\",'CUENTAS CONTABLES'!C363,IF('1. Autorización'!$I$6=\"Sur\",'CUENTAS CONTABLES'!D363,IF('1. Autorización'!$I$6=\"Colegio Americano del Sur\",'CUENTAS CONTABLES'!E363,'CUENTAS CONTABLES'!B363)))","v":"1-1-2-001-02-08"}]
["INVERSIONES BANCO AMERICA CENTRAL","1-1-2-001-01-98","4-1-2-001-01-98","3-1-2-001-01-98","7-1-2-001-01-98",{"$f":"IF('1. Autorización'!$I$6=\"Altiplano\",'CUENTAS CONTABLES'!C364,IF('1. Autorización'!$I$6=\"Sur\",'CUENTAS CONTABLES'!D364,IF('1. Autorización'!$I$6=\"Colegio Americano del Sur\",'CUENTAS CONTABLES'!E364,'CUENTAS CONTABLES'!B364)))","v":"1-1-2-001-01-98"}]
["INVERSIONES BANCO G&T CONTINENTAL Q","1-1-2-001-01-96","4-1-2-001-01-96","3-1-2-001-01-96","7-1-2-001-01-96",{"$f":"IF('1. Autorización'!$I$6=\"Altiplano\",'CUENTAS CONTABLES'!C365,IF('1. Autorización'!$I$6=\"Sur\",'CUENTAS CONTABLES'!D365,IF('1. Autorización'!$I$6=\"Colegio Americano del Sur\",'CUENTAS CONTABLES'!E365,'CUENTAS CONTABLES'!B365)))","v":"1-1-2-001-01-96"}]
["INVERSIONES BANCO INDUSTRIAL","1-1-2-001-01-99","4-1-2-001-01-99","3-1-2-001-01-99","7-1-2-001-01-99",{"$f":"IF('1. Autorización'!$I$6=\"Altiplano\",'CUENTAS CONTABLES'!C366,IF('1. Autorización'!$I$6=\"Sur\",'CUENTAS CONTABLES'!D366,IF('1. Autorización'!$I$6=\"Colegio Americano del Sur\",'CUENTAS CONTABLES'!E366,'CUENTAS CONTABLES'!B366)))","v":"1-1-2-001-01-99"}]
["INVERSIONES BANCO REFORMADOR","1-1-2-001-01-97","4-1-2-001-01-97","3-1-2-001-01-97","7-1-2-001-01-97",{"$f":"IF('1. Autorización'!$I$6=\"Altiplano\",'CUENTAS CONTABLES'!C367,IF('1. Autorización'!$I$6=\"Sur\",'CUENTAS CONTABLES'!D367,IF('1. Autorización'!$I$6=\"Colegio Americano del Sur\",'CUENTAS CONTABLES'!E367,'CUENTAS CONTABLES'!B367)))","v":"1-1-2-001-01-97"}]
["INVERSIONES EN TRANSITO $","1-1-2-001-02-20","4-1-2-001-02-20","3-1-2-001-02-20","7-1-2-001-02-20",{"$f":"IF('1. Autorización'!$I$6=\"Altiplano\",'CUENTAS CONTABLES'!C368,IF('1. Autorización'!$I$6=\"Sur\",'CUENTAS CONTABLES'!D368,IF('1. Autorización'!$I$6=\"Colegio Americano del Sur\",'CUENTAS CONTABLES'!E368,'CUENTAS CONTABLES'!B368)))","v":"1-1-2-001-02-20"}]
["INVERSIONES Q AGROMERCANTIL","1-1-2-001-01-95","4-1-2-001-01-95","3-1-2-001-01-95","7-1-2-001-01-95",{"$f":"IF('1. Autorización'!$I$6=\"Altiplano\",'CUENTAS CONTABLES'!C369,IF('1. Autorización'!$I$6=\"Sur\",'CUENTAS CONTABLES'!D369,IF('1. Autorización'!$I$6=\"Colegio Americano del Sur\",'CUENTAS CONTABLES'!E369,'CUENTAS CONTABLES'!B369)))","v":"1-1-2-001-01-95"}]
["INVERSIONES Q AGROMERCANTIL NO RESTRINGIDO","1-1-2-001-01-04","4-1-2-001-01-04","3-1-2-001-01-04","7-1-2-001-01-04",{"$f":"IF('1. Autorización'!$I$6=\"Altiplano\",'CUENTAS CONTABLES'!C370,IF('1. Autorización'!$I$6=\"Sur\",'CUENTAS CONTABLES'!D370,IF('1. Autorización'!$I$6=\"Colegio Americano del Sur\",'CUENTAS CONTABLES'!E370,'CUENTAS CONTABLES'!B370)))","v":"1-1-2-001-01-04"}]
["INVERSIONES Q AGROMERCANTIL PERMANENTE RESTRINGIDO","1-1-2-001-01-06","4-1-2-001-01-06","3-1-2-001-01-06","7-1-2-001-01-06",{"$f":"IF('1. Autorización'!$I$6=\"Altiplano\",'CUENTAS CONTABLES'!C371,IF('1. Autorización'!$I$6=\"Sur\",'CUENTAS CONTABLES'!D371,IF('1. Autorización'!$I$6=\"Colegio Americano del Sur\",'CUENTAS CONTABLES'!E371,'CUENTAS CONTABLES'!B371)))","v":"1-1-2-001-01-06"}]
["INVERSIONES Q AGROMERCANTIL TEMPORALMENTE RESTRING","1-1-2-001-01-05","4-1-2-001-01-05","3-1-2-001-01-05","7-1-2-001-01-05",{"$f":"IF('1. Autorización'!$I$6=\"Altiplano\",'CUENTAS CONTABLES'!C372,IF('1. Autorización'!$I$6=\"Sur\",'CUENTAS CONTABLES'!D372,IF('1. Autorización'!$I$6=\"Colegio Americano del Sur\",'CUENTAS CONTABLES'!E372,'CUENTAS CONTABLES'!B372)))","v":"1-1-2-001-01-05"}]
["INVERSIONES Q BAC NO RESTRINGIDO","1-1-2-001-01-13","4-1-2-001-01-13","3-1-2-001-01-13","7-1-2-001-01-13",{"$f":"IF('1. Autorización'!$I$6=\"Altiplano\",'CUENTAS CONTABLES'!C373,IF('1. Autorización'!$I$6=\"Sur\",'CUENTAS CONTABLES'!D373,IF('1. Autorización'!$I$6=\"Colegio Americano del Sur\",'CUENTAS CONTABLES'!E373,'CUENTAS CONTABLES'!B373)))","v":"1-1-2-001-01-13"}]
["INVERSIONES Q BAC PERMANENT. RESTRINGIDO","1-1-2-001-01-15","4-1-2-001-01-15","3-1-2-001-01-15","7-1-2-001-01-15",{"$f":"IF('1. Autorización'!$I$6=\"Altiplano\",'CUENTAS CONTABLES'!C374,IF('1. Autorización'!$I$6=\"Sur\",'CUENTAS CONTABLES'!D374,IF('1. Autorización'!$I$6=\"Colegio Americano del Sur\",'CUENTAS CONTABLES'!E374,'CUENTAS CONTABLES'!B374)))","v":"1-1-2-001-01-15"}]
["INVERSIONES Q BAC TEMP. RESTRINGIDO","1-1-2-001-01-14","4-1-2-001-01-14","3-1-2-001-01-14","7-1-2-001-01-14",{"$f":"IF('1. Autorización'!$I$6=\"Altiplano\",'CUENTAS CONTABLES'!C375,IF('1. Autorización'!$I$6=\"Sur\",'CUENTAS CONTABLES'!D375,IF('1. Autorización'!$I$6=\"Colegio Americano del Sur\",'CUENTAS CONTABLES'!E375,'CUENTAS CONTABLES'!B375)))","v":"1-1-2-001-01-14"}]
["INVERSIONES Q BANCO CUSCATLAN","1-1-2-001-01-94","4-1-2-001-01-94","3-1-2-001-01-94","7-1-2-001-01-94",{"$f":"IF('1. Autorización'!$I$6=\"Altiplano\",'CUENTAS CONTABLES'!C376,IF('1. Autorización'!$I$6=\"Sur\",'CUENTAS CONTABLES'!D376,IF('1. Autorización'!$I$6=\"Colegio Americano del Sur\",'CUENTAS CONTABLES'!E376,'CUENTAS CONTABLES'!B376)))","v":"1-1-2-001-01-94"}]
["INVERSIONES Q BANCO INDUSTRIAL NO RESTRINGIDO","1-1-2-001-01-07","4-1-2-001-01-07","3-1-2-001-01-07","7-1-2-001-01-07",{"$f":"IF('1. Autorización'!$I$6=\"Altiplano\",'CUENTAS CONTABLES'!C377,IF('1. Autorización'!$I$6=\"Sur\",'CUENTAS CONTABLES'!D377,IF('1. Autorización'!$I$6=\"Colegio Americano del Sur\",'CUENTAS CONTABLES'!E377,'CUENTAS CONTABLES'!B377)))","v":"1-1-2-001-01-07"}]
["INVERSIONES Q BANCO INDUSTRIAL PERMANENTE RESTRING","1-1-2-001-01-09","4-1-2-001-01-09","3-1-2-001-01-09","7-1-2-001-01-09",{"$f":"IF('1. Autorización'!$I$6=\"Altiplano\",'CUENTAS CONTABLES'!C378,IF('1. Autorización'!$I$6=\"Sur\",'CUENTAS CONTABLES'!D378,IF('1. Autorización'!$I$6=\"Colegio Americano del Sur\",'CUENTAS CONTABLES'!E378,'CUENTAS CONTABLES'!B378)))","v":"1-1-2-001-01-09"}]
["INVERSIONES Q BANCO INDUSTRIAL TEMPORAL RESTRINGID","1-1-2-001-01-08","4-1-2-001-01-08","3-1-2-001-01-08","7-1-2-001-01-08",{"$f":"IF('1. Autorización'!$I$6=\"Altiplano\",'CUENTAS CONTABLES'!C379,IF('1. Autorización'!$I$6=\"Sur\",'CUENTAS CONTABLES'!D379,IF('1. Autorización'!$I$6=\"Colegio Americano del Sur\",'CUENTAS CONTABLES'!E379,'CUENTAS CONTABLES'!B379)))","v":"1-1-2-001-01-08"}]
["INVERSIONES Q CITIBANK","1-1-2-001-01-93","4-1-2-001-01-93","3-1-2-001-01-93","7-1-2-001-01-93",{"$f":"IF('1. Autorización'!$I$6=\"Altiplano\",'CUENTAS CONTABLES'!C380,IF('1. Autorización'!$I$6=\"Sur\",'CUENTAS CONTABLES'!D380,IF('1. Autorización'!$I$6=\"Colegio Americano del Sur\",'CUENTAS CONTABLES'!E380,'CUENTAS CONTABLES'!B380)))","v":"1-1-2-001-01-93"}]
["INVERSIONES Q CITIBANK NO RESTRINGIDO","1-1-2-001-01-01","4-1-2-001-01-01","3-1-2-001-01-01","7-1-2-001-01-01",{"$f":"IF('1. Autorización'!$I$6=\"Altiplano\",'CUENTAS CONTABLES'!C381,IF('1. Autorización'!$I$6=\"Sur\",'CUENTAS CONTABLES'!D381,IF('1. Autorización'!$I$6=\"Colegio Americano del Sur\",'CUENTAS CONTABLES'!E381,'CUENTAS CONTABLES'!B381)))","v":"1-1-2-001-01-01"}]
["INVERSIONES Q CITIBANK PERMANENTE RESTRINGIDO","1-1-2-001-01-03","4-1-2-001-01-03","3-1-2-001-01-03","7-1-2-001-01-03",{"$f":"IF('1. Autorización'!$I$6=\"Altiplano\",'CUENTAS CONTABLES'!C382,IF('1. Autorización'!$I$6=\"Sur\",'CUENTAS CONTABLES'!D382,IF('1. Autorización'!$I$6=\"Colegio Americano del Sur\",'CUENTAS CONTABLES'!E382,'CUENTAS CONTABLES'!B382)))","v":"1-1-2-001-01-03"}]
["INVERSIONES Q CITIBANK TEMPORALMENTE RESTRINGIDO","1-1-2-001-01-02","4-1-2-001-01-02","3-1-2-001-01-02","7-1-2-001-01-02",{"$f":"IF('1. Autorización'!$I$6=\"Altiplano\",'CUENTAS CONTABLES'!C383,IF('1. Autorización'!$I$6=\"Sur\",'CUENTAS CONTABLES'!D383,IF('1. Autorización'!$I$6=\"Colegio Americano del Sur\",'CUENTAS CONTABLES'!E383,'CUENTAS CONTABLES'!B383)))","v":"1-1-2-001-01-02"}]
["INVERSIONES Q G & T CONTINENTAL NO RESTRINGIDO","1-1-2-001-01-10","4-1-2-001-01-10","3-1-2-001-01-10","7-1-2-001-01-10",{"$f":"IF('1. Autorización'!$I$6=\"Altiplano\",'CUENTAS CONTABLES'!C384,IF('1. Autorización'!$I$6=\"Sur\",'CUENTAS CONTABLES'!D384,IF('1. Autorización'!$I$6=\"Colegio Americano del Sur\",'CUENTAS CONTABLES'!E384,'CUENTAS CONTABLES'!B384)))","v":"1-1-2-001-01-10"}]
["INVERSIONES Q G & T CONTINENTAL PERMANENT. RESTRIN","1-1-2-001-01-12","4-1-2-001-01-12","3-1-2-001-01-12","7-1-2-001-01-12",{"$f":"IF('1. Autorización'!$I$6=\"Altiplano\",'CUENTAS CONTABLES'!C385,IF('1. Autorización'!$I$6=\"Sur\",'CUENTAS CONTABLES'!D385,IF('1. Autorización'!$I$6=\"Colegio Americano del Sur\",'CUENTAS CONTABLES'!E385,'CUENTAS CONTABLES'!B385)))","v":"1-1-2-001-01-12"}]
["INVERSIONES Q G & T CONTINENTAL TEMP. RESTRINGIDO","1-1-2-001-01-11","4-1-2-001-01-11","3-1-2-001-01-11","7-1-2-001-01-11",{"$f":"IF('1. Autorización'!$I$6=\"Altiplano\",'CUENTAS CONTABLES'!C386,IF('1. Autorización'!$I$6=\"Sur\",'CUENTAS CONTABLES'!D386,IF('1. Autorización'!$I$6=\"Colegio Americano del Sur\",'CUENTAS CONTABLES'!E386,'CUENTAS CONTABLES'!B386)))","v":"1-1-2-001-01-11"}]
["ISR POR COBRAR","1-1-1-003-09-02","4-1-1-003-09-02","3-1-1-003-09-02","7-1-1-003-09-02",{"$f":"IF('1. Autorización'!$I$6=\"Altiplano\",'CUENTAS CONTABLES'!C387,IF('1. Autorización'!$I$6=\"Sur\",'CUENTAS CONTABLES'!D387,IF('1. Autorización'!$I$6=\"Colegio Americano del Sur\",'CUENTAS CONTABLES'!E387,'CUENTAS CONTABLES'!B387)))","v":"1-1-1-003-09-02"}]
["LABORATORIO  O GIRAS DE CAMPO","1-5-1-001-01-12","4-5-1-001-01-12","3-5-1-001-01-12","7-5-1-001-01-12",{"$f":"IF('1. Autorización'!$I$6=\"Altiplano\",'CUENTAS CONTABLES'!C388,IF('1. Autorización'!$I$6=\"Sur\",'CUENTAS CONTABLES'!D388,IF('1. Autorización'!$I$6=\"Colegio Americano del Sur\",'CUENTAS CONTABLES'!E388,'CUENTAS CONTABLES'!B388)))","v":"1-5-1-001-01-12"}]
["LABORATORIO DE COMPUTACION","1-5-1-001-01-94","4-5-1-001-01-94","3-5-1-001-01-94","7-5-1-001-01-94",{"$f":"IF('1. Autorización'!$I$6=\"Altiplano\",'CUENTAS CONTABLES'!C389,IF('1. Autorización'!$I$6=\"Sur\",'CUENTAS CONTABLES'!D389,IF('1. Autorización'!$I$6=\"Colegio Americano del Sur\",'CUENTAS CONTABLES'!E389,'CUENTAS CONTABLES'!B389)))","v":"1-5-1-001-01-94"}]
["LIBROS Y/O MULTA BIBLIOTECA","1-5-1-001-02-06","4-5-1-001-02-06","3-5-1-001-02-06","7-5-1-001-02-06",{"$f":"IF('1. Autorización'!$I$6=\"Altiplano\",'CUENTAS CONTABLES'!C390,IF('1. Autorización'!$I$6=\"Sur\",'CUENTAS CONTABLES'!D390,IF('1. Autorización'!$I$6=\"Colegio Americano del Sur\",'CUENTAS CONTABLES'!E390,'CUENTAS CONTABLES'!B390)))","v":"1-5-1-001-02-06"}]
["MANTENIMIENTO DE MOBILIARIO","1-6-1-006-02-04","4-6-1-006-02-04","3-6-1-006-02-04","7-6-1-006-02-04",{"$f":"IF('1. Autorización'!$I$6=\"Altiplano\",'CUENTAS CONTABLES'!C391,IF('1. Autorización'!$I$6=\"Sur\",'CUENTAS CONTABLES'!D391,IF('1. Autorización'!$I$6=\"Colegio Americano del Sur\",'CUENTAS CONTABLES'!E391,'CUENTAS CONTABLES'!B391)))","v":"1-6-1-006-02-04"}]
["MANTENIMIENTO DE VEHICULOS","1-6-1-006-02-05","4-6-1-006-02-05","3-6-1-006-02-05","7-6-1-006-02-05",{"$f":"IF('1. Autorización'!$I$6=\"Altiplano\",'CUENTAS CONTABLES'!C392,IF('1. Autorización'!$I$6=\"Sur\",'CUENTAS CONTABLES'!D392,IF('1. Autorización'!$I$6=\"Colegio Americano del Sur\",'CUENTAS CONTABLES'!E392,'CUENTAS CONTABLES'!B392)))","v":"1-6-1-006-02-05"}]
["MANTENIMIENTO EQUIPO DE COMPUTACION","1-6-1-006-02-03","4-6-1-006-02-03","3-6-1-006-02-03","7-6-1-006-02-03",{"$f":"IF('1. Autorización'!$I$6=\"Altiplano\",'CUENTAS CONTABLES'!C393,IF('1. Autorización'!$I$6=\"Sur\",'CUENTAS CONTABLES'!D393,IF('1. Autorización'!$I$6=\"Colegio Americano del Sur\",'CUENTAS CONTABLES'!E393,'CUENTAS CONTABLES'!B393)))","v":"1-6-1-006-02-03"}]
["MANTENIMIENTO EQUIPO GENERAL","1-6-1-006-02-02","4-6-1-006-02-02","3-6-1-006-02-02","7-6-1-006-02-02",{"$f":"IF('1. Autorización'!$I$6=\"Altiplano\",'CUENTAS CONTABLES'!C394,IF('1. Autorización'!$I$6=\"Sur\",'CUENTAS CONTABLES'!D394,IF('1. Autorización'!$I$6=\"Colegio Americano del Sur\",'CUENTAS CONTABLES'!E394,'CUENTAS CONTABLES'!B394)))","v":"1-6-1-006-02-02"}]
["MAQUINARIA","1-1-3-001-07-01","4-1-3-001-07-01","3-1-3-001-07-01","7-1-3-001-07-01",{"$f":"IF('1. Autorización'!$I$6=\"Altiplano\",'CUENTAS CONTABLES'!C395,IF('1. Autorización'!$I$6=\"Sur\",'CUENTAS CONTABLES'!D395,IF('1. Autorización'!$I$6=\"Colegio Americano del Sur\",'CUENTAS CONTABLES'!E395,'CUENTAS CONTABLES'!B395)))","v":"1-1-3-001-07-01"}]
["MAQUINARIA (TEMPORAL)","1-1-3-001-07-02","4-1-3-001-07-02","3-1-3-001-07-02","7-1-3-001-07-02",{"$f":"IF('1. Autorización'!$I$6=\"Altiplano\",'CUENTAS CONTABLES'!C396,IF('1. Autorización'!$I$6=\"Sur\",'CUENTAS CONTABLES'!D396,IF('1. Autorización'!$I$6=\"Colegio Americano del Sur\",'CUENTAS CONTABLES'!E396,'CUENTAS CONTABLES'!B396)))","v":"1-1-3-001-07-02"}]
["MATERIAL DIDACTICO","1-6-1-002-01-05","4-6-1-002-01-05","3-6-1-002-01-05","7-6-1-002-01-05",{"$f":"IF('1. Autorización'!$I$6=\"Altiplano\",'CUENTAS CONTABLES'!C397,IF('1. Autorización'!$I$6=\"Sur\",'CUENTAS CONTABLES'!D397,IF('1. Autorización'!$I$6=\"Colegio Americano del Sur\",'CUENTAS CONTABLES'!E397,'CUENTAS CONTABLES'!B397)))","v":"1-6-1-002-01-05"}]
["MATERIAL PSICOMETRICO, PROMOCIONAL Y PRUEBAS","1-6-1-002-02-03","4-6-1-002-02-03","3-6-1-002-02-03","7-6-1-002-02-03",{"$f":"IF('1. Autorización'!$I$6=\"Altiplano\",'CUENTAS CONTABLES'!C398,IF('1. Autorización'!$I$6=\"Sur\",'CUENTAS CONTABLES'!D398,IF('1. Autorización'!$I$6=\"Colegio Americano del Sur\",'CUENTAS CONTABLES'!E398,'CUENTAS CONTABLES'!B398)))","v":"1-6-1-002-02-03"}]
["MATRICULAS","1-5-1-001-01-01","4-5-1-001-01-01","3-5-1-001-01-01","7-5-1-001-01-01",{"$f":"IF('1. Autorización'!$I$6=\"Altiplano\",'CUENTAS CONTABLES'!C399,IF('1. Autorización'!$I$6=\"Sur\",'CUENTAS CONTABLES'!D399,IF('1. Autorización'!$I$6=\"Colegio Americano del Sur\",'CUENTAS CONTABLES'!E399,'CUENTAS CONTABLES'!B399)))","v":"1-5-1-001-01-01"}]
["MEJORA Y CREACION DE EQUIPO","1-1-3-001-09-03","4-1-3-001-09-03","3-1-3-001-09-03","7-1-3-001-09-03",{"$f":"IF('1. Autorización'!$I$6=\"Altiplano\",'CUENTAS CONTABLES'!C400,IF('1. Autorización'!$I$6=\"Sur\",'CUENTAS CONTABLES'!D400,IF('1. Autorización'!$I$6=\"Colegio Americano del Sur\",'CUENTAS CONTABLES'!E400,'CUENTAS CONTABLES'!B400)))","v":"1-1-3-001-09-03"}]
["MERCOM BANK LTD TEMP. REST. (INT X COB S/INV)","1-1-1-003-08-27","4-1-1-003-08-27","3-1-1-003-08-27","7-1-1-003-08-27",{"$f":"IF('1. Autorización'!$I$6=\"Altiplano\",'CUENTAS CONTABLES'!C401,IF('1. Autorización'!$I$6=\"Sur\",'CUENTAS CONTABLES'!D401,IF('1. Autorización'!$I$6=\"Colegio Americano del Sur\",'CUENTAS CONTABLES'!E401,'CUENTAS CONTABLES'!B401)))","v":"1-1-1-003-08-27"}]
["MERCOM BANK LTD. NO REST. (INT. X COB S/INV)","1-1-1-003-08-28","4-1-1-003-08-28","3-1-1-003-08-28","7-1-1-003-08-28",{"$f":"IF('1. Autorización'!$I$6=\"Altiplano\",'CUENTAS CONTABLES'!C402,IF('1. Autorización'!$I$6=\"Sur\",'CUENTAS CONTABLES'!D402,IF('1. Autorización'!$I$6=\"Colegio Americano del Sur\",'CUENTAS CONTABLES'!E402,'CUENTAS CONTABLES'!B402)))","v":"1-1-1-003-08-28"}]
["MISCELANEOS","1-6-1-005-02-08","4-6-1-005-02-08","3-6-1-005-02-08","7-6-1-005-02-08",{"$f":"IF('1. Autorización'!$I$6=\"Altiplano\",'CUENTAS CONTABLES'!C403,IF('1. Autorización'!$I$6=\"Sur\",'CUENTAS CONTABLES'!D403,IF('1. Autorización'!$I$6=\"Colegio Americano del Sur\",'CUENTAS CONTABLES'!E403,'CUENTAS CONTABLES'!B403)))","v":"1-6-1-005-02-08"}]
["MOBILIARIO GENERAL","1-1-3-001-04-01","4-1-3-001-04-01","3-1-3-001-04-01","7-1-3-001-04-01",{"$f":"IF('1. Autorización'!$I$6=\"Altiplano\",'CUENTAS CONTABLES'!C404,IF('1. Autorización'!$I$6=\"Sur\",'CUENTAS CONTABLES'!D404,IF('1. Autorización'!$I$6=\"Colegio Americano del Sur\",'CUENTAS CONTABLES'!E404,'CUENTAS CONTABLES'!B404)))","v":"1-1-3-001-04-01"}]
["MOBILIARIO GENERAL (TEMPORAL)","1-1-3-001-04-02","4-1-3-001-04-02","3-1-3-001-04-02","7-1-3-001-04-02",{"$f":"IF('1. Autorización'!$I$6=\"Altiplano\",'CUENTAS CONTABLES'!C405,IF('1. Autorización'!$I$6=\"Sur\",'CUENTAS CONTABLES'!D405,IF('1. Autorización'!$I$6=\"Colegio Americano del Sur\",'CUENTAS CONTABLES'!E405,'CUENTAS CONTABLES'!B405)))","v":"1-1-3-001-04-02"}]
["NOMINA DE PERSONAL  EN TRANSITO","1-1-1-003-04-02","4-1-1-003-04-02","3-1-1-003-04-02","7-1-1-003-04-02",{"$f":"IF('1. Autorización'!$I$6=\"Altiplano\",'CUENTAS CONTABLES'!C406,IF('1. Autorización'!$I$6=\"Sur\",'CUENTAS CONTABLES'!D406,IF('1. Autorización'!$I$6=\"Colegio Americano del Sur\",'CUENTAS CONTABLES'!E406,'CUENTAS CONTABLES'!B406)))","v":"1-1-1-003-04-02"}]
["NOMINA DE PROYECTOS EN TRANSITO","1-1-1-003-04-03","4-1-1-003-04-03","3-1-1-003-04-03","7-1-1-003-04-03",{"$f":"IF('1. Autorización'!$I$6=\"Altiplano\",'CUENTAS CONTABLES'!C407,IF('1. Autorización'!$I$6=\"Sur\",'CUENTAS CONTABLES'!D407,IF('1. Autorización'!$I$6=\"Colegio Americano del Sur\",'CUENTAS CONTABLES'!E407,'CUENTAS CONTABLES'!B407)))","v":"1-1-1-003-04-03"}]
["OTROS FONDOS (GASTOS)","1-2-1-002-02-09","4-2-1-002-02-09","3-2-1-002-02-09","7-2-1-002-02-09",{"$f":"IF('1. Autorización'!$I$6=\"Altiplano\",'CUENTAS CONTABLES'!C408,IF('1. Autorización'!$I$6=\"Sur\",'CUENTAS CONTABLES'!D408,IF('1. Autorización'!$I$6=\"Colegio Americano del Sur\",'CUENTAS CONTABLES'!E408,'CUENTAS CONTABLES'!B408)))","v":"1-2-1-002-02-09"}]
["OTROS FONDOS (INGRESOS)","1-2-1-002-02-08","4-2-1-002-02-08","3-2-1-002-02-08","7-2-1-002-02-08",{"$f":"IF('1. Autorización'!$I$6=\"Altiplano\",'CUENTAS CONTABLES'!C409,IF('1. Autorización'!$I$6=\"Sur\",'CUENTAS CONTABLES'!D409,IF('1. Autorización'!$I$6=\"Colegio Americano del Sur\",'CUENTAS CONTABLES'!E409,'CUENTAS CONTABLES'!B409)))","v":"1-2-1-002-02-08"}]
["OTROS FONDOS (SIN PRESUPUESTO)","1-2-1-002-02-05","4-2-1-002-02-05","3-2-1-002-02-05","7-2-1-002-02-05",{"$f":"IF('1. Autorización'!$I$6=\"Altiplano\",'CUENTAS CONTABLES'!C410,IF('1. Autorización'!$I$6=\"Sur\",'CUENTAS CONTABLES'!D410,IF('1. Autorización'!$I$6=\"Colegio Americano del Sur\",'CUENTAS CONTABLES'!E410,'CUENTAS CONTABLES'!B410)))","v":"1-2-1-002-02-05"}]
["OTROS GASTOS AL PERSONAL","1-6-1-001-04-05","4-6-1-001-04-05","3-6-1-001-04-05","7-6-1-001-04-05",{"$f":"IF('1. Autorización'!$I$6=\"Altiplano\",'CUENTAS CONTABLES'!C411,IF('1. Autorización'!$I$6=\"Sur\",'CUENTAS CONTABLES'!D411,IF('1. Autorización'!$I$6=\"Colegio Americano del Sur\",'CUENTAS CONTABLES'!E411,'CUENTAS CONTABLES'!B411)))","v":"1-6-1-001-04-05"}]
["OTROS GASTOS FINANCIEROS","1-6-1-008-02-02","4-6-1-008-02-02","3-6-1-008-02-02","7-6-1-008-02-02",{"$f":"IF('1. Autorización'!$I$6=\"Altiplano\",'CUENTAS CONTABLES'!C412,IF('1. Autorización'!$I$6=\"Sur\",'CUENTAS CONTABLES'!D412,IF('1. Autorización'!$I$6=\"Colegio Americano del Sur\",'CUENTAS CONTABLES'!E412,'CUENTAS CONTABLES'!B412)))","v":"1-6-1-008-02-02"}]
["OTROS INGRESOS  EDUCACIONALES","1-5-1-001-01-13","4-5-1-001-01-13","3-5-1-001-01-13","7-5-1-001-01-13",{"$f":"IF('1. Autorización'!$I$6=\"Altiplano\",'CUENTAS CONTABLES'!C413,IF('1. Autorización'!$I$6=\"Sur\",'CUENTAS CONTABLES'!D413,IF('1. Autorización'!$I$6=\"Colegio Americano del Sur\",'CUENTAS CONTABLES'!E413,'CUENTAS CONTABLES'!B413)))","v":"1-5-1-001-01-13"}]
["OTROS INGRESOS DIFERIDOS (COBROS ANTICIPADOS)","1-2-1-009-01-06","4-2-1-009-01-06","3-2-1-009-01-06","7-2-1-009-01-06",{"$f":"IF('1. Autorización'!$I$6=\"Altiplano\",'CUENTAS CONTABLES'!C414,IF('1. Autorización'!$I$6=\"Sur\",'CUENTAS CONTABLES'!D414,IF('1. Autorización'!$I$6=\"Colegio Americano del Sur\",'CUENTAS CONTABLES'!E414,'CUENTAS CONTABLES'!B414)))","v":"1-2-1-009-01-06"}]
["OTROS INGRESOS VARIOS","1-5-1-004-02-04","4-5-1-004-02-04","3-5-1-004-02-04","7-5-1-004-02-04",{"$f":"IF('1. Autorización'!$I$6=\"Altiplano\",'CUENTAS CONTABLES'!C415,IF('1. Autorización'!$I$6=\"Sur\",'CUENTAS CONTABLES'!D415,IF('1. Autorización'!$I$6=\"Colegio Americano del Sur\",'CUENTAS CONTABLES'!E415,'CUENTAS CONTABLES'!B415)))","v":"1-5-1-004-02-04"}]
["OTROS SERVICIOS","1-6-1-003-02-08","4-6-1-003-02-08","3-6-1-003-02-08","7-6-1-003-02-08",{"$f":"IF('1. Autorización'!$I$6=\"Altiplano\",'CUENTAS CONTABLES'!C416,IF('1. Autorización'!$I$6=\"Sur\",'CUENTAS CONTABLES'!D416,IF('1. Autorización'!$I$6=\"Colegio Americano del Sur\",'CUENTAS CONTABLES'!E416,'CUENTAS CONTABLES'!B416)))","v":"1-6-1-003-02-08"}]
["OVERHEAD PROGRAMAS","1-5-1-004-02-01","4-5-1-004-02-01","3-5-1-004-02-01","7-5-1-004-02-01",{"$f":"IF('1. Autorización'!$I$6=\"Altiplano\",'CUENTAS CONTABLES'!C417,IF('1. Autorización'!$I$6=\"Sur\",'CUENTAS CONTABLES'!D417,IF('1. Autorización'!$I$6=\"Colegio Americano del Sur\",'CUENTAS CONTABLES'!E417,'CUENTAS CONTABLES'!B417)))","v":"1-5-1-004-02-01"}]
["PAPELERIA Y UTILES","1-6-1-002-02-02","4-6-1-002-02-02","3-6-1-002-02-02","7-6-1-002-02-02",{"$f":"IF('1. Autorización'!$I$6=\"Altiplano\",'CUENTAS CONTABLES'!C418,IF('1. Autorización'!$I$6=\"Sur\",'CUENTAS CONTABLES'!D418,IF('1. Autorización'!$I$6=\"Colegio Americano del Sur\",'CUENTAS CONTABLES'!E418,'CUENTAS CONTABLES'!B418)))","v":"1-6-1-002-02-02"}]
["PERDIDA EN BAJA DE ACTIVOS FIJOS","1-6-1-008-04-02","4-6-1-008-04-02","3-6-1-008-04-02","7-6-1-008-04-02",{"$f":"IF('1. Autorización'!$I$6=\"Altiplano\",'CUENTAS CONTABLES'!C419,IF('1. Autorización'!$I$6=\"Sur\",'CUENTAS CONTABLES'!D419,IF('1. Autorización'!$I$6=\"Colegio Americano del Sur\",'CUENTAS CONTABLES'!E419,'CUENTAS CONTABLES'!B419)))","v":"1-6-1-008-04-02"}]
["PERDIDA EN INVERSIONES","1-6-1-008-02-04","4-6-1-008-02-04","3-6-1-008-02-04","7-6-1-008-02-04",{"$f":"IF('1. Autorización'!$I$6=\"Altiplano\",'CUENTAS CONTABLES'!C420,IF('1. Autorización'!$I$6=\"Sur\",'CUENTAS CONTABLES'!D420,IF('1. Autorización'!$I$6=\"Colegio Americano del Sur\",'CUENTAS CONTABLES'!E420,'CUENTAS CONTABLES'!B420)))","v":"1-6-1-008-02-04"}]
["PERDIDA EN VENTA DE ACTIVOS FIJOS","1-6-1-008-04-01","4-6-1-008-04-01","3-6-1-008-04-01","7-6-1-008-04-01",{"$f":"IF('1. Autorización'!$I$6=\"Altiplano\",'CUENTAS CONTABLES'!C421,IF('1. Autorización'!$I$6=\"Sur\",'CUENTAS CONTABLES'!D421,IF('1. Autorización'!$I$6=\"Colegio Americano del Sur\",'CUENTAS CONTABLES'!E421,'CUENTAS CONTABLES'!B421)))","v":"1-6-1-008-04-01"}]
["PRESTAMO BID PROGRAMA ASISTENCIA TECNICA","1-2-2-002-01-02","4-2-2-002-01-02","3-2-2-002-01-02","7-2-2-002-01-02",{"$f":"IF('1. Autorización'!$I$6=\"Altiplano\",'CUENTAS CONTABLES'!C422,IF('1. Autorización'!$I$6=\"Sur\",'CUENTAS CONTABLES'!D422,IF('1. Autorización'!$I$6=\"Colegio Americano del Sur\",'CUENTAS CONTABLES'!E422,'CUENTAS CONTABLES'!B422)))","v":"1-2-2-002-01-02"}]
["PRESTAMO BID PROGRAMA DE BECAS","1-2-2-002-01-01","4-2-2-002-01-01","3-2-2-002-01-01","7-2-2-002-01-01",{"$f":"IF('1. Autorización'!$I$6=\"Altiplano\",'CUENTAS CONTABLES'!C423,IF('1. Autorización'!$I$6=\"Sur\",'CUENTAS CONTABLES'!D423,IF('1. Autorización'!$I$6=\"Colegio Americano del Sur\",'CUENTAS CONTABLES'!E423,'CUENTAS CONTABLES'!B423)))","v":"1-2-2-002-01-01"}]
["PROMESA INCONDICIONAL USO  INSTALACIONES ALTIPLANO","1-1-2-002-02-03","4-1-2-002-02-03","3-1-2-002-02-03","7-1-2-002-02-03",{"$f":"IF('1. Autorización'!$I$6=\"Altiplano\",'CUENTAS CONTABLES'!C424,IF('1. Autorización'!$I$6=\"Sur\",'CUENTAS CONTABLES'!D424,IF('1. Autorización'!$I$6=\"Colegio Americano del Sur\",'CUENTAS CONTABLES'!E424,'CUENTAS CONTABLES'!B424)))","v":"1-1-2-002-02-03"}]
["PROVEEDORES (PROVISION)","1-2-1-001-01-98","4-2-1-001-01-98","3-2-1-001-01-98","7-2-1-001-01-98",{"$f":"IF('1. Autorización'!$I$6=\"Altiplano\",'CUENTAS CONTABLES'!C425,IF('1. Autorización'!$I$6=\"Sur\",'CUENTAS CONTABLES'!D425,IF('1. Autorización'!$I$6=\"Colegio Americano del Sur\",'CUENTAS CONTABLES'!E425,'CUENTAS CONTABLES'!B425)))","v":"1-2-1-001-01-98"}]
["PROVISION AGUINALDO","1-2-1-006-01-01","4-2-1-006-01-01","3-2-1-006-01-01","7-2-1-006-01-01",{"$f":"IF('1. Autorización'!$I$6=\"Altiplano\",'CUENTAS CONTABLES'!C426,IF('1. Autorización'!$I$6=\"Sur\",'CUENTAS CONTABLES'!D426,IF('1. Autorización'!$I$6=\"Colegio Americano del Sur\",'CUENTAS CONTABLES'!E426,'CUENTAS CONTABLES'!B426)))","v":"1-2-1-006-01-01"}]
["PROVISION AGUINALDO DE PROYECTOS","1-2-1-006-02-01","4-2-1-006-02-01","3-2-1-006-02-01","7-2-1-006-02-01",{"$f":"IF('1. Autorización'!$I$6=\"Altiplano\",'CUENTAS CONTABLES'!C427,IF('1. Autorización'!$I$6=\"Sur\",'CUENTAS CONTABLES'!D427,IF('1. Autorización'!$I$6=\"Colegio Americano del Sur\",'CUENTAS CONTABLES'!E427,'CUENTAS CONTABLES'!B427)))","v":"1-2-1-006-02-01"}]
["PROVISION BONO 14","1-2-1-006-01-02","4-2-1-006-01-02","3-2-1-006-01-02","7-2-1-006-01-02",{"$f":"IF('1. Autorización'!$I$6=\"Altiplano\",'CUENTAS CONTABLES'!C428,IF('1. Autorización'!$I$6=\"Sur\",'CUENTAS CONTABLES'!D428,IF('1. Autorización'!$I$6=\"Colegio Americano del Sur\",'CUENTAS CONTABLES'!E428,'CUENTAS CONTABLES'!B428)))","v":"1-2-1-006-01-02"}]
["PROVISION BONO 14 DE PROYECTOS","1-2-1-006-02-02","4-2-1-006-02-02","3-2-1-006-02-02","7-2-1-006-02-02",{"$f":"IF('1. Autorización'!$I$6=\"Altiplano\",'CUENTAS CONTABLES'!C429,IF('1. Autorización'!$I$6=\"Sur\",'CUENTAS CONTABLES'!D429,IF('1. Autorización'!$I$6=\"Colegio Americano del Sur\",'CUENTAS CONTABLES'!E429,'CUENTAS CONTABLES'!B429)))","v":"1-2-1-006-02-02"}]
["PROVISION DE COMPRAS (RECEPCION CON ENVIO)","1-2-1-001-01-99","4-2-1-001-01-99","3-2-1-001-01-99","7-2-1-001-01-99",{"$f":"IF('1. Autorización'!$I$6=\"Altiplano\",'CUENTAS CONTABLES'!C430,IF('1. Autorización'!$I$6=\"Sur\",'CUENTAS CONTABLES'!D430,IF('1. Autorización'!$I$6=\"Colegio Americano del Sur\",'CUENTAS CONTABLES'!E430,'CUENTAS CONTABLES'!B430)))","v":"1-2-1-001-01-99"}]
["PROVISION INDEMNIZACION","1-2-1-006-01-03","4-2-1-006-01-03","3-2-1-006-01-03","7-2-1-006-01-03",{"$f":"IF('1. Autorización'!$I$6=\"Altiplano\",'CUENTAS CONTABLES'!C431,IF('1. Autorización'!$I$6=\"Sur\",'CUENTAS CONTABLES'!D431,IF('1. Autorización'!$I$6=\"Colegio Americano del Sur\",'CUENTAS CONTABLES'!E431,'CUENTAS CONTABLES'!B431)))","v":"1-2-1-006-01-03"}]
["PROVISION INDEMNIZACION DE PROYECTOS","1-2-1-006-02-03","4-2-1-006-02-03","3-2-1-006-02-03","7-2-1-006-02-03",{"$f":"IF('1. Autorización'!$I$6=\"Altiplano\",'CUENTAS CONTABLES'!C432,IF('1. Autorización'!$I$6=\"Sur\",'CUENTAS CONTABLES'!D432,IF('1. Autorización'!$I$6=\"Colegio Americano del Sur\",'CUENTAS CONTABLES'!E432,'CUENTAS CONTABLES'!B432)))","v":"1-2-1-006-02-03"}]
["PROYECTOS (TEMPORAL)","1-1-1-003-98-02","4-1-1-003-98-02","3-1-1-003-98-02","7-1-1-003-98-02",{"$f":"IF('1. Autorización'!$I$6=\"Altiplano\",'CUENTAS CONTABLES'!C433,IF('1. Autorización'!$I$6=\"Sur\",'CUENTAS CONTABLES'!D433,IF('1. Autorización'!$I$6=\"Colegio Americano del Sur\",'CUENTAS CONTABLES'!E433,'CUENTAS CONTABLES'!B433)))","v":"1-1-1-003-98-02"}]
["PROYECTOS SEDES (GASTOS)","1-2-1-002-02-12","4-2-1-002-02-12","3-2-1-002-02-12","7-2-1-002-02-12",{"$f":"IF('1. Autorización'!$I$6=\"Altiplano\",'CUENTAS CONTABLES'!C434,IF('1. Autorización'!$I$6=\"Sur\",'CUENTAS CONTABLES'!D434,IF('1. Autorización'!$I$6=\"Colegio Americano del Sur\",'CUENTAS CONTABLES'!E434,'CUENTAS CONTABLES'!B434)))","v":"1-2-1-002-02-12"}]
["PROYECTOS SEDES (INGRESOS)","1-2-1-002-02-11","4-2-1-002-02-11","3-2-1-002-02-11","7-2-1-002-02-11",{"$f":"IF('1. Autorización'!$I$6=\"Altiplano\",'CUENTAS CONTABLES'!C435,IF('1. Autorización'!$I$6=\"Sur\",'CUENTAS CONTABLES'!D435,IF('1. Autorización'!$I$6=\"Colegio Americano del Sur\",'CUENTAS CONTABLES'!E435,'CUENTAS CONTABLES'!B435)))","v":"1-2-1-002-02-11"}]
["PROYECTOS SEDES (SIN PRESUPUESTO)","1-2-1-002-02-10","4-2-1-002-02-10","3-2-1-002-02-10","7-2-1-002-02-10",{"$f":"IF('1. Autorización'!$I$6=\"Altiplano\",'CUENTAS CONTABLES'!C436,IF('1. Autorización'!$I$6=\"Sur\",'CUENTAS CONTABLES'!D436,IF('1. Autorización'!$I$6=\"Colegio Americano del Sur\",'CUENTAS CONTABLES'!E436,'CUENTAS CONTABLES'!B436)))","v":"1-2-1-002-02-10"}]
["PRUEBAS PSICOMETRICAS","1-5-1-001-02-01","4-5-1-001-02-01","3-5-1-001-02-01","7-5-1-001-02-01",{"$f":"IF('1. Autorización'!$I$6=\"Altiplano\",'CUENTAS CONTABLES'!C437,IF('1. Autorización'!$I$6=\"Sur\",'CUENTAS CONTABLES'!D437,IF('1. Autorización'!$I$6=\"Colegio Americano del Sur\",'CUENTAS CONTABLES'!E437,'CUENTAS CONTABLES'!B437)))","v":"1-5-1-001-02-01"}]
["PUBLICIDAD Y ANUNCIOS","1-6-1-003-02-05","4-6-1-003-02-05","3-6-1-003-02-05","7-6-1-003-02-05",{"$f":"IF('1. Autorización'!$I$6=\"Altiplano\",'CUENTAS CONTABLES'!C438,IF('1. Autorización'!$I$6=\"Sur\",'CUENTAS CONTABLES'!D438,IF('1. Autorización'!$I$6=\"Colegio Americano del Sur\",'CUENTAS CONTABLES'!E438,'CUENTAS CONTABLES'!B438)))","v":"1-6-1-003-02-05"}]
["RECARGO POR CHEQUES RECHAZADOS","1-5-1-003-02-02","4-5-1-003-02-02","3-5-1-003-02-02","7-5-1-003-02-02",{"$f":"IF('1. Autorización'!$I$6=\"Altiplano\",'CUENTAS CONTABLES'!C439,IF('1. Autorización'!$I$6=\"Sur\",'CUENTAS CONTABLES'!D439,IF('1. Autorización'!$I$6=\"Colegio Americano del Sur\",'CUENTAS CONTABLES'!E439,'CUENTAS CONTABLES'!B439)))","v":"1-5-1-003-02-02"}]
["RECARGOS E INTERESES EN CARTERA","1-5-1-003-02-01","4-5-1-003-02-01","3-5-1-003-02-01","7-5-1-003-02-01",{"$f":"IF('1. Autorización'!$I$6=\"Altiplano\",'CUENTAS CONTABLES'!C440,IF('1. Autorización'!$I$6=\"Sur\",'CUENTAS CONTABLES'!D440,IF('1. Autorización'!$I$6=\"Colegio Americano del Sur\",'CUENTAS CONTABLES'!E440,'CUENTAS CONTABLES'!B440)))","v":"1-5-1-003-02-01"}]
["RECLUTAMIENTO","1-6-1-007-02-04","4-6-1-007-02-04","3-6-1-007-02-04","7-6-1-007-02-04",{"$f":"IF('1. Autorización'!$I$6=\"Altiplano\",'CUENTAS CONTABLES'!C441,IF('1. Autorización'!$I$6=\"Sur\",'CUENTAS CONTABLES'!D441,IF('1. Autorización'!$I$6=\"Colegio Americano del Sur\",'CUENTAS CONTABLES'!E441,'CUENTAS CONTABLES'!B441)))","v":"1-6-1-007-02-04"}]
["RECUPERACIÓN DE CUENTAS INCOBRABLES","1-5-1-001-03-01","4-5-1-001-03-01","3-5-1-001-03-01","7-5-1-001-03-01",{"$f":"IF('1. Autorización'!$I$6=\"Altiplano\",'CUENTAS CONTABLES'!C442,IF('1. Autorización'!$I$6=\"Sur\",'CUENTAS CONTABLES'!D442,IF('1. Autorización'!$I$6=\"Colegio Americano del Sur\",'CUENTAS CONTABLES'!E442,'CUENTAS CONTABLES'!B442)))","v":"1-5-1-001-03-01"}]
["RECUPERACION EN INVERSIONES","1-5-1-003-01-05","4-5-1-003-01-05","3-5-1-003-01-05","7-5-1-003-01-05",{"$f":"IF('1. Autorización'!$I$6=\"Altiplano\",'CUENTAS CONTABLES'!C443,IF('1. Autorización'!$I$6=\"Sur\",'CUENTAS CONTABLES'!D443,IF('1. Autorización'!$I$6=\"Colegio Americano del Sur\",'CUENTAS CONTABLES'!E443,'CUENTAS CONTABLES'!B443)))","v":"1-5-1-003-01-05"}]
["REEMBOLSOS","1-6-1-007-02-05","4-6-1-007-02-05","3-6-1-007-02-05","7-6-1-007-02-05",{"$f":"IF('1. Autorización'!$I$6=\"Altiplano\",'CUENTAS CONTABLES'!C444,IF('1. Autorización'!$I$6=\"Sur\",'CUENTAS CONTABLES'!D444,IF('1. Autorización'!$I$6=\"Colegio Americano del Sur\",'CUENTAS CONTABLES'!E444,'CUENTAS CONTABLES'!B444)))","v":"1-6-1-007-02-05"}]
["REMODELACIONES DE EDIFICIOS E INSTALACIONES","1-1-4-001-03-02","4-1-4-001-03-02","3-1-4-001-03-02","7-1-4-001-03-02",{"$f":"IF('1. Autorización'!$I$6=\"Altiplano\",'CUENTAS CONTABLES'!C445,IF('1. Autorización'!$I$6=\"Sur\",'CUENTAS CONTABLES'!D445,IF('1. Autorización'!$I$6=\"Colegio Americano del Sur\",'CUENTAS CONTABLES'!E445,'CUENTAS CONTABLES'!B445)))","v":"1-1-4-001-03-02"}]
["RENDIMIENTO SOBRE ACCIONES","1-5-1-003-01-04","4-5-1-003-01-04","3-5-1-003-01-04","7-5-1-003-01-04",{"$f":"IF('1. Autorización'!$I$6=\"Altiplano\",'CUENTAS CONTABLES'!C446,IF('1. Autorización'!$I$6=\"Sur\",'CUENTAS CONTABLES'!D446,IF('1. Autorización'!$I$6=\"Colegio Americano del Sur\",'CUENTAS CONTABLES'!E446,'CUENTAS CONTABLES'!B446)))","v":"1-5-1-003-01-04"}]
["RENDIMIENTO SOBRE INVERSIONES","1-5-1-003-01-01","4-5-1-003-01-01","3-5-1-003-01-01","7-5-1-003-01-01",{"$f":"IF('1. Autorización'!$I$6=\"Altiplano\",'CUENTAS CONTABLES'!C447,IF('1. Autorización'!$I$6=\"Sur\",'CUENTAS CONTABLES'!D447,IF('1. Autorización'!$I$6=\"Colegio Americano del Sur\",'CUENTAS CONTABLES'!E447,'CUENTAS CONTABLES'!B447)))","v":"1-5-1-003-01-01"}]
["REP Y MANT DE EDIFICIOS E INSTALACIONES","1-6-1-006-02-01","4-6-1-006-02-01","3-6-1-006-02-01","7-6-1-006-02-01",{"$f":"IF('1. Autorización'!$I$6=\"Altiplano\",'CUENTAS CONTABLES'!C448,IF('1. Autorización'!$I$6=\"Sur\",'CUENTAS CONTABLES'!D448,IF('1. Autorización'!$I$6=\"Colegio Americano del Sur\",'CUENTAS CONTABLES'!E448,'CUENTAS CONTABLES'!B448)))","v":"1-6-1-006-02-01"}]
["RETENCIONES A EMPLEADOS (PROYECTOS)","1-2-1-004-02-02","4-2-1-004-02-02","3-2-1-004-02-02","7-2-1-004-02-02",{"$f":"IF('1. Autorización'!$I$6=\"Altiplano\",'CUENTAS CONTABLES'!C449,IF('1. Autorización'!$I$6=\"Sur\",'CUENTAS CONTABLES'!D449,IF('1. Autorización'!$I$6=\"Colegio Americano del Sur\",'CUENTAS CONTABLES'!E449,'CUENTAS CONTABLES'!B449)))","v":"1-2-1-004-02-02"}]
["RETENCIONES A EMPLEADOS (UVG)","1-2-1-004-01-02","4-2-1-004-01-02","3-2-1-004-01-02","7-2-1-004-01-02",{"$f":"IF('1. Autorización'!$I$6=\"Altiplano\",'CUENTAS CONTABLES'!C450,IF('1. Autorización'!$I$6=\"Sur\",'CUENTAS CONTABLES'!D450,IF('1. Autorización'!$I$6=\"Colegio Americano del Sur\",'CUENTAS CONTABLES'!E450,'CUENTAS CONTABLES'!B450)))","v":"1-2-1-004-01-02"}]
["RETENCIONES A NO DOMICILIADOS (PROYECTOS)","1-2-1-004-02-03","4-2-1-004-02-03","3-2-1-004-02-03","7-2-1-004-02-03",{"$f":"IF('1. Autorización'!$I$6=\"Altiplano\",'CUENTAS CONTABLES'!C451,IF('1. Autorización'!$I$6=\"Sur\",'CUENTAS CONTABLES'!D451,IF('1. Autorización'!$I$6=\"Colegio Americano del Sur\",'CUENTAS CONTABLES'!E451,'CUENTAS CONTABLES'!B451)))","v":"1-2-1-004-02-03"}]
["RETENCIONES A NO DOMICILIADOS (UVG)","1-2-1-004-01-03","4-2-1-004-01-03","3-2-1-004-01-03","7-2-1-004-01-03",{"$f":"IF('1. Autorización'!$I$6=\"Altiplano\",'CUENTAS CONTABLES'!C452,IF('1. Autorización'!$I$6=\"Sur\",'CUENTAS CONTABLES'!D452,IF('1. Autorización'!$I$6=\"Colegio Americano del Sur\",'CUENTAS CONTABLES'!E452,'CUENTAS CONTABLES'!B452)))","v":"1-2-1-004-01-03"}]
["RETENCIONES A PROVEEDORES (PROYECTOS)","1-2-1-004-02-01","4-2-1-004-02-01","3-2-1-004-02-01","7-2-1-004-02-01",{"$f":"IF('1. Autorización'!$I$6=\"Altiplano\",'CUENTAS CONTABLES'!C453,IF('1. Autorización'!$I$6=\"Sur\",'CUENTAS CONTABLES'!D453,IF('1. Autorización'!$I$6=\"Colegio Americano del Sur\",'CUENTAS CONTABLES'!E453,'CUENTAS CONTABLES'!B453)))","v":"1-2-1-004-02-01"}]
["RETENCIONES A PROVEEDORES (UVG)","1-2-1-004-01-01","4-2-1-004-01-01","3-2-1-004-01-01","7-2-1-004-01-01",{"$f":"IF('1. Autorización'!$I$6=\"Altiplano\",'CUENTAS CONTABLES'!C454,IF('1. Autorización'!$I$6=\"Sur\",'CUENTAS CONTABLES'!D454,IF('1. Autorización'!$I$6=\"Colegio Americano del Sur\",'CUENTAS CONTABLES'!E454,'CUENTAS CONTABLES'!B454)))","v":"1-2-1-004-01-01"}]
["RETENCIONES ISR FACTURA ESPECIAL PROYECTOS","1-2-1-004-02-04","4-2-1-004-02-04","3-2-1-004-02-04","7-2-1-004-02-04",{"$f":"IF('1. Autorización'!$I$6=\"Altiplano\",'CUENTAS CONTABLES'!C455,IF('1. Autorización'!$I$6=\"Sur\",'CUENTAS CONTABLES'!D455,IF('1. Autorización'!$I$6=\"Colegio Americano del Sur\",'CUENTAS CONTABLES'!E455,'CUENTAS CONTABLES'!B455)))","v":"1-2-1-004-02-04"}]
["RETENCIONES ISR FACTURA ESPECIAL UVG","1-2-1-004-01-04","4-2-1-004-01-04","3-2-1-004-01-04","7-2-1-004-01-04",{"$f":"IF('1. Autorización'!$I$6=\"Altiplano\",'CUENTAS CONTABLES'!C456,IF('1. Autorización'!$I$6=\"Sur\",'CUENTAS CONTABLES'!D456,IF('1. Autorización'!$I$6=\"Colegio Americano del Sur\",'CUENTAS CONTABLES'!E456,'CUENTAS CONTABLES'!B456)))","v":"1-2-1-004-01-04"}]
["RUPTURA DE MATERIAL","1-5-1-001-02-08","4-5-1-001-02-08","3-5-1-001-02-08","7-5-1-001-02-08",{"$f":"IF('1. Autorización'!$I$6=\"Altiplano\",'CUENTAS CONTABLES'!C457,IF('1. Autorización'!$I$6=\"Sur\",'CUENTAS CONTABLES'!D457,IF('1. Autorización'!$I$6=\"Colegio Americano del Sur\",'CUENTAS CONTABLES'!E457,'CUENTAS CONTABLES'!B457)))","v":"1-5-1-001-02-08"}]
["SEGURO MEDICO COLECTIVO","1-2-1-003-01-03","4-2-1-003-01-03","3-2-1-003-01-03","7-2-1-003-01-03",{"$f":"IF('1. Autorización'!$I$6=\"Altiplano\",'CUENTAS CONTABLES'!C458,IF('1. Autorización'!$I$6=\"Sur\",'CUENTAS CONTABLES'!D458,IF('1. Autorización'!$I$6=\"Colegio Americano del Sur\",'CUENTAS CONTABLES'!E458,'CUENTAS CONTABLES'!B458)))","v":"1-2-1-003-01-03"}]
["SEGURO MEDICO DE ESTIPENDIOS","1-6-1-007-02-06","4-6-1-007-02-06","3-6-1-007-02-06","7-6-1-007-02-06",{"$f":"IF('1. Autorización'!$I$6=\"Altiplano\",'CUENTAS CONTABLES'!C459,IF('1. Autorización'!$I$6=\"Sur\",'CUENTAS CONTABLES'!D459,IF('1. Autorización'!$I$6=\"Colegio Americano del Sur\",'CUENTAS CONTABLES'!E459,'CUENTAS CONTABLES'!B459)))","v":"1-6-1-007-02-06"}]
["SEGURO MEDICO DE PERSONAL","1-6-1-001-04-01","4-6-1-001-04-01","3-6-1-001-04-01","7-6-1-001-04-01",{"$f":"IF('1. Autorización'!$I$6=\"Altiplano\",'CUENTAS CONTABLES'!C460,IF('1. Autorización'!$I$6=\"Sur\",'CUENTAS CONTABLES'!D460,IF('1. Autorización'!$I$6=\"Colegio Americano del Sur\",'CUENTAS CONTABLES'!E460,'CUENTAS CONTABLES'!B460)))","v":"1-6-1-001-04-01"}]
["SEGUROS Y FIANZAS","1-6-1-003-02-09","4-6-1-003-02-09","3-6-1-003-02-09","7-6-1-003-02-09",{"$f":"IF('1. Autorización'!$I$6=\"Altiplano\",'CUENTAS CONTABLES'!C461,IF('1. Autorización'!$I$6=\"Sur\",'CUENTAS CONTABLES'!D461,IF('1. Autorización'!$I$6=\"Colegio Americano del Sur\",'CUENTAS CONTABLES'!E461,'CUENTAS CONTABLES'!B461)))","v":"1-6-1-003-02-09"}]
["SERVICIO DE SEGURIDAD","1-6-1-003-02-02","4-6-1-003-02-02","3-6-1-003-02-02","7-6-1-003-02-02",{"$f":"IF('1. Autorización'!$I$6=\"Altiplano\",'CUENTAS CONTABLES'!C462,IF('1. Autorización'!$I$6=\"Sur\",'CUENTAS CONTABLES'!D462,IF('1. Autorización'!$I$6=\"Colegio Americano del Sur\",'CUENTAS CONTABLES'!E462,'CUENTAS CONTABLES'!B462)))","v":"1-6-1-003-02-02"}]
["SERVICIO DE TRANSPORTE","1-6-1-003-02-03","4-6-1-003-02-03","3-6-1-003-02-03","7-6-1-003-02-03",{"$f":"IF('1. Autorización'!$I$6=\"Altiplano\",'CUENTAS CONTABLES'!C463,IF('1. Autorización'!$I$6=\"Sur\",'CUENTAS CONTABLES'!D463,IF('1. Autorización'!$I$6=\"Colegio Americano del Sur\",'CUENTAS CONTABLES'!E463,'CUENTAS CONTABLES'!B463)))","v":"1-6-1-003-02-03"}]
["SERVICIOS DE COMUNICACIÓN","1-6-1-003-01-01","4-6-1-003-01-01","3-6-1-003-01-01","7-6-1-003-01-01",{"$f":"IF('1. Autorización'!$I$6=\"Altiplano\",'CUENTAS CONTABLES'!C464,IF('1. Autorización'!$I$6=\"Sur\",'CUENTAS CONTABLES'!D464,IF('1. Autorización'!$I$6=\"Colegio Americano del Sur\",'CUENTAS CONTABLES'!E464,'CUENTAS CONTABLES'!B464)))","v":"1-6-1-003-01-01"}]
["SERVICIOS EGS","1-6-1-007-02-07","4-6-1-007-02-07","3-6-1-007-02-07","7-6-1-007-02-07",{"$f":"IF('1. Autorización'!$I$6=\"Altiplano\",'CUENTAS CONTABLES'!C465,IF('1. Autorización'!$I$6=\"Sur\",'CUENTAS CONTABLES'!D465,IF('1. Autorización'!$I$6=\"Colegio Americano del Sur\",'CUENTAS CONTABLES'!E465,'CUENTAS CONTABLES'!B465)))","v":"1-6-1-007-02-07"}]
["SUBSIDIOS","1-5-1-001-01-95","4-5-1-001-01-95","3-5-1-001-01-95","7-5-1-001-01-95",{"$f":"IF('1. Autorización'!$I$6=\"Altiplano\",'CUENTAS CONTABLES'!C466,IF('1. Autorización'!$I$6=\"Sur\",'CUENTAS CONTABLES'!D466,IF('1. Autorización'!$I$6=\"Colegio Americano del Sur\",'CUENTAS CONTABLES'!E466,'CUENTAS CONTABLES'!B466)))","v":"1-5-1-001-01-95"}]
["SUELDOS","1-6-1-001-01-01","4-6-1-001-01-01","3-6-1-001-01-01","7-6-1-001-01-01",{"$f":"IF('1. Autorización'!$I$6=\"Altiplano\",'CUENTAS CONTABLES'!C467,IF('1. Autorización'!$I$6=\"Sur\",'CUENTAS CONTABLES'!D467,IF('1. Autorización'!$I$6=\"Colegio Americano del Sur\",'CUENTAS CONTABLES'!E467,'CUENTAS CONTABLES'!B467)))","v":"1-6-1-001-01-01"}]
["SUFICIENCIA ACREDITAMIENTO A PENSUM","1-5-1-001-01-04","4-5-1-001-01-04","3-5-1-001-01-04","7-5-1-001-01-04",{"$f":"IF('1. Autorización'!$I$6=\"Altiplano\",'CUENTAS CONTABLES'!C468,IF('1. Autorización'!$I$6=\"Sur\",'CUENTAS CONTABLES'!D468,IF('1. Autorización'!$I$6=\"Colegio Americano del Sur\",'CUENTAS CONTABLES'!E468,'CUENTAS CONTABLES'!B468)))","v":"1-5-1-001-01-04"}]
["SUMINISTROS AGROQUIMICOS","1-6-1-002-01-03","4-6-1-002-01-03","3-6-1-002-01-03","7-6-1-002-01-03",{"$f":"IF('1. Autorización'!$I$6=\"Altiplano\",'CUENTAS CONTABLES'!C469,IF('1. Autorización'!$I$6=\"Sur\",'CUENTAS CONTABLES'!D469,IF('1. Autorización'!$I$6=\"Colegio Americano del Sur\",'CUENTAS CONTABLES'!E469,'CUENTAS CONTABLES'!B469)))","v":"1-6-1-002-01-03"}]
["SUMINISTROS DE LABORATORIO","1-6-1-002-01-01","4-6-1-002-01-01","3-6-1-002-01-01","7-6-1-002-01-01",{"$f":"IF('1. Autorización'!$I$6=\"Altiplano\",'CUENTAS CONTABLES'!C470,IF('1. Autorización'!$I$6=\"Sur\",'CUENTAS CONTABLES'!D470,IF('1. Autorización'!$I$6=\"Colegio Americano del Sur\",'CUENTAS CONTABLES'!E470,'CUENTAS CONTABLES'!B470)))","v":"1-6-1-002-01-01"}]
["SUMINISTROS PARA COMPUTADORAS","1-6-1-002-01-02","4-6-1-002-01-02","3-6-1-002-01-02","7-6-1-002-01-02",{"$f":"IF('1. Autorización'!$I$6=\"Altiplano\",'CUENTAS CONTABLES'!C471,IF('1. Autorización'!$I$6=\"Sur\",'CUENTAS CONTABLES'!D471,IF('1. Autorización'!$I$6=\"Colegio Americano del Sur\",'CUENTAS CONTABLES'!E471,'CUENTAS CONTABLES'!B471)))","v":"1-6-1-002-01-02"}]
["SUMINISTROS PARA DEPORTES","1-6-1-002-01-04","4-6-1-002-01-04","3-6-1-002-01-04","7-6-1-002-01-04",{"$f":"IF('1. Autorización'!$I$6=\"Altiplano\",'CUENTAS CONTABLES'!C472,IF('1. Autorización'!$I$6=\"Sur\",'CUENTAS CONTABLES'!D472,IF('1. Autorización'!$I$6=\"Colegio Americano del Sur\",'CUENTAS CONTABLES'!E472,'CUENTAS CONTABLES'!B472)))","v":"1-6-1-002-01-04"}]
["SUMINISTROS VARIOS","1-6-1-002-02-04","4-6-1-002-02-04","3-6-1-002-02-04","7-6-1-002-02-04",{"$f":"IF('1. Autorización'!$I$6=\"Altiplano\",'CUENTAS CONTABLES'!C473,IF('1. Autorización'!$I$6=\"Sur\",'CUENTAS CONTABLES'!D473,IF('1. Autorización'!$I$6=\"Colegio Americano del Sur\",'CUENTAS CONTABLES'!E473,'CUENTAS CONTABLES'!B473)))","v":"1-6-1-002-02-04"}]
["TARJETAS DE CREDITO (TEMPORAL)","1-1-1-003-98-01","4-1-1-003-98-01","3-1-1-003-98-01","7-1-1-003-98-01",{"$f":"IF('1. Autorización'!$I$6=\"Altiplano\",'CUENTAS CONTABLES'!C474,IF('1. Autorización'!$I$6=\"Sur\",'CUENTAS CONTABLES'!D474,IF('1. Autorización'!$I$6=\"Colegio Americano del Sur\",'CUENTAS CONTABLES'!E474,'CUENTAS CONTABLES'!B474)))","v":"1-1-1-003-98-01"}]
["TERRENOS","1-1-3-001-01-01","4-1-3-001-01-01","3-1-3-001-01-01","7-1-3-001-01-01",{"$f":"IF('1. Autorización'!$I$6=\"Altiplano\",'CUENTAS CONTABLES'!C475,IF('1. Autorización'!$I$6=\"Sur\",'CUENTAS CONTABLES'!D475,IF('1. Autorización'!$I$6=\"Colegio Americano del Sur\",'CUENTAS CONTABLES'!E475,'CUENTAS CONTABLES'!B475)))","v":"1-1-3-001-01-01"}]
["TERRENOS (TEMPORAL)","1-1-3-001-01-02","4-1-3-001-01-02","3-1-3-001-01-02","7-1-3-001-01-02",{"$f":"IF('1. Autorización'!$I$6=\"Altiplano\",'CUENTAS CONTABLES'!C476,IF('1. Autorización'!$I$6=\"Sur\",'CUENTAS CONTABLES'!D476,IF('1. Autorización'!$I$6=\"Colegio Americano del Sur\",'CUENTAS CONTABLES'!E476,'CUENTAS CONTABLES'!B476)))","v":"1-1-3-001-01-02"}]
["TITULOS DE INVERSION EN MONEDA EXTRANJERA (FNR)","1-1-2-001-04-07","4-1-2-001-04-07","3-1-2-001-04-07","7-1-2-001-04-07",{"$f":"IF('1. Autorización'!$I$6=\"Altiplano\",'CUENTAS CONTABLES'!C477,IF('1. Autorización'!$I$6=\"Sur\",'CUENTAS CONTABLES'!D477,IF('1. Autorización'!$I$6=\"Colegio Americano del Sur\",'CUENTAS CONTABLES'!E477,'CUENTAS CONTABLES'!B477)))","v":"1-1-2-001-04-07"}]
["TITULOS DE INVERSION EN MONEDA EXTRANJERA (FPR)","1-1-2-001-04-09","4-1-2-001-04-09","3-1-2-001-04-09","7-1-2-001-04-09",{"$f":"IF('1. Autorización'!$I$6=\"Altiplano\",'CUENTAS CONTABLES'!C478,IF('1. Autorización'!$I$6=\"Sur\",'CUENTAS CONTABLES'!D478,IF('1. Autorización'!$I$6=\"Colegio Americano del Sur\",'CUENTAS CONTABLES'!E478,'CUENTAS CONTABLES'!B478)))","v":"1-1-2-001-04-09"}]
["TITULOS DE INVERSION EN MONEDA EXTRANJERA (FTR)","1-1-2-001-04-08","4-1-2-001-04-08","3-1-2-001-04-08","7-1-2-001-04-08",{"$f":"IF('1. Autorización'!$I$6=\"Altiplano\",'CUENTAS CONTABLES'!C479,IF('1. Autorización'!$I$6=\"Sur\",'CUENTAS CONTABLES'!D479,IF('1. Autorización'!$I$6=\"Colegio Americano del Sur\",'CUENTAS CONTABLES'!E479,'CUENTAS CONTABLES'!B479)))","v":"1-1-2-001-04-08"}]
["TITULOS DE INVERSION EN MONEDA LOCAL (FNR)","1-1-2-001-03-07","4-1-2-001-03-07","3-1-2-001-03-07","7-1-2-001-03-07",{"$f":"IF('1. Autorización'!$I$6=\"Altiplano\",'CUENTAS CONTABLES'!C480,IF('1. Autorización'!$I$6=\"Sur\",'CUENTAS CONTABLES'!D480,IF('1. Autorización'!$I$6=\"Colegio Americano del Sur\",'CUENTAS CONTABLES'!E480,'CUENTAS CONTABLES'!B480)))","v":"1-1-2-001-03-07"}]
["TITULOS DE INVERSION EN MONEDA LOCAL (FPR)","1-1-2-001-03-09","4-1-2-001-03-09","3-1-2-001-03-09","7-1-2-001-03-09",{"$f":"IF('1. Autorización'!$I$6=\"Altiplano\",'CUENTAS CONTABLES'!C481,IF('1. Autorización'!$I$6=\"Sur\",'CUENTAS CONTABLES'!D481,IF('1. Autorización'!$I$6=\"Colegio Americano del Sur\",'CUENTAS CONTABLES'!E481,'CUENTAS CONTABLES'!B481)))","v":"1-1-2-001-03-09"}]
["TITULOS DE INVERSION EN MONEDA LOCAL (FTR)","1-1-2-001-03-08","4-1-2-001-03-08","3-1-2-001-03-08","7-1-2-001-03-08",{"$f":"IF('1. Autorización'!$I$6=\"Altiplano\",'CUENTAS CONTABLES'!C482,IF('1. Autorización'!$I$6=\"Sur\",'CUENTAS CONTABLES'!D482,IF('1. Autorización'!$I$6=\"Colegio Americano del Sur\",'CUENTAS CONTABLES'!E482,'CUENTAS CONTABLES'!B482)))","v":"1-1-2-001-03-08"}]
["TRANSFERENCIAS BANCARIAS","1-1-1-003-04-01","4-1-1-003-04-01","3-1-1-003-04-01","7-1-1-003-04-01",{"$f":"IF('1. Autorización'!$I$6=\"Altiplano\",'CUENTAS CONTABLES'!C483,IF('1. Autorización'!$I$6=\"Sur\",'CUENTAS CONTABLES'!D483,IF('1. Autorización'!$I$6=\"Colegio Americano del Sur\",'CUENTAS CONTABLES'!E483,'CUENTAS CONTABLES'!B483)))","v":"1-1-1-003-04-01"}]
["TRANSFERENCIAS PRESUPUESTARIAS","1-1-1-003-04-04","4-1-1-003-04-04","3-1-1-003-04-04","7-1-1-003-04-04",{"$f":"IF('1. Autorización'!$I$6=\"Altiplano\",'CUENTAS CONTABLES'!C484,IF('1. Autorización'!$I$6=\"Sur\",'CUENTAS CONTABLES'!D484,IF('1. Autorización'!$I$6=\"Colegio Americano del Sur\",'CUENTAS CONTABLES'!E484,'CUENTAS CONTABLES'!B484)))","v":"1-1-1-003-04-04"}]
["TRASLADO","1-6-1-007-02-01","4-6-1-007-02-01","3-6-1-007-02-01","7-6-1-007-02-01",{"$f":"IF('1. Autorización'!$I$6=\"Altiplano\",'CUENTAS CONTABLES'!C485,IF('1. Autorización'!$I$6=\"Sur\",'CUENTAS CONTABLES'!D485,IF('1. Autorización'!$I$6=\"Colegio Americano del Sur\",'CUENTAS CONTABLES'!E485,'CUENTAS CONTABLES'!B485)))","v":"1-6-1-007-02-01"}]
["UNIFORMES","1-6-1-001-04-02","4-6-1-001-04-02","3-6-1-001-04-02","7-6-1-001-04-02",{"$f":"IF('1. Autorización'!$I$6=\"Altiplano\",'CUENTAS CONTABLES'!C486,IF('1. Autorización'!$I$6=\"Sur\",'CUENTAS CONTABLES'!D486,IF('1. Autorización'!$I$6=\"Colegio Americano del Sur\",'CUENTAS CONTABLES'!E486,'CUENTAS CONTABLES'!B486)))","v":"1-6-1-001-04-02"}]
["USO DE INSTALACIONES Y EQUIPO","1-5-1-004-01-03","4-5-1-004-01-03","3-5-1-004-01-03","7-5-1-004-01-03",{"$f":"IF('1. Autorización'!$I$6=\"Altiplano\",'CUENTAS CONTABLES'!C487,IF('1. Autorización'!$I$6=\"Sur\",'CUENTAS CONTABLES'!D487,IF('1. Autorización'!$I$6=\"Colegio Americano del Sur\",'CUENTAS CONTABLES'!E487,'CUENTAS CONTABLES'!B487)))","v":"1-5-1-004-01-03"}]
["VACACIONES (EN LIQUIDACION LABORAL)","1-6-1-001-03-02","4-6-1-001-03-02","3-6-1-001-03-02","7-6-1-001-03-02",{"$f":"IF('1. Autorización'!$I$6=\"Altiplano\",'CUENTAS CONTABLES'!C488,IF('1. Autorización'!$I$6=\"Sur\",'CUENTAS CONTABLES'!D488,IF('1. Autorización'!$I$6=\"Colegio Americano del Sur\",'CUENTAS CONTABLES'!E488,'CUENTAS CONTABLES'!B488)))","v":"1-6-1-001-03-02"}]
["VARIOS","1-6-1-007-02-08","4-6-1-007-02-08","3-6-1-007-02-08","7-6-1-007-02-08",{"$f":"IF('1. Autorización'!$I$6=\"Altiplano\",'CUENTAS CONTABLES'!C489,IF('1. Autorización'!$I$6=\"Sur\",'CUENTAS CONTABLES'!D489,IF('1. Autorización'!$I$6=\"Colegio Americano del Sur\",'CUENTAS CONTABLES'!E489,'CUENTAS CONTABLES'!B489)))","v":"1-6-1-007-02-08"}]
["VEHICULOS","1-1-3-001-06-01","4-1-3-001-06-01","3-1-3-001-06-01","7-1-3-001-06-01",{"$f":"IF('1. Autorización'!$I$6=\"Altiplano\",'CUENTAS CONTABLES'!C490,IF('1. Autorización'!$I$6=\"Sur\",'CUENTAS CONTABLES'!D490,IF('1. Autorización'!$I$6=\"Colegio Americano del Sur\",'CUENTAS CONTABLES'!E490,'CUENTAS CONTABLES'!B490)))","v":"1-1-3-001-06-01"}]
["VEHICULOS (BUSES Y OTROS)","1-1-3-001-06-03","4-1-3-001-06-03","3-1-3-001-06-03","7-1-3-001-06-03",{"$f":"IF('1. Autorización'!$I$6=\"Altiplano\",'CUENTAS CONTABLES'!C491,IF('1. Autorización'!$I$6=\"Sur\",'CUENTAS CONTABLES'!D491,IF('1. Autorización'!$I$6=\"Colegio Americano del Sur\",'CUENTAS CONTABLES'!E491,'CUENTAS CONTABLES'!B491)))","v":"1-1-3-001-06-03"}]
["VEHICULOS (TEMPORAL)","1-1-3-001-06-02","4-1-3-001-06-02","3-1-3-001-06-02","7-1-3-001-06-02",{"$f":"IF('1. Autorización'!$I$6=\"Altiplano\",'CUENTAS CONTABLES'!C492,IF('1. Autorización'!$I$6=\"Sur\",'CUENTAS CONTABLES'!D492,IF('1. Autorización'!$I$6=\"Colegio Americano del Sur\",'CUENTAS CONTABLES'!E492,'CUENTAS CONTABLES'!B492)))","v":"1-1-3-001-06-02"}]
["VIATICOS","1-6-1-004-01-04","4-6-1-004-01-04","3-6-1-004-01-04","7-6-1-004-01-04",{"$f":"IF('1. Autorización'!$I$6=\"Altiplano\",'CUENTAS CONTABLES'!C493,IF('1. Autorización'!$I$6=\"Sur\",'CUENTAS CONTABLES'!D493,IF('1. Autorización'!$I$6=\"Colegio Americano del Sur\",'CUENTAS CONTABLES'!E493,'CUENTAS CONTABLES'!B493)))","v":"1-6-1-004-01-04"}]
["WESTRUST BANK NO RESTRINGIDO (INT.X COB.S/INV)","1-1-1-003-08-09","4-1-1-003-08-09","3-1-1-003-08-09","7-1-1-003-08-09",{"$f":"IF('1. Autorización'!$I$6=\"Altiplano\",'CUENTAS CONTABLES'!C494,IF('1. Autorización'!$I$6=\"Sur\",'CUENTAS CONTABLES'!D494,IF('1. Autorización'!$I$6=\"Colegio Americano del Sur\",'CUENTAS CONTABLES'!E494,'CUENTAS CONTABLES'!B494)))","v":"1-1-1-003-08-09"}]
["WESTRUST BANK TEMPORAL.RESTRINGIDO(INTXCOB.INV)","1-1-1-003-08-10","4-1-1-003-08-10","3-1-1-003-08-10","7-1-1-003-08-10",{"$f":"IF('1. Autorización'!$I$6=\"Altiplano\",'CUENTAS CONTABLES'!C495,IF('1. Autorización'!$I$6=\"Sur\",'CUENTAS CONTABLES'!D495,IF('1. Autorización'!$I$6=\"Colegio Americano del Sur\",'CUENTAS CONTABLES'!E495,'CUENTAS CONTABLES'!B495)))","v":"1-1-1-003-08-10"}]

{"sheet":"PROGRAMAS","index":1,"n_rows":436,"n_cols":12,"rows_kept":436,"cut":false,"hidden":true,"merged":[[0,0,0,1],[0,2,0,3],[0,4,0,5],[0,8,0,9],[0,6,0,7]]}
["CENTRAL",null,"ALTIPLANO",null,"SUR",null,"CAS",null,"DEFINITIVOS",null,null,"Sedes"]
["NOMBRE DE PROGRAMA","PROGRAMA","NOMBRE DE PROGRAMA","PROGRAMA","NOMBRE DE PROGRAMA","PROGRAMA","NOMBRE DE PROGRAMA","PROGRAMA","NOMBRE DE PROGRAMA","PROGRAMA",null,"Central"]
["ADMINISTRACION DE LABORATORIOS",1371000,"AYUDAS FINANCIERAS",5510200,"AYUDAS FINANCIERAS",4480101,"CAS","7000000",{"$f":"IF(IF('1. Autorización'!$I$6=\"Altiplano\",C3,IF('1. Autorización'!$I$6=\"Sur\",E3,IF('1. Autorización'!$I$6=\"Colegio Americano del Sur\",G3,A3)))=0,\"\",IF('1. Autorización'!$I$6=\"Altiplano\",C3,IF('1. Autorización'!$I$6=\"Sur\",E3,IF('1. Autorización'!$I$6=\"Colegio Americano del Sur\",G3,A3))))","v":"ADMINISTRACION DE LABORATORIOS"},{"$f":"IF(IF('1. Autorización'!$I$6=\"Altiplano\",D3,IF('1. Autorización'!$I$6=\"Sur\",F3,IF('1. Autorización'!$I$6=\"Colegio Americano del Sur\",H3,B3)))=0,\"\",IF('1. Autorización'!$I$6=\"Altiplano\",D3,IF('1. Autorización'!$I$6=\"Sur\",F3,IF('1. Autorización'!$I$6=\"Colegio Americano del Sur\",H3,B3))))","v":1371000},null,"Sur"]
["ADMINISTRACION DOMINIO GT",1430601,"BACH CC Y LETRAS CON ESPECIALIDAD EN COMPUTACION",5480205,"BACH EN CC Y LETRAS C/ORIENTACION EN FINAN Y ADMON",4510105,"DIRECCION CAS","7100110",{"$f":"IF(IF('1. Autorización'!$I$6=\"Altiplano\",C4,IF('1. Autorización'!$I$6=\"Sur\",E4,IF('1. Autorización'!$I$6=\"Colegio Americano del Sur\",G4,A4)))=0,\"\",IF('1. Autorización'!$I$6=\"Altiplano\",C4,IF('1. Autorización'!$I$6=\"Sur\",E4,IF('1. Autorización'!$I$6=\"Colegio Americano del Sur\",G4,A4))))","v":"ADMINISTRACION DOMINIO GT"},{"$f":"IF(IF('1. Autorización'!$I$6=\"Altiplano\",D4,IF('1. Autorización'!$I$6=\"Sur\",F4,IF('1. Autorización'!$I$6=\"Colegio Americano del Sur\",H4,B4)))=0,\"\",IF('1. Autorización'!$I$6=\"Altiplano\",D4,IF('1. Autorización'!$I$6=\"Sur\",F4,IF('1. Autorización'!$I$6=\"Colegio Americano del Sur\",H4,B4))))","v":1430601},null,"Altiplano"]
["AJUSTE PRESUPUESTARIO",1450101,"BACH CC.Y  LETRAS  CON ESPECIALIDAD EN TURISMO",5480204,"BACHILLERATO EN CC. Y LETRAS CON ORIENTACION COMPU",4510104,"COORDINACION PREPRIMARIA","7100210",{"$f":"IF(IF('1. Autorización'!$I$6=\"Altiplano\",C5,IF('1. Autorización'!$I$6=\"Sur\",E5,IF('1. Autorización'!$I$6=\"Colegio Americano del Sur\",G5,A5)))=0,\"\",IF('1. Autorización'!$I$6=\"Altiplano\",C5,IF('1. Autorización'!$I$6=\"Sur\",E5,IF('1. Autorización'!$I$6=\"Colegio Americano del Sur\",G5,A5))))","v":"AJUSTE PRESUPUESTARIO"},{"$f":"IF(IF('1. Autorización'!$I$6=\"Altiplano\",D5,IF('1. Autorización'!$I$6=\"Sur\",F5,IF('1. Autorización'!$I$6=\"Colegio Americano del Sur\",H5,B5)))=0,\"\",IF('1. Autorización'!$I$6=\"Altiplano\",D5,IF('1. Autorización'!$I$6=\"Sur\",F5,IF('1. Autorización'!$I$6=\"Colegio Americano del Sur\",H5,B5))))","v":1450101},null,"Colegio Americano del Sur"]
["ANALISIS DE DATOS CON KNIME.",8010304,"BACH. EN CC. LT. CON ESPECIALIDAD EN HORTICULTURA",5480203,"BACHILLERATO EN CIENCIAS Y L. CON ORIENT. EN ED.",4510103,"COORDINACION PRIMARIA","7100310",{"$f":"IF(IF('1. Autorización'!$I$6=\"Altiplano\",C6,IF('1. Autorización'!$I$6=\"Sur\",E6,IF('1. Autorización'!$I$6=\"Colegio Americano del Sur\",G6,A6)))=0,\"\",IF('1. Autorización'!$I$6=\"Altiplano\",C6,IF('1. Autorización'!$I$6=\"Sur\",E6,IF('1. Autorización'!$I$6=\"Colegio Americano del Sur\",G6,A6))))","v":"ANALISIS DE DATOS CON KNIME."},{"$f":"IF(IF('1. Autorización'!$I$6=\"Altiplano\",D6,IF('1. Autorización'!$I$6=\"Sur\",F6,IF('1. Autorización'!$I$6=\"Colegio Americano del Sur\",H6,B6)))=0,\"\",IF('1. Autorización'!$I$6=\"Altiplano\",D6,IF('1. Autorización'!$I$6=\"Sur\",F6,IF('1. Autorización'!$I$6=\"Colegio Americano del Sur\",H6,B6))))","v":8010304},null,"Fundación de la UVG"]
["ANALISIS DE DATOS CON R Y RSTUDIO",8010301,"BACHILLERATO EN CIENCIAS Y LETRAS",5480201,"BACHILLERATO EN MECATRONICA",4510101,"COORDINACION ESCUELA MEDIA","7100410",{"$f":"IF(IF('1. Autorización'!$I$6=\"Altiplano\",C7,IF('1. Autorización'!$I$6=\"Sur\",E7,IF('1. Autorización'!$I$6=\"Colegio Americano del Sur\",G7,A7)))=0,\"\",IF('1. Autorización'!$I$6=\"Altiplano\",C7,IF('1. Autorización'!$I$6=\"Sur\",E7,IF('1. Autorización'!$I$6=\"Colegio Americano del Sur\",G7,A7))))","v":"ANALISIS DE DATOS CON R Y RSTUDIO"},{"$f":"IF(IF('1. Autorización'!$I$6=\"Altiplano\",D7,IF('1. Autorización'!$I$6=\"Sur\",F7,IF('1. Autorización'!$I$6=\"Colegio Americano del Sur\",H7,B7)))=0,\"\",IF('1. Autorización'!$I$6=\"Altiplano\",D7,IF('1. Autorización'!$I$6=\"Sur\",F7,IF('1. Autorización'!$I$6=\"Colegio Americano del Sur\",H7,B7))))","v":8010301},null,"4 Grados Norte"]
["ANTROPOLOGIA Y SOCIOLOGIA (EDUCON)",8020100,"BACHILLERATO EN CIENCIAS Y LETRAS CON ORIENT EN ED",5480202,"BACHILLERATO EN PRODUCTOS AGRICOLAS",4510102,"BIBLIOTECA","7100510",{"$f":"IF(IF('1. Autorización'!$I$6=\"Altiplano\",C8,IF('1. Autorización'!$I$6=\"Sur\",E8,IF('1. Autorización'!$I$6=\"Colegio Americano del Sur\",G8,A8)))=0,\"\",IF('1. Autorización'!$I$6=\"Altiplano\",C8,IF('1. Autorización'!$I$6=\"Sur\",E8,IF('1. Autorización'!$I$6=\"Colegio Americano del Sur\",G8,A8))))","v":"ANTROPOLOGIA Y SOCIOLOGIA (EDUCON)"},{"$f":"IF(IF('1. Autorización'!$I$6=\"Altiplano\",D8,IF('1. Autorización'!$I$6=\"Sur\",F8,IF('1. Autorización'!$I$6=\"Colegio Americano del Sur\",H8,B8)))=0,\"\",IF('1. Autorización'!$I$6=\"Altiplano\",D8,IF('1. Autorización'!$I$6=\"Sur\",F8,IF('1. Autorización'!$I$6=\"Colegio Americano del Sur\",H8,B8))))","v":8020100}]
["APRENDIZAJE DEL ARTE DRAMATICO",8040201,"BIBLIOTECA Y CENTRO DE RECURSOS",5330000,"CAMPO AGRICOLA",4470403,"COORDINACION HIGH SCHOOL","7100610",{"$f":"IF(IF('1. Autorización'!$I$6=\"Altiplano\",C9,IF('1. Autorización'!$I$6=\"Sur\",E9,IF('1. Autorización'!$I$6=\"Colegio Americano del Sur\",G9,A9)))=0,\"\",IF('1. Autorización'!$I$6=\"Altiplano\",C9,IF('1. Autorización'!$I$6=\"Sur\",E9,IF('1. Autorización'!$I$6=\"Colegio Americano del Sur\",G9,A9))))","v":"APRENDIZAJE DEL ARTE DRAMATICO"},{"$f":"IF(IF('1. Autorización'!$I$6=\"Altiplano\",D9,IF('1. Autorización'!$I$6=\"Sur\",F9,IF('1. Autorización'!$I$6=\"Colegio Americano del Sur\",H9,B9)))=0,\"\",IF('1. Autorización'!$I$6=\"Altiplano\",D9,IF('1. Autorización'!$I$6=\"Sur\",F9,IF('1. Autorización'!$I$6=\"Colegio Americano del Sur\",H9,B9))))","v":8040201}]
["ARTE EXTRACURRICULAR",1500203,"CAMPUS ALTIPLANO - OPERACION GENERAL",5000000,"CAMPUS SUR - OPERACION GENERAL",4000000,"TECNOLOGIA","7100710",{"$f":"IF(IF('1. Autorización'!$I$6=\"Altiplano\",C10,IF('1. Autorización'!$I$6=\"Sur\",E10,IF('1. Autorización'!$I$6=\"Colegio Americano del Sur\",G10,A10)))=0,\"\",IF('1. Autorización'!$I$6=\"Altiplano\",C10,IF('1. Autorización'!$I$6=\"Sur\",E10,IF('1. Autorización'!$I$6=\"Colegio Americano del Sur\",G10,A10))))","v":"ARTE EXTRACURRICULAR"},{"$f":"IF(IF('1. Autorización'!$I$6=\"Altiplano\",D10,IF('1. Autorización'!$I$6=\"Sur\",F10,IF('1. Autorización'!$I$6=\"Colegio Americano del Sur\",H10,B10)))=0,\"\",IF('1. Autorización'!$I$6=\"Altiplano\",D10,IF('1. Autorización'!$I$6=\"Sur\",F10,IF('1. Autorización'!$I$6=\"Colegio Americano del Sur\",H10,B10))))","v":1500203}]
["ASOCIACIONES,  CLUBES Y VOLUNTARIADO",1500205,"CAMPUS ALTIPLANO -ADMINISTRATIVO-",5000001,"CAMPUS SUR -ADMINISTRATIVO-",4000001,null,null,{"$f":"IF(IF('1. Autorización'!$I$6=\"Altiplano\",C11,IF('1. Autorización'!$I$6=\"Sur\",E11,IF('1. Autorización'!$I$6=\"Colegio Americano del Sur\",G11,A11)))=0,\"\",IF('1. Autorización'!$I$6=\"Altiplano\",C11,IF('1. Autorización'!$I$6=\"Sur\",E11,IF('1. Autorización'!$I$6=\"Colegio Americano del Sur\",G11,A11))))","v":"ASOCIACIONES,  CLUBES Y VOLUNTARIADO"},{"$f":"IF(IF('1. Autorización'!$I$6=\"Altiplano\",D11,IF('1. Autorización'!$I$6=\"Sur\",F11,IF('1. Autorización'!$I$6=\"Colegio Americano del Sur\",H11,B11)))=0,\"\",IF('1. Autorización'!$I$6=\"Altiplano\",D11,IF('1. Autorización'!$I$6=\"Sur\",F11,IF('1. Autorización'!$I$6=\"Colegio Americano del Sur\",H11,B11))))","v":1500205}]
["BACALAUREATUS IN SCIENTIIS",1390502,"CENTRO DE COMPUTO",5330100,"CONSTRUCCION Y MANTENIMIENTO",4340100,null,null,{"$f":"IF(IF('1. Autorización'!$I$6=\"Altiplano\",C12,IF('1. Autorización'!$I$6=\"Sur\",E12,IF('1. Autorización'!$I$6=\"Colegio Americano del Sur\",G12,A12)))=0,\"\",IF('1. Autorización'!$I$6=\"Altiplano\",C12,IF('1. Autorización'!$I$6=\"Sur\",E12,IF('1. Autorización'!$I$6=\"Colegio Americano del Sur\",G12,A12))))","v":"BACALAUREATUS IN SCIENTIIS"},{"$f":"IF(IF('1. Autorización'!$I$6=\"Altiplano\",D12,IF('1. Autorización'!$I$6=\"Sur\",F12,IF('1. Autorización'!$I$6=\"Colegio Americano del Sur\",H12,B12)))=0,\"\",IF('1. Autorización'!$I$6=\"Altiplano\",D12,IF('1. Autorización'!$I$6=\"Sur\",F12,IF('1. Autorización'!$I$6=\"Colegio Americano del Sur\",H12,B12))))","v":1390502}]
["BACCALAUREATUS IN ARTIBUS",1390501,"CENTRO DE CONSEJERIA",5330500,"COORDINACION CENTROS ESCOLARES",4360100,null,null,{"$f":"IF(IF('1. Autorización'!$I$6=\"Altiplano\",C13,IF('1. Autorización'!$I$6=\"Sur\",E13,IF('1. Autorización'!$I$6=\"Colegio Americano del Sur\",G13,A13)))=0,\"\",IF('1. Autorización'!$I$6=\"Altiplano\",C13,IF('1. Autorización'!$I$6=\"Sur\",E13,IF('1. Autorización'!$I$6=\"Colegio Americano del Sur\",G13,A13))))","v":"BACCALAUREATUS IN ARTIBUS"},{"$f":"IF(IF('1. Autorización'!$I$6=\"Altiplano\",D13,IF('1. Autorización'!$I$6=\"Sur\",F13,IF('1. Autorización'!$I$6=\"Colegio Americano del Sur\",H13,B13)))=0,\"\",IF('1. Autorización'!$I$6=\"Altiplano\",D13,IF('1. Autorización'!$I$6=\"Sur\",F13,IF('1. Autorización'!$I$6=\"Colegio Americano del Sur\",H13,B13))))","v":1390501}]
["BIOLOGIA (EDUCON)",8030500,"CENTRO DE CONVENCIONES",5330400,"COORDINACION DE ASUNTOS ESTUDIANTILES",4500000,null,null,{"$f":"IF(IF('1. Autorización'!$I$6=\"Altiplano\",C14,IF('1. Autorización'!$I$6=\"Sur\",E14,IF('1. Autorización'!$I$6=\"Colegio Americano del Sur\",G14,A14)))=0,\"\",IF('1. Autorización'!$I$6=\"Altiplano\",C14,IF('1. Autorización'!$I$6=\"Sur\",E14,IF('1. Autorización'!$I$6=\"Colegio Americano del Sur\",G14,A14))))","v":"BIOLOGIA (EDUCON)"},{"$f":"IF(IF('1. Autorización'!$I$6=\"Altiplano\",D14,IF('1. Autorización'!$I$6=\"Sur\",F14,IF('1. Autorización'!$I$6=\"Colegio Americano del Sur\",H14,B14)))=0,\"\",IF('1. Autorización'!$I$6=\"Altiplano\",D14,IF('1. Autorización'!$I$6=\"Sur\",F14,IF('1. Autorización'!$I$6=\"Colegio Americano del Sur\",H14,B14))))","v":8030500}]
["CAMPUS CENTRAL - ADMINISTRATIVO",1000001,"COMUNICACION SOCIAL",5410100,"COORDINACION DE INNOVACION Y EMPRENDIMIENTO",4390700,null,null,{"$f":"IF(IF('1. Autorización'!$I$6=\"Altiplano\",C15,IF('1. Autorización'!$I$6=\"Sur\",E15,IF('1. Autorización'!$I$6=\"Colegio Americano del Sur\",G15,A15)))=0,\"\",IF('1. Autorización'!$I$6=\"Altiplano\",C15,IF('1. Autorización'!$I$6=\"Sur\",E15,IF('1. Autorización'!$I$6=\"Colegio Americano del Sur\",G15,A15))))","v":"CAMPUS CENTRAL - ADMINISTRATIVO"},{"$f":"IF(IF('1. Autorización'!$I$6=\"Altiplano\",D15,IF('1. Autorización'!$I$6=\"Sur\",F15,IF('1. Autorización'!$I$6=\"Colegio Americano del Sur\",H15,B15)))=0,\"\",IF('1. Autorización'!$I$6=\"Altiplano\",D15,IF('1. Autorización'!$I$6=\"Sur\",F15,IF('1. Autorización'!$I$6=\"Colegio Americano del Sur\",H15,B15))))","v":1000001}]
["CAMPUS CENTRAL - OPERACION GENERAL",1000000,"CONSTRUCCION Y MANTENIMIENTO",5340100,"COORDINACION DE MAKER SPACE",4470001,null,null,{"$f":"IF(IF('1. Autorización'!$I$6=\"Altiplano\",C16,IF('1. Autorización'!$I$6=\"Sur\",E16,IF('1. Autorización'!$I$6=\"Colegio Americano del Sur\",G16,A16)))=0,\"\",IF('1. Autorización'!$I$6=\"Altiplano\",C16,IF('1. Autorización'!$I$6=\"Sur\",E16,IF('1. Autorización'!$I$6=\"Colegio Americano del Sur\",G16,A16))))","v":"CAMPUS CENTRAL - OPERACION GENERAL"},{"$f":"IF(IF('1. Autorización'!$I$6=\"Altiplano\",D16,IF('1. Autorización'!$I$6=\"Sur\",F16,IF('1. Autorización'!$I$6=\"Colegio Americano del Sur\",H16,B16)))=0,\"\",IF('1. Autorización'!$I$6=\"Altiplano\",D16,IF('1. Autorización'!$I$6=\"Sur\",F16,IF('1. Autorización'!$I$6=\"Colegio Americano del Sur\",H16,B16))))","v":1000000}]
["CATEDRA KIDDER",1430301,"COORDINACION DE INNOVACION Y EMPREDIMIENTO",5330700,"DECANATURA CAMPUS EXTERNOS",4310000,null,null,{"$f":"IF(IF('1. Autorización'!$I$6=\"Altiplano\",C17,IF('1. Autorización'!$I$6=\"Sur\",E17,IF('1. Autorización'!$I$6=\"Colegio Americano del Sur\",G17,A17)))=0,\"\",IF('1. Autorización'!$I$6=\"Altiplano\",C17,IF('1. Autorización'!$I$6=\"Sur\",E17,IF('1. Autorización'!$I$6=\"Colegio Americano del Sur\",G17,A17))))","v":"CATEDRA KIDDER"},{"$f":"IF(IF('1. Autorización'!$I$6=\"Altiplano\",D17,IF('1. Autorización'!$I$6=\"Sur\",F17,IF('1. Autorización'!$I$6=\"Colegio Americano del Sur\",H17,B17)))=0,\"\",IF('1. Autorización'!$I$6=\"Altiplano\",D17,IF('1. Autorización'!$I$6=\"Sur\",F17,IF('1. Autorización'!$I$6=\"Colegio Americano del Sur\",H17,B17))))","v":1430301}]
["CATEDRA PARDO",1410325,"COORDINACION DE MAKER SPACE",5500001,"DEPARTAMENTO DE COMUNICACIONES",4390300,null,null,{"$f":"IF(IF('1. Autorización'!$I$6=\"Altiplano\",C18,IF('1. Autorización'!$I$6=\"Sur\",E18,IF('1. Autorización'!$I$6=\"Colegio Americano del Sur\",G18,A18)))=0,\"\",IF('1. Autorización'!$I$6=\"Altiplano\",C18,IF('1. Autorización'!$I$6=\"Sur\",E18,IF('1. Autorización'!$I$6=\"Colegio Americano del Sur\",G18,A18))))","v":"CATEDRA PARDO"},{"$f":"IF(IF('1. Autorización'!$I$6=\"Altiplano\",D18,IF('1. Autorización'!$I$6=\"Sur\",F18,IF('1. Autorización'!$I$6=\"Colegio Americano del Sur\",H18,B18)))=0,\"\",IF('1. Autorización'!$I$6=\"Altiplano\",D18,IF('1. Autorización'!$I$6=\"Sur\",F18,IF('1. Autorización'!$I$6=\"Colegio Americano del Sur\",H18,B18))))","v":1410325}]
["CENTRO DE ATENCION INTEGRAL DE PSICOLOGIA APLICADA",1410425,"COORDINACION INGLES",5390100,"DEPARTAMENTO DE FINANZAS",4310300,null,null,{"$f":"IF(IF('1. Autorización'!$I$6=\"Altiplano\",C19,IF('1. Autorización'!$I$6=\"Sur\",E19,IF('1. Autorización'!$I$6=\"Colegio Americano del Sur\",G19,A19)))=0,\"\",IF('1. Autorización'!$I$6=\"Altiplano\",C19,IF('1. Autorización'!$I$6=\"Sur\",E19,IF('1. Autorización'!$I$6=\"Colegio Americano del Sur\",G19,A19))))","v":"CENTRO DE ATENCION INTEGRAL DE PSICOLOGIA APLICADA"},{"$f":"IF(IF('1. Autorización'!$I$6=\"Altiplano\",D19,IF('1. Autorización'!$I$6=\"Sur\",F19,IF('1. Autorización'!$I$6=\"Colegio Americano del Sur\",H19,B19)))=0,\"\",IF('1. Autorización'!$I$6=\"Altiplano\",D19,IF('1. Autorización'!$I$6=\"Sur\",F19,IF('1. Autorización'!$I$6=\"Colegio Americano del Sur\",H19,B19))))","v":1410425}]
["CENTRO DE BIODIVERSIDAD",1430801,"DECANATURA CAMPUS EXTERNOS",5310000,"DIRECCIÓN ÁREA ADMINISTRACION",4470700,null,null,{"$f":"IF(IF('1. Autorización'!$I$6=\"Altiplano\",C20,IF('1. Autorización'!$I$6=\"Sur\",E20,IF('1. Autorización'!$I$6=\"Colegio Americano del Sur\",G20,A20)))=0,\"\",IF('1. Autorización'!$I$6=\"Altiplano\",C20,IF('1. Autorización'!$I$6=\"Sur\",E20,IF('1. Autorización'!$I$6=\"Colegio Americano del Sur\",G20,A20))))","v":"CENTRO DE BIODIVERSIDAD"},{"$f":"IF(IF('1. Autorización'!$I$6=\"Altiplano\",D20,IF('1. Autorización'!$I$6=\"Sur\",F20,IF('1. Autorización'!$I$6=\"Colegio Americano del Sur\",H20,B20)))=0,\"\",IF('1. Autorización'!$I$6=\"Altiplano\",D20,IF('1. Autorización'!$I$6=\"Sur\",F20,IF('1. Autorización'!$I$6=\"Colegio Americano del Sur\",H20,B20))))","v":1430801}]
["CENTRO DE ESTUDIOS AGRÍCOLAS Y ALIMENTARIOS",1430400,"DEPARTAMENTO DE COMPRAS",5310201,"DIRECCION AREA AGRICOLA",4470400,null,null,{"$f":"IF(IF('1. Autorización'!$I$6=\"Altiplano\",C21,IF('1. Autorización'!$I$6=\"Sur\",E21,IF('1. Autorización'!$I$6=\"Colegio Americano del Sur\",G21,A21)))=0,\"\",IF('1. Autorización'!$I$6=\"Altiplano\",C21,IF('1. Autorización'!$I$6=\"Sur\",E21,IF('1. Autorización'!$I$6=\"Colegio Americano del Sur\",G21,A21))))","v":"CENTRO DE ESTUDIOS AGRÍCOLAS Y ALIMENTARIOS"},{"$f":"IF(IF('1. Autorización'!$I$6=\"Altiplano\",D21,IF('1. Autorización'!$I$6=\"Sur\",F21,IF('1. Autorización'!$I$6=\"Colegio Americano del Sur\",H21,B21)))=0,\"\",IF('1. Autorización'!$I$6=\"Altiplano\",D21,IF('1. Autorización'!$I$6=\"Sur\",F21,IF('1. Autorización'!$I$6=\"Colegio Americano del Sur\",H21,B21))))","v":1430400}]
["CENTRO DE ESTUDIOS ATITLAN UVG/CEA",1432200,"DEPARTAMENTO DE FINANZAS",5310300,"DIRECCION AREA INDUSTRIAL",4470500,null,null,{"$f":"IF(IF('1. Autorización'!$I$6=\"Altiplano\",C22,IF('1. Autorización'!$I$6=\"Sur\",E22,IF('1. Autorización'!$I$6=\"Colegio Americano del Sur\",G22,A22)))=0,\"\",IF('1. Autorización'!$I$6=\"Altiplano\",C22,IF('1. Autorización'!$I$6=\"Sur\",E22,IF('1. Autorización'!$I$6=\"Colegio Americano del Sur\",G22,A22))))","v":"CENTRO DE ESTUDIOS ATITLAN UVG/CEA"},{"$f":"IF(IF('1. Autorización'!$I$6=\"Altiplano\",D22,IF('1. Autorización'!$I$6=\"Sur\",F22,IF('1. Autorización'!$I$6=\"Colegio Americano del Sur\",H22,B22)))=0,\"\",IF('1. Autorización'!$I$6=\"Altiplano\",D22,IF('1. Autorización'!$I$6=\"Sur\",F22,IF('1. Autorización'!$I$6=\"Colegio Americano del Sur\",H22,B22))))","v":1432200}]
["CENTRO DE ESTUDIOS CIENCIA Y TECNOLOGIA  ALIMENTOS",1430407,"DIRECCION AREA AGRICOLA",5500100,"DIRECCIÓN ÁREA INFORMÁTICA",4470600,null,null,{"$f":"IF(IF('1. Autorización'!$I$6=\"Altiplano\",C23,IF('1. Autorización'!$I$6=\"Sur\",E23,IF('1. Autorización'!$I$6=\"Colegio Americano del Sur\",G23,A23)))=0,\"\",IF('1. Autorización'!$I$6=\"Altiplano\",C23,IF('1. Autorización'!$I$6=\"Sur\",E23,IF('1. Autorización'!$I$6=\"Colegio Americano del Sur\",G23,A23))))","v":"CENTRO DE ESTUDIOS CIENCIA Y TECNOLOGIA  ALIMENTOS"},{"$f":"IF(IF('1. Autorización'!$I$6=\"Altiplano\",D23,IF('1. Autorización'!$I$6=\"Sur\",F23,IF('1. Autorización'!$I$6=\"Colegio Americano del Sur\",H23,B23)))=0,\"\",IF('1. Autorización'!$I$6=\"Altiplano\",D23,IF('1. Autorización'!$I$6=\"Sur\",F23,IF('1. Autorización'!$I$6=\"Colegio Americano del Sur\",H23,B23))))","v":1430407}]
["CENTRO DE ESTUDIOS EN BIOTECNOLOGIA",1431900,"DIRECCION AREA DE ADMINISTRACION",5500300,"DIRECCION BACHILLERATOS",4510100,null,null,{"$f":"IF(IF('1. Autorización'!$I$6=\"Altiplano\",C24,IF('1. Autorización'!$I$6=\"Sur\",E24,IF('1. Autorización'!$I$6=\"Colegio Americano del Sur\",G24,A24)))=0,\"\",IF('1. Autorización'!$I$6=\"Altiplano\",C24,IF('1. Autorización'!$I$6=\"Sur\",E24,IF('1. Autorización'!$I$6=\"Colegio Americano del Sur\",G24,A24))))","v":"CENTRO DE ESTUDIOS EN BIOTECNOLOGIA"},{"$f":"IF(IF('1. Autorización'!$I$6=\"Altiplano\",D24,IF('1. Autorización'!$I$6=\"Sur\",F24,IF('1. Autorización'!$I$6=\"Colegio Americano del Sur\",H24,B24)))=0,\"\",IF('1. Autorización'!$I$6=\"Altiplano\",D24,IF('1. Autorización'!$I$6=\"Sur\",F24,IF('1. Autorización'!$I$6=\"Colegio Americano del Sur\",H24,B24))))","v":1431900}]
["CENTRO DE ESTUDIOS EN SALUD",1430500,"DIRECCION AREA DE INFORMATICA",5500400,"DIRECCION CIENTIFICA",4460500,null,null,{"$f":"IF(IF('1. Autorización'!$I$6=\"Altiplano\",C25,IF('1. Autorización'!$I$6=\"Sur\",E25,IF('1. Autorización'!$I$6=\"Colegio Americano del Sur\",G25,A25)))=0,\"\",IF('1. Autorización'!$I$6=\"Altiplano\",C25,IF('1. Autorización'!$I$6=\"Sur\",E25,IF('1. Autorización'!$I$6=\"Colegio Americano del Sur\",G25,A25))))","v":"CENTRO DE ESTUDIOS EN SALUD"},{"$f":"IF(IF('1. Autorización'!$I$6=\"Altiplano\",D25,IF('1. Autorización'!$I$6=\"Sur\",F25,IF('1. Autorización'!$I$6=\"Colegio Americano del Sur\",H25,B25)))=0,\"\",IF('1. Autorización'!$I$6=\"Altiplano\",D25,IF('1. Autorización'!$I$6=\"Sur\",F25,IF('1. Autorización'!$I$6=\"Colegio Americano del Sur\",H25,B25))))","v":1430500}]
["CENTRO DE ESTUDIOS EN SALUD (EDUCON)",8060100,"DIRECCION CENTRO DE IDIOMAS",5390000,"DIRECCION DE CALIDAD ACADEMICA",4390600,null,null,{"$f":"IF(IF('1. Autorización'!$I$6=\"Altiplano\",C26,IF('1. Autorización'!$I$6=\"Sur\",E26,IF('1. Autorización'!$I$6=\"Colegio Americano del Sur\",G26,A26)))=0,\"\",IF('1. Autorización'!$I$6=\"Altiplano\",C26,IF('1. Autorización'!$I$6=\"Sur\",E26,IF('1. Autorización'!$I$6=\"Colegio Americano del Sur\",G26,A26))))","v":"CENTRO DE ESTUDIOS EN SALUD (EDUCON)"},{"$f":"IF(IF('1. Autorización'!$I$6=\"Altiplano\",D26,IF('1. Autorización'!$I$6=\"Sur\",F26,IF('1. Autorización'!$I$6=\"Colegio Americano del Sur\",H26,B26)))=0,\"\",IF('1. Autorización'!$I$6=\"Altiplano\",D26,IF('1. Autorización'!$I$6=\"Sur\",F26,IF('1. Autorización'!$I$6=\"Colegio Americano del Sur\",H26,B26))))","v":8060100}]
["CENTRO DE INGENIERIA BIOQUIMICA",1432000,"DIRECCION CIENTIFICA",5360300,"DIRECCION DE EDUCACION",4460000,null,null,{"$f":"IF(IF('1. Autorización'!$I$6=\"Altiplano\",C27,IF('1. Autorización'!$I$6=\"Sur\",E27,IF('1. Autorización'!$I$6=\"Colegio Americano del Sur\",G27,A27)))=0,\"\",IF('1. Autorización'!$I$6=\"Altiplano\",C27,IF('1. Autorización'!$I$6=\"Sur\",E27,IF('1. Autorización'!$I$6=\"Colegio Americano del Sur\",G27,A27))))","v":"CENTRO DE INGENIERIA BIOQUIMICA"},{"$f":"IF(IF('1. Autorización'!$I$6=\"Altiplano\",D27,IF('1. Autorización'!$I$6=\"Sur\",F27,IF('1. Autorización'!$I$6=\"Colegio Americano del Sur\",H27,B27)))=0,\"\",IF('1. Autorización'!$I$6=\"Altiplano\",D27,IF('1. Autorización'!$I$6=\"Sur\",F27,IF('1. Autorización'!$I$6=\"Colegio Americano del Sur\",H27,B27))))","v":1432000}]
["CENTRO DE INVEST ARQUEOLOGIAS Y ANTROPOLOGICAS",1430300,"DIRECCION DE CALIDAD ACADEMICA",5330600,"DIRECCION DE EDUCACION ESPECIAL",4460300,null,null,{"$f":"IF(IF('1. Autorización'!$I$6=\"Altiplano\",C28,IF('1. Autorización'!$I$6=\"Sur\",E28,IF('1. Autorización'!$I$6=\"Colegio Americano del Sur\",G28,A28)))=0,\"\",IF('1. Autorización'!$I$6=\"Altiplano\",C28,IF('1. Autorización'!$I$6=\"Sur\",E28,IF('1. Autorización'!$I$6=\"Colegio Americano del Sur\",G28,A28))))","v":"CENTRO DE INVEST ARQUEOLOGIAS Y ANTROPOLOGICAS"},{"$f":"IF(IF('1. Autorización'!$I$6=\"Altiplano\",D28,IF('1. Autorización'!$I$6=\"Sur\",F28,IF('1. Autorización'!$I$6=\"Colegio Americano del Sur\",H28,B28)))=0,\"\",IF('1. Autorización'!$I$6=\"Altiplano\",D28,IF('1. Autorización'!$I$6=\"Sur\",F28,IF('1. Autorización'!$I$6=\"Colegio Americano del Sur\",H28,B28))))","v":1430300}]
["CENTRO DE PROCESOS INDUSTRIALES",1432100,"DIRECCION DE EDUCACION",5360000,"DIRECCION DE EDUCACION FISICA",4460600,null,null,{"$f":"IF(IF('1. Autorización'!$I$6=\"Altiplano\",C29,IF('1. Autorización'!$I$6=\"Sur\",E29,IF('1. Autorización'!$I$6=\"Colegio Americano del Sur\",G29,A29)))=0,\"\",IF('1. Autorización'!$I$6=\"Altiplano\",C29,IF('1. Autorización'!$I$6=\"Sur\",E29,IF('1. Autorización'!$I$6=\"Colegio Americano del Sur\",G29,A29))))","v":"CENTRO DE PROCESOS INDUSTRIALES"},{"$f":"IF(IF('1. Autorización'!$I$6=\"Altiplano\",D29,IF('1. Autorización'!$I$6=\"Sur\",F29,IF('1. Autorización'!$I$6=\"Colegio Americano del Sur\",H29,B29)))=0,\"\",IF('1. Autorización'!$I$6=\"Altiplano\",D29,IF('1. Autorización'!$I$6=\"Sur\",F29,IF('1. Autorización'!$I$6=\"Colegio Americano del Sur\",H29,B29))))","v":1432100}]
["CENTRO DE RECURSOS DE APRENDIZAJE E INVESTIGACION",1371901,"DIRECCION DE EDUCACION",5360900,"DIRECCION DE EDUCACION MEDIA ITEC",4510000,null,null,{"$f":"IF(IF('1. Autorización'!$I$6=\"Altiplano\",C30,IF('1. Autorización'!$I$6=\"Sur\",E30,IF('1. Autorización'!$I$6=\"Colegio Americano del Sur\",G30,A30)))=0,\"\",IF('1. Autorización'!$I$6=\"Altiplano\",C30,IF('1. Autorización'!$I$6=\"Sur\",E30,IF('1. Autorización'!$I$6=\"Colegio Americano del Sur\",G30,A30))))","v":"CENTRO DE RECURSOS DE APRENDIZAJE E INVESTIGACION"},{"$f":"IF(IF('1. Autorización'!$I$6=\"Altiplano\",D30,IF('1. Autorización'!$I$6=\"Sur\",F30,IF('1. Autorización'!$I$6=\"Colegio Americano del Sur\",H30,B30)))=0,\"\",IF('1. Autorización'!$I$6=\"Altiplano\",D30,IF('1. Autorización'!$I$6=\"Sur\",F30,IF('1. Autorización'!$I$6=\"Colegio Americano del Sur\",H30,B30))))","v":1371901}]
["CIENCIAS DE LA ADMINISTRACION. (EDUCON)",8010300,"DIRECCION DE EDUCACION ESPECIAL",5360400,"DIRECCION DE EDUCACION PRIMARIA",4460200,null,null,{"$f":"IF(IF('1. Autorización'!$I$6=\"Altiplano\",C31,IF('1. Autorización'!$I$6=\"Sur\",E31,IF('1. Autorización'!$I$6=\"Colegio Americano del Sur\",G31,A31)))=0,\"\",IF('1. Autorización'!$I$6=\"Altiplano\",C31,IF('1. Autorización'!$I$6=\"Sur\",E31,IF('1. Autorización'!$I$6=\"Colegio Americano del Sur\",G31,A31))))","v":"CIENCIAS DE LA ADMINISTRACION. (EDUCON)"},{"$f":"IF(IF('1. Autorización'!$I$6=\"Altiplano\",D31,IF('1. Autorización'!$I$6=\"Sur\",F31,IF('1. Autorización'!$I$6=\"Colegio Americano del Sur\",H31,B31)))=0,\"\",IF('1. Autorización'!$I$6=\"Altiplano\",D31,IF('1. Autorización'!$I$6=\"Sur\",F31,IF('1. Autorización'!$I$6=\"Colegio Americano del Sur\",H31,B31))))","v":8010300}]
["CIENTIFICO HUMANISTICO (EDUONCON)",8040300,"DIRECCION DE EDUCACION FISICA",5360600,"DIRECCION DE INGLES",4460400,null,null,{"$f":"IF(IF('1. Autorización'!$I$6=\"Altiplano\",C32,IF('1. Autorización'!$I$6=\"Sur\",E32,IF('1. Autorización'!$I$6=\"Colegio Americano del Sur\",G32,A32)))=0,\"\",IF('1. Autorización'!$I$6=\"Altiplano\",C32,IF('1. Autorización'!$I$6=\"Sur\",E32,IF('1. Autorización'!$I$6=\"Colegio Americano del Sur\",G32,A32))))","v":"CIENTIFICO HUMANISTICO (EDUONCON)"},{"$f":"IF(IF('1. Autorización'!$I$6=\"Altiplano\",D32,IF('1. Autorización'!$I$6=\"Sur\",F32,IF('1. Autorización'!$I$6=\"Colegio Americano del Sur\",H32,B32)))=0,\"\",IF('1. Autorización'!$I$6=\"Altiplano\",D32,IF('1. Autorización'!$I$6=\"Sur\",F32,IF('1. Autorización'!$I$6=\"Colegio Americano del Sur\",H32,B32))))","v":8040300}]
["CLINICA DE NUTRICION (CAEN)",1401640,"DIRECCION DE EDUCACION MEDIA ITEC",5480000,"DIRECCION DE LICENCIATURA EN EDUCACION",4460100,null,null,{"$f":"IF(IF('1. Autorización'!$I$6=\"Altiplano\",C33,IF('1. Autorización'!$I$6=\"Sur\",E33,IF('1. Autorización'!$I$6=\"Colegio Americano del Sur\",G33,A33)))=0,\"\",IF('1. Autorización'!$I$6=\"Altiplano\",C33,IF('1. Autorización'!$I$6=\"Sur\",E33,IF('1. Autorización'!$I$6=\"Colegio Americano del Sur\",G33,A33))))","v":"CLINICA DE NUTRICION (CAEN)"},{"$f":"IF(IF('1. Autorización'!$I$6=\"Altiplano\",D33,IF('1. Autorización'!$I$6=\"Sur\",F33,IF('1. Autorización'!$I$6=\"Colegio Americano del Sur\",H33,B33)))=0,\"\",IF('1. Autorización'!$I$6=\"Altiplano\",D33,IF('1. Autorización'!$I$6=\"Sur\",F33,IF('1. Autorización'!$I$6=\"Colegio Americano del Sur\",H33,B33))))","v":1401640}]
["COACHING NUTRICIONAL NIVEL 2",8103806,"DIRECCION DE EDUCACION PRIMARIA",5360200,"DIRECCION DE MAESTRIAS DE INGENIERIA CAMPUS SUR",4470900,null,null,{"$f":"IF(IF('1. Autorización'!$I$6=\"Altiplano\",C34,IF('1. Autorización'!$I$6=\"Sur\",E34,IF('1. Autorización'!$I$6=\"Colegio Americano del Sur\",G34,A34)))=0,\"\",IF('1. Autorización'!$I$6=\"Altiplano\",C34,IF('1. Autorización'!$I$6=\"Sur\",E34,IF('1. Autorización'!$I$6=\"Colegio Americano del Sur\",G34,A34))))","v":"COACHING NUTRICIONAL NIVEL 2"},{"$f":"IF(IF('1. Autorización'!$I$6=\"Altiplano\",D34,IF('1. Autorización'!$I$6=\"Sur\",F34,IF('1. Autorización'!$I$6=\"Colegio Americano del Sur\",H34,B34)))=0,\"\",IF('1. Autorización'!$I$6=\"Altiplano\",D34,IF('1. Autorización'!$I$6=\"Sur\",F34,IF('1. Autorización'!$I$6=\"Colegio Americano del Sur\",H34,B34))))","v":8103806}]
["COLECCIONES",1400142,"DIRECCION DE INGLES",5360500,"DIRECCION DE MUSICA",4460700,null,null,{"$f":"IF(IF('1. Autorización'!$I$6=\"Altiplano\",C35,IF('1. Autorización'!$I$6=\"Sur\",E35,IF('1. Autorización'!$I$6=\"Colegio Americano del Sur\",G35,A35)))=0,\"\",IF('1. Autorización'!$I$6=\"Altiplano\",C35,IF('1. Autorización'!$I$6=\"Sur\",E35,IF('1. Autorización'!$I$6=\"Colegio Americano del Sur\",G35,A35))))","v":"COLECCIONES"},{"$f":"IF(IF('1. Autorización'!$I$6=\"Altiplano\",D35,IF('1. Autorización'!$I$6=\"Sur\",F35,IF('1. Autorización'!$I$6=\"Colegio Americano del Sur\",H35,B35)))=0,\"\",IF('1. Autorización'!$I$6=\"Altiplano\",D35,IF('1. Autorización'!$I$6=\"Sur\",F35,IF('1. Autorización'!$I$6=\"Colegio Americano del Sur\",H35,B35))))","v":1400142}]
["COLEGIO UNIVERSITARIO (EDUCON)",8050000,"DIRECCION DE MUSICA",5360700,"DIRECCION DE PSICOPEDAGOGIA",4460800,null,null,{"$f":"IF(IF('1. Autorización'!$I$6=\"Altiplano\",C36,IF('1. Autorización'!$I$6=\"Sur\",E36,IF('1. Autorización'!$I$6=\"Colegio Americano del Sur\",G36,A36)))=0,\"\",IF('1. Autorización'!$I$6=\"Altiplano\",C36,IF('1. Autorización'!$I$6=\"Sur\",E36,IF('1. Autorización'!$I$6=\"Colegio Americano del Sur\",G36,A36))))","v":"COLEGIO UNIVERSITARIO (EDUCON)"},{"$f":"IF(IF('1. Autorización'!$I$6=\"Altiplano\",D36,IF('1. Autorización'!$I$6=\"Sur\",F36,IF('1. Autorización'!$I$6=\"Colegio Americano del Sur\",H36,B36)))=0,\"\",IF('1. Autorización'!$I$6=\"Altiplano\",D36,IF('1. Autorización'!$I$6=\"Sur\",F36,IF('1. Autorización'!$I$6=\"Colegio Americano del Sur\",H36,B36))))","v":8050000}]
["COLLEGE BOARD",1430202,"DIRECCION DE PSICOPEDAGOGIA",5360800,"DIRECCION EDUCACION CONTINUA",4370000,null,null,{"$f":"IF(IF('1. Autorización'!$I$6=\"Altiplano\",C37,IF('1. Autorización'!$I$6=\"Sur\",E37,IF('1. Autorización'!$I$6=\"Colegio Americano del Sur\",G37,A37)))=0,\"\",IF('1. Autorización'!$I$6=\"Altiplano\",C37,IF('1. Autorización'!$I$6=\"Sur\",E37,IF('1. Autorización'!$I$6=\"Colegio Americano del Sur\",G37,A37))))","v":"COLLEGE BOARD"},{"$f":"IF(IF('1. Autorización'!$I$6=\"Altiplano\",D37,IF('1. Autorización'!$I$6=\"Sur\",F37,IF('1. Autorización'!$I$6=\"Colegio Americano del Sur\",H37,B37)))=0,\"\",IF('1. Autorización'!$I$6=\"Altiplano\",D37,IF('1. Autorización'!$I$6=\"Sur\",F37,IF('1. Autorización'!$I$6=\"Colegio Americano del Sur\",H37,B37))))","v":1430202}]
["COMPORTAMIENTO HUMANO (EDUCON)",8010900,"DIRECCION EDUCON",5400000,"DIRECCION EJECUTIVA",4310101,null,null,{"$f":"IF(IF('1. Autorización'!$I$6=\"Altiplano\",C38,IF('1. Autorización'!$I$6=\"Sur\",E38,IF('1. Autorización'!$I$6=\"Colegio Americano del Sur\",G38,A38)))=0,\"\",IF('1. Autorización'!$I$6=\"Altiplano\",C38,IF('1. Autorización'!$I$6=\"Sur\",E38,IF('1. Autorización'!$I$6=\"Colegio Americano del Sur\",G38,A38))))","v":"COMPORTAMIENTO HUMANO (EDUCON)"},{"$f":"IF(IF('1. Autorización'!$I$6=\"Altiplano\",D38,IF('1. Autorización'!$I$6=\"Sur\",F38,IF('1. Autorización'!$I$6=\"Colegio Americano del Sur\",H38,B38)))=0,\"\",IF('1. Autorización'!$I$6=\"Altiplano\",D38,IF('1. Autorización'!$I$6=\"Sur\",F38,IF('1. Autorización'!$I$6=\"Colegio Americano del Sur\",H38,B38))))","v":8010900}]
["COMUNICACION Y LETRAS (EDUCON)",8030200,"DIRECCION EJECUTIVA",5310100,"DIRECCION FACULTAD DE INGENIERIA",4470000,null,null,{"$f":"IF(IF('1. Autorización'!$I$6=\"Altiplano\",C39,IF('1. Autorización'!$I$6=\"Sur\",E39,IF('1. Autorización'!$I$6=\"Colegio Americano del Sur\",G39,A39)))=0,\"\",IF('1. Autorización'!$I$6=\"Altiplano\",C39,IF('1. Autorización'!$I$6=\"Sur\",E39,IF('1. Autorización'!$I$6=\"Colegio Americano del Sur\",G39,A39))))","v":"COMUNICACION Y LETRAS (EDUCON)"},{"$f":"IF(IF('1. Autorización'!$I$6=\"Altiplano\",D39,IF('1. Autorización'!$I$6=\"Sur\",F39,IF('1. Autorización'!$I$6=\"Colegio Americano del Sur\",H39,B39)))=0,\"\",IF('1. Autorización'!$I$6=\"Altiplano\",D39,IF('1. Autorización'!$I$6=\"Sur\",F39,IF('1. Autorización'!$I$6=\"Colegio Americano del Sur\",H39,B39))))","v":8030200}]
["CONGRESO LATINOAMERICANO DE NEUROPSICOLOGIA",9100101,"DIRECCION FACULTAD DE CIENCIAS SOCIALES",5520000,"DIRECCION GENERAL DE ADMINISTRACION",4310200,null,null,{"$f":"IF(IF('1. Autorización'!$I$6=\"Altiplano\",C40,IF('1. Autorización'!$I$6=\"Sur\",E40,IF('1. Autorización'!$I$6=\"Colegio Americano del Sur\",G40,A40)))=0,\"\",IF('1. Autorización'!$I$6=\"Altiplano\",C40,IF('1. Autorización'!$I$6=\"Sur\",E40,IF('1. Autorización'!$I$6=\"Colegio Americano del Sur\",G40,A40))))","v":"CONGRESO LATINOAMERICANO DE NEUROPSICOLOGIA"},{"$f":"IF(IF('1. Autorización'!$I$6=\"Altiplano\",D40,IF('1. Autorización'!$I$6=\"Sur\",F40,IF('1. Autorización'!$I$6=\"Colegio Americano del Sur\",H40,B40)))=0,\"\",IF('1. Autorización'!$I$6=\"Altiplano\",D40,IF('1. Autorización'!$I$6=\"Sur\",F40,IF('1. Autorización'!$I$6=\"Colegio Americano del Sur\",H40,B40))))","v":9100101}]
["CONSEJO DIRECTIVO",1530001,"DIRECCION FACULTAD DE CIENCIAS Y HUMANIDADES",5490000,"LIC  EN INGENIERIA EN TECNOLOGIA INDUSTRIAL",4470501,null,null,{"$f":"IF(IF('1. Autorización'!$I$6=\"Altiplano\",C41,IF('1. Autorización'!$I$6=\"Sur\",E41,IF('1. Autorización'!$I$6=\"Colegio Americano del Sur\",G41,A41)))=0,\"\",IF('1. Autorización'!$I$6=\"Altiplano\",C41,IF('1. Autorización'!$I$6=\"Sur\",E41,IF('1. Autorización'!$I$6=\"Colegio Americano del Sur\",G41,A41))))","v":"CONSEJO DIRECTIVO"},{"$f":"IF(IF('1. Autorización'!$I$6=\"Altiplano\",D41,IF('1. Autorización'!$I$6=\"Sur\",F41,IF('1. Autorización'!$I$6=\"Colegio Americano del Sur\",H41,B41)))=0,\"\",IF('1. Autorización'!$I$6=\"Altiplano\",D41,IF('1. Autorización'!$I$6=\"Sur\",F41,IF('1. Autorización'!$I$6=\"Colegio Americano del Sur\",H41,B41))))","v":1530001}]
["CONSULTORIAS Y SERVICIOS",9000000,"DIRECCION FACULTAD DE INGENIERIA",5500000,"LIC EN INGENIERIA EN TECNOL.  AGRICOLA Y PECUARIA",4470401,null,null,{"$f":"IF(IF('1. Autorización'!$I$6=\"Altiplano\",C42,IF('1. Autorización'!$I$6=\"Sur\",E42,IF('1. Autorización'!$I$6=\"Colegio Americano del Sur\",G42,A42)))=0,\"\",IF('1. Autorización'!$I$6=\"Altiplano\",C42,IF('1. Autorización'!$I$6=\"Sur\",E42,IF('1. Autorización'!$I$6=\"Colegio Americano del Sur\",G42,A42))))","v":"CONSULTORIAS Y SERVICIOS"},{"$f":"IF(IF('1. Autorización'!$I$6=\"Altiplano\",D42,IF('1. Autorización'!$I$6=\"Sur\",F42,IF('1. Autorización'!$I$6=\"Colegio Americano del Sur\",H42,B42)))=0,\"\",IF('1. Autorización'!$I$6=\"Altiplano\",D42,IF('1. Autorización'!$I$6=\"Sur\",F42,IF('1. Autorización'!$I$6=\"Colegio Americano del Sur\",H42,B42))))","v":9000000}]
["COORDINACION COACHING",1500201,"DIRECCION GENERAL DE ADMINISTRACION",5310200,"LIC. EN EDUCACION FISICA, DEPORTE Y RECREACION",4460602,null,null,{"$f":"IF(IF('1. Autorización'!$I$6=\"Altiplano\",C43,IF('1. Autorización'!$I$6=\"Sur\",E43,IF('1. Autorización'!$I$6=\"Colegio Americano del Sur\",G43,A43)))=0,\"\",IF('1. Autorización'!$I$6=\"Altiplano\",C43,IF('1. Autorización'!$I$6=\"Sur\",E43,IF('1. Autorización'!$I$6=\"Colegio Americano del Sur\",G43,A43))))","v":"COORDINACION COACHING"},{"$f":"IF(IF('1. Autorización'!$I$6=\"Altiplano\",D43,IF('1. Autorización'!$I$6=\"Sur\",F43,IF('1. Autorización'!$I$6=\"Colegio Americano del Sur\",H43,B43)))=0,\"\",IF('1. Autorización'!$I$6=\"Altiplano\",D43,IF('1. Autorización'!$I$6=\"Sur\",F43,IF('1. Autorización'!$I$6=\"Colegio Americano del Sur\",H43,B43))))","v":1500201}]
["CURSOS LIBRES (COLEGIO UNIVERSITARIO)",1390503,"DIRECCION HUMANISTICA",5361000,"LICENCIATURA EN ADMINISTRACION DE EMPRESAS",4470701,null,null,{"$f":"IF(IF('1. Autorización'!$I$6=\"Altiplano\",C44,IF('1. Autorización'!$I$6=\"Sur\",E44,IF('1. Autorización'!$I$6=\"Colegio Americano del Sur\",G44,A44)))=0,\"\",IF('1. Autorización'!$I$6=\"Altiplano\",C44,IF('1. Autorización'!$I$6=\"Sur\",E44,IF('1. Autorización'!$I$6=\"Colegio Americano del Sur\",G44,A44))))","v":"CURSOS LIBRES (COLEGIO UNIVERSITARIO)"},{"$f":"IF(IF('1. Autorización'!$I$6=\"Altiplano\",D44,IF('1. Autorización'!$I$6=\"Sur\",F44,IF('1. Autorización'!$I$6=\"Colegio Americano del Sur\",H44,B44)))=0,\"\",IF('1. Autorización'!$I$6=\"Altiplano\",D44,IF('1. Autorización'!$I$6=\"Sur\",F44,IF('1. Autorización'!$I$6=\"Colegio Americano del Sur\",H44,B44))))","v":1390503}]
["CURSOS LIBRES (FACULTAD DE EDUCACION)",1421311,"DIRECCION MAESTRIA EN CONSEJERIA COMUNITARIA",5520100,"LICENCIATURA EN EDUCACION",4460101,null,null,{"$f":"IF(IF('1. Autorización'!$I$6=\"Altiplano\",C45,IF('1. Autorización'!$I$6=\"Sur\",E45,IF('1. Autorización'!$I$6=\"Colegio Americano del Sur\",G45,A45)))=0,\"\",IF('1. Autorización'!$I$6=\"Altiplano\",C45,IF('1. Autorización'!$I$6=\"Sur\",E45,IF('1. Autorización'!$I$6=\"Colegio Americano del Sur\",G45,A45))))","v":"CURSOS LIBRES (FACULTAD DE EDUCACION)"},{"$f":"IF(IF('1. Autorización'!$I$6=\"Altiplano\",D45,IF('1. Autorización'!$I$6=\"Sur\",F45,IF('1. Autorización'!$I$6=\"Colegio Americano del Sur\",H45,B45)))=0,\"\",IF('1. Autorización'!$I$6=\"Altiplano\",D45,IF('1. Autorización'!$I$6=\"Sur\",F45,IF('1. Autorización'!$I$6=\"Colegio Americano del Sur\",H45,B45))))","v":1421311}]
["DECANATURA COLEGIO UNIVERSITARIO",1390000,"EDUCON",5400400,"LICENCIATURA EN PSICOPEDAGOGIA",4460801,null,null,{"$f":"IF(IF('1. Autorización'!$I$6=\"Altiplano\",C46,IF('1. Autorización'!$I$6=\"Sur\",E46,IF('1. Autorización'!$I$6=\"Colegio Americano del Sur\",G46,A46)))=0,\"\",IF('1. Autorización'!$I$6=\"Altiplano\",C46,IF('1. Autorización'!$I$6=\"Sur\",E46,IF('1. Autorización'!$I$6=\"Colegio Americano del Sur\",G46,A46))))","v":"DECANATURA COLEGIO UNIVERSITARIO"},{"$f":"IF(IF('1. Autorización'!$I$6=\"Altiplano\",D46,IF('1. Autorización'!$I$6=\"Sur\",F46,IF('1. Autorización'!$I$6=\"Colegio Americano del Sur\",H46,B46)))=0,\"\",IF('1. Autorización'!$I$6=\"Altiplano\",D46,IF('1. Autorización'!$I$6=\"Sur\",F46,IF('1. Autorización'!$I$6=\"Colegio Americano del Sur\",H46,B46))))","v":1390000}]
["DECANATURA DE ADMISIONES Y VINCULACION",1570000,"FINCA AGRICOLA",5500104,"LICENCIATURA EN TECNOLOGIA DE SIST. INFORMATICOS",4470602,null,null,{"$f":"IF(IF('1. Autorización'!$I$6=\"Altiplano\",C47,IF('1. Autorización'!$I$6=\"Sur\",E47,IF('1. Autorización'!$I$6=\"Colegio Americano del Sur\",G47,A47)))=0,\"\",IF('1. Autorización'!$I$6=\"Altiplano\",C47,IF('1. Autorización'!$I$6=\"Sur\",E47,IF('1. Autorización'!$I$6=\"Colegio Americano del Sur\",G47,A47))))","v":"DECANATURA DE ADMISIONES Y VINCULACION"},{"$f":"IF(IF('1. Autorización'!$I$6=\"Altiplano\",D47,IF('1. Autorización'!$I$6=\"Sur\",F47,IF('1. Autorización'!$I$6=\"Colegio Americano del Sur\",H47,B47)))=0,\"\",IF('1. Autorización'!$I$6=\"Altiplano\",D47,IF('1. Autorización'!$I$6=\"Sur\",F47,IF('1. Autorización'!$I$6=\"Colegio Americano del Sur\",H47,B47))))","v":1570000}]
["DECANATURA DE ASUNTOS ESTUDIANTILES",1500000,"LIC. EDUCACION FISICA, DEPORTE Y RECREACION",5360602,"MAESTRIA EN GESTION DEL MANTENIMIENTO INDUSTRIAL.",4470902,null,null,{"$f":"IF(IF('1. Autorización'!$I$6=\"Altiplano\",C48,IF('1. Autorización'!$I$6=\"Sur\",E48,IF('1. Autorización'!$I$6=\"Colegio Americano del Sur\",G48,A48)))=0,\"\",IF('1. Autorización'!$I$6=\"Altiplano\",C48,IF('1. Autorización'!$I$6=\"Sur\",E48,IF('1. Autorización'!$I$6=\"Colegio Americano del Sur\",G48,A48))))","v":"DECANATURA DE ASUNTOS ESTUDIANTILES"},{"$f":"IF(IF('1. Autorización'!$I$6=\"Altiplano\",D48,IF('1. Autorización'!$I$6=\"Sur\",F48,IF('1. Autorización'!$I$6=\"Colegio Americano del Sur\",H48,B48)))=0,\"\",IF('1. Autorización'!$I$6=\"Altiplano\",D48,IF('1. Autorización'!$I$6=\"Sur\",F48,IF('1. Autorización'!$I$6=\"Colegio Americano del Sur\",H48,B48))))","v":1500000}]
["DECANATURA FACULTAD DE CIENCIAS SOCIALES",1410000,"LICENCIATURA  EN ADMON  DE EMPRESAS TURISTICAS",5490201,"MAESTRIA EN LIDERAZGO Y GESTION EMPRESARIAL.",4470903,null,null,{"$f":"IF(IF('1. Autorización'!$I$6=\"Altiplano\",C49,IF('1. Autorización'!$I$6=\"Sur\",E49,IF('1. Autorización'!$I$6=\"Colegio Americano del Sur\",G49,A49)))=0,\"\",IF('1. Autorización'!$I$6=\"Altiplano\",C49,IF('1. Autorización'!$I$6=\"Sur\",E49,IF('1. Autorización'!$I$6=\"Colegio Americano del Sur\",G49,A49))))","v":"DECANATURA FACULTAD DE CIENCIAS SOCIALES"},{"$f":"IF(IF('1. Autorización'!$I$6=\"Altiplano\",D49,IF('1. Autorización'!$I$6=\"Sur\",F49,IF('1. Autorización'!$I$6=\"Colegio Americano del Sur\",H49,B49)))=0,\"\",IF('1. Autorización'!$I$6=\"Altiplano\",D49,IF('1. Autorización'!$I$6=\"Sur\",F49,IF('1. Autorización'!$I$6=\"Colegio Americano del Sur\",H49,B49))))","v":1410000}]
["DECANATURA FACULTAD DE CIENCIAS Y HUMANIDADES",1400000,"LICENCIATURA EN ADMINISTRACION DE EMPRESAS",5500301,"MAESTRIA EN PRODUCCION Y GESTION AVICOLA Y PECUARI",4470901,null,null,{"$f":"IF(IF('1. Autorización'!$I$6=\"Altiplano\",C50,IF('1. Autorización'!$I$6=\"Sur\",E50,IF('1. Autorización'!$I$6=\"Colegio Americano del Sur\",G50,A50)))=0,\"\",IF('1. Autorización'!$I$6=\"Altiplano\",C50,IF('1. Autorización'!$I$6=\"Sur\",E50,IF('1. Autorización'!$I$6=\"Colegio Americano del Sur\",G50,A50))))","v":"DECANATURA FACULTAD DE CIENCIAS Y HUMANIDADES"},{"$f":"IF(IF('1. Autorización'!$I$6=\"Altiplano\",D50,IF('1. Autorización'!$I$6=\"Sur\",F50,IF('1. Autorización'!$I$6=\"Colegio Americano del Sur\",H50,B50)))=0,\"\",IF('1. Autorización'!$I$6=\"Altiplano\",D50,IF('1. Autorización'!$I$6=\"Sur\",F50,IF('1. Autorización'!$I$6=\"Colegio Americano del Sur\",H50,B50))))","v":1400000}]
["DECANATURA FACULTAD DE EDUCACION",1420000,"LICENCIATURA EN EDUCACION",5360100,"OFICINA DE REGISTRO Y CONTROL ACADEMICO",4480100,null,null,{"$f":"IF(IF('1. Autorización'!$I$6=\"Altiplano\",C51,IF('1. Autorización'!$I$6=\"Sur\",E51,IF('1. Autorización'!$I$6=\"Colegio Americano del Sur\",G51,A51)))=0,\"\",IF('1. Autorización'!$I$6=\"Altiplano\",C51,IF('1. Autorización'!$I$6=\"Sur\",E51,IF('1. Autorización'!$I$6=\"Colegio Americano del Sur\",G51,A51))))","v":"DECANATURA FACULTAD DE EDUCACION"},{"$f":"IF(IF('1. Autorización'!$I$6=\"Altiplano\",D51,IF('1. Autorización'!$I$6=\"Sur\",F51,IF('1. Autorización'!$I$6=\"Colegio Americano del Sur\",H51,B51)))=0,\"\",IF('1. Autorización'!$I$6=\"Altiplano\",D51,IF('1. Autorización'!$I$6=\"Sur\",F51,IF('1. Autorización'!$I$6=\"Colegio Americano del Sur\",H51,B51))))","v":1420000}]
["DECANATURA FACULTAD DE INGENIERIA",1470000,"LICENCIATURA EN EDUCACION",5360901,"PROCAPS",4490000,null,null,{"$f":"IF(IF('1. Autorización'!$I$6=\"Altiplano\",C52,IF('1. Autorización'!$I$6=\"Sur\",E52,IF('1. Autorización'!$I$6=\"Colegio Americano del Sur\",G52,A52)))=0,\"\",IF('1. Autorización'!$I$6=\"Altiplano\",C52,IF('1. Autorización'!$I$6=\"Sur\",E52,IF('1. Autorización'!$I$6=\"Colegio Americano del Sur\",G52,A52))))","v":"DECANATURA FACULTAD DE INGENIERIA"},{"$f":"IF(IF('1. Autorización'!$I$6=\"Altiplano\",D52,IF('1. Autorización'!$I$6=\"Sur\",F52,IF('1. Autorización'!$I$6=\"Colegio Americano del Sur\",H52,B52)))=0,\"\",IF('1. Autorización'!$I$6=\"Altiplano\",D52,IF('1. Autorización'!$I$6=\"Sur\",F52,IF('1. Autorización'!$I$6=\"Colegio Americano del Sur\",H52,B52))))","v":1470000}]
["DECANATURA INSTITUTO DE INVESTIGACIONES",1430000,"LICENCIATURA EN INFORMATICA",5500402,"PROF ESPECIALIZADO EN EDUC FISICA,DEPORTE Y RECREA",4460601,null,null,{"$f":"IF(IF('1. Autorización'!$I$6=\"Altiplano\",C53,IF('1. Autorización'!$I$6=\"Sur\",E53,IF('1. Autorización'!$I$6=\"Colegio Americano del Sur\",G53,A53)))=0,\"\",IF('1. Autorización'!$I$6=\"Altiplano\",C53,IF('1. Autorización'!$I$6=\"Sur\",E53,IF('1. Autorización'!$I$6=\"Colegio Americano del Sur\",G53,A53))))","v":"DECANATURA INSTITUTO DE INVESTIGACIONES"},{"$f":"IF(IF('1. Autorización'!$I$6=\"Altiplano\",D53,IF('1. Autorización'!$I$6=\"Sur\",F53,IF('1. Autorización'!$I$6=\"Colegio Americano del Sur\",H53,B53)))=0,\"\",IF('1. Autorización'!$I$6=\"Altiplano\",D53,IF('1. Autorización'!$I$6=\"Sur\",F53,IF('1. Autorización'!$I$6=\"Colegio Americano del Sur\",H53,B53))))","v":1430000}]
["DEPARTAMENTO DE ACTIVOS FIJOS",1340500,"LICENCIATURA EN PSICOPEDAGOGIA",5360801,"PROFESORADO DE INGLES",4460401,null,null,{"$f":"IF(IF('1. Autorización'!$I$6=\"Altiplano\",C54,IF('1. Autorización'!$I$6=\"Sur\",E54,IF('1. Autorización'!$I$6=\"Colegio Americano del Sur\",G54,A54)))=0,\"\",IF('1. Autorización'!$I$6=\"Altiplano\",C54,IF('1. Autorización'!$I$6=\"Sur\",E54,IF('1. Autorización'!$I$6=\"Colegio Americano del Sur\",G54,A54))))","v":"DEPARTAMENTO DE ACTIVOS FIJOS"},{"$f":"IF(IF('1. Autorización'!$I$6=\"Altiplano\",D54,IF('1. Autorización'!$I$6=\"Sur\",F54,IF('1. Autorización'!$I$6=\"Colegio Americano del Sur\",H54,B54)))=0,\"\",IF('1. Autorización'!$I$6=\"Altiplano\",D54,IF('1. Autorización'!$I$6=\"Sur\",F54,IF('1. Autorización'!$I$6=\"Colegio Americano del Sur\",H54,B54))))","v":1340500}]
["DEPARTAMENTO DE COMPRAS",1330200,"LICENCIATURA EN TECNOLOGIA DE SIST. INFORMATICOS",5500403,"PROFESORADO ESPECIALIZADO EN EDUC MUSICAL",4460701,null,null,{"$f":"IF(IF('1. Autorización'!$I$6=\"Altiplano\",C55,IF('1. Autorización'!$I$6=\"Sur\",E55,IF('1. Autorización'!$I$6=\"Colegio Americano del Sur\",G55,A55)))=0,\"\",IF('1. Autorización'!$I$6=\"Altiplano\",C55,IF('1. Autorización'!$I$6=\"Sur\",E55,IF('1. Autorización'!$I$6=\"Colegio Americano del Sur\",G55,A55))))","v":"DEPARTAMENTO DE COMPRAS"},{"$f":"IF(IF('1. Autorización'!$I$6=\"Altiplano\",D55,IF('1. Autorización'!$I$6=\"Sur\",F55,IF('1. Autorización'!$I$6=\"Colegio Americano del Sur\",H55,B55)))=0,\"\",IF('1. Autorización'!$I$6=\"Altiplano\",D55,IF('1. Autorización'!$I$6=\"Sur\",F55,IF('1. Autorización'!$I$6=\"Colegio Americano del Sur\",H55,B55))))","v":1330200}]
["DEPARTAMENTO DE CONSTRUCCION Y MANTENIMIENTO",1360000,"LICENCIATURA INGENIERIA EN TECNOLOGIA AGROFORESTAL",5500103,"PROFESORADO ESPECIALIZADO EN EDUCACION PRIMARIA",4460202,null,null,{"$f":"IF(IF('1. Autorización'!$I$6=\"Altiplano\",C56,IF('1. Autorización'!$I$6=\"Sur\",E56,IF('1. Autorización'!$I$6=\"Colegio Americano del Sur\",G56,A56)))=0,\"\",IF('1. Autorización'!$I$6=\"Altiplano\",C56,IF('1. Autorización'!$I$6=\"Sur\",E56,IF('1. Autorización'!$I$6=\"Colegio Americano del Sur\",G56,A56))))","v":"DEPARTAMENTO DE CONSTRUCCION Y MANTENIMIENTO"},{"$f":"IF(IF('1. Autorización'!$I$6=\"Altiplano\",D56,IF('1. Autorización'!$I$6=\"Sur\",F56,IF('1. Autorización'!$I$6=\"Colegio Americano del Sur\",H56,B56)))=0,\"\",IF('1. Autorización'!$I$6=\"Altiplano\",D56,IF('1. Autorización'!$I$6=\"Sur\",F56,IF('1. Autorización'!$I$6=\"Colegio Americano del Sur\",H56,B56))))","v":1360000}]
["DEPARTAMENTO DE CONTABILIDAD",1340100,"MAESTRIA EN CONSEJERIA COMUNITARIA",5520101,"PROFESORADO ESPECIALIZADO EN ENS M. EN MAT Y COMP",4460501,null,null,{"$f":"IF(IF('1. Autorización'!$I$6=\"Altiplano\",C57,IF('1. Autorización'!$I$6=\"Sur\",E57,IF('1. Autorización'!$I$6=\"Colegio Americano del Sur\",G57,A57)))=0,\"\",IF('1. Autorización'!$I$6=\"Altiplano\",C57,IF('1. Autorización'!$I$6=\"Sur\",E57,IF('1. Autorización'!$I$6=\"Colegio Americano del Sur\",G57,A57))))","v":"DEPARTAMENTO DE CONTABILIDAD"},{"$f":"IF(IF('1. Autorización'!$I$6=\"Altiplano\",D57,IF('1. Autorización'!$I$6=\"Sur\",F57,IF('1. Autorización'!$I$6=\"Colegio Americano del Sur\",H57,B57)))=0,\"\",IF('1. Autorización'!$I$6=\"Altiplano\",D57,IF('1. Autorización'!$I$6=\"Sur\",F57,IF('1. Autorización'!$I$6=\"Colegio Americano del Sur\",H57,B57))))","v":1340100}]
["DEPARTAMENTO DE CUENTAS POR COBRAR",1340600,"OFICINA DE REGISTRO",5510100,"PROFESORADO ESPECIALIZADO EN PROBLEMAS DE APRENDIZ",4460301,null,null,{"$f":"IF(IF('1. Autorización'!$I$6=\"Altiplano\",C58,IF('1. Autorización'!$I$6=\"Sur\",E58,IF('1. Autorización'!$I$6=\"Colegio Americano del Sur\",G58,A58)))=0,\"\",IF('1. Autorización'!$I$6=\"Altiplano\",C58,IF('1. Autorización'!$I$6=\"Sur\",E58,IF('1. Autorización'!$I$6=\"Colegio Americano del Sur\",G58,A58))))","v":"DEPARTAMENTO DE CUENTAS POR COBRAR"},{"$f":"IF(IF('1. Autorización'!$I$6=\"Altiplano\",D58,IF('1. Autorización'!$I$6=\"Sur\",F58,IF('1. Autorización'!$I$6=\"Colegio Americano del Sur\",H58,B58)))=0,\"\",IF('1. Autorización'!$I$6=\"Altiplano\",D58,IF('1. Autorización'!$I$6=\"Sur\",F58,IF('1. Autorización'!$I$6=\"Colegio Americano del Sur\",H58,B58))))","v":1340600}]
["DEPARTAMENTO DE CUENTAS POR PAGAR",1340200,"PROF ESPEC EN EDUC PRIMARIA BILINGUE INTERCULTURAL",5360201,"PROYECTO IMSA",4520000,null,null,{"$f":"IF(IF('1. Autorización'!$I$6=\"Altiplano\",C59,IF('1. Autorización'!$I$6=\"Sur\",E59,IF('1. Autorización'!$I$6=\"Colegio Americano del Sur\",G59,A59)))=0,\"\",IF('1. Autorización'!$I$6=\"Altiplano\",C59,IF('1. Autorización'!$I$6=\"Sur\",E59,IF('1. Autorización'!$I$6=\"Colegio Americano del Sur\",G59,A59))))","v":"DEPARTAMENTO DE CUENTAS POR PAGAR"},{"$f":"IF(IF('1. Autorización'!$I$6=\"Altiplano\",D59,IF('1. Autorización'!$I$6=\"Sur\",F59,IF('1. Autorización'!$I$6=\"Colegio Americano del Sur\",H59,B59)))=0,\"\",IF('1. Autorización'!$I$6=\"Altiplano\",D59,IF('1. Autorización'!$I$6=\"Sur\",F59,IF('1. Autorización'!$I$6=\"Colegio Americano del Sur\",H59,B59))))","v":1340200}]
["DEPARTAMENTO DE DESARROLLO ORGANIZACIONAL",1480300,"PROF ESPECIALIZADO EDUCACION PRIMARIA MONOLINGUE",5360204,"TECNICO EN ADMINISTRACION DE EMPRESAS",4470702,null,null,{"$f":"IF(IF('1. Autorización'!$I$6=\"Altiplano\",C60,IF('1. Autorización'!$I$6=\"Sur\",E60,IF('1. Autorización'!$I$6=\"Colegio Americano del Sur\",G60,A60)))=0,\"\",IF('1. Autorización'!$I$6=\"Altiplano\",C60,IF('1. Autorización'!$I$6=\"Sur\",E60,IF('1. Autorización'!$I$6=\"Colegio Americano del Sur\",G60,A60))))","v":"DEPARTAMENTO DE DESARROLLO ORGANIZACIONAL"},{"$f":"IF(IF('1. Autorización'!$I$6=\"Altiplano\",D60,IF('1. Autorización'!$I$6=\"Sur\",F60,IF('1. Autorización'!$I$6=\"Colegio Americano del Sur\",H60,B60)))=0,\"\",IF('1. Autorización'!$I$6=\"Altiplano\",D60,IF('1. Autorización'!$I$6=\"Sur\",F60,IF('1. Autorización'!$I$6=\"Colegio Americano del Sur\",H60,B60))))","v":1480300}]
["DEPARTAMENTO DE DESARROLLO Y MANT DE SISTEMAS",1520002,"PROF. ESPEC. EN EDUCACIÓN FISICA, DEPORTE Y RECRE",5360601,"TECNICO UNIVERSITARIO EN INFORMATICA",4470601,null,null,{"$f":"IF(IF('1. Autorización'!$I$6=\"Altiplano\",C61,IF('1. Autorización'!$I$6=\"Sur\",E61,IF('1. Autorización'!$I$6=\"Colegio Americano del Sur\",G61,A61)))=0,\"\",IF('1. Autorización'!$I$6=\"Altiplano\",C61,IF('1. Autorización'!$I$6=\"Sur\",E61,IF('1. Autorización'!$I$6=\"Colegio Americano del Sur\",G61,A61))))","v":"DEPARTAMENTO DE DESARROLLO Y MANT DE SISTEMAS"},{"$f":"IF(IF('1. Autorización'!$I$6=\"Altiplano\",D61,IF('1. Autorización'!$I$6=\"Sur\",F61,IF('1. Autorización'!$I$6=\"Colegio Americano del Sur\",H61,B61)))=0,\"\",IF('1. Autorización'!$I$6=\"Altiplano\",D61,IF('1. Autorización'!$I$6=\"Sur\",F61,IF('1. Autorización'!$I$6=\"Colegio Americano del Sur\",H61,B61))))","v":1520002}]
["DEPARTAMENTO DE FORMACION PERMANENTE",1480200,"PROFES. DE ENSEÑANZA MEDIA EN LIDER Y GEST. EDUCAT",5361001,"TECNICO UNIVERSITARIO EN MECATRONICA",4470504,null,null,{"$f":"IF(IF('1. Autorización'!$I$6=\"Altiplano\",C62,IF('1. Autorización'!$I$6=\"Sur\",E62,IF('1. Autorización'!$I$6=\"Colegio Americano del Sur\",G62,A62)))=0,\"\",IF('1. Autorización'!$I$6=\"Altiplano\",C62,IF('1. Autorización'!$I$6=\"Sur\",E62,IF('1. Autorización'!$I$6=\"Colegio Americano del Sur\",G62,A62))))","v":"DEPARTAMENTO DE FORMACION PERMANENTE"},{"$f":"IF(IF('1. Autorización'!$I$6=\"Altiplano\",D62,IF('1. Autorización'!$I$6=\"Sur\",F62,IF('1. Autorización'!$I$6=\"Colegio Americano del Sur\",H62,B62)))=0,\"\",IF('1. Autorización'!$I$6=\"Altiplano\",D62,IF('1. Autorización'!$I$6=\"Sur\",F62,IF('1. Autorización'!$I$6=\"Colegio Americano del Sur\",H62,B62))))","v":1480200}]
["DEPARTAMENTO DE OPERACIONES IT",1520001,"PROFESORADO DE ENSEÑANZA MEDIA EN CC NATURALES",5360303,"TECNICO UNIVERSITARIO EN PRODUCTOS AGRICOLAS",4470402,null,null,{"$f":"IF(IF('1. Autorización'!$I$6=\"Altiplano\",C63,IF('1. Autorización'!$I$6=\"Sur\",E63,IF('1. Autorización'!$I$6=\"Colegio Americano del Sur\",G63,A63)))=0,\"\",IF('1. Autorización'!$I$6=\"Altiplano\",C63,IF('1. Autorización'!$I$6=\"Sur\",E63,IF('1. Autorización'!$I$6=\"Colegio Americano del Sur\",G63,A63))))","v":"DEPARTAMENTO DE OPERACIONES IT"},{"$f":"IF(IF('1. Autorización'!$I$6=\"Altiplano\",D63,IF('1. Autorización'!$I$6=\"Sur\",F63,IF('1. Autorización'!$I$6=\"Colegio Americano del Sur\",H63,B63)))=0,\"\",IF('1. Autorización'!$I$6=\"Altiplano\",D63,IF('1. Autorización'!$I$6=\"Sur\",F63,IF('1. Autorización'!$I$6=\"Colegio Americano del Sur\",H63,B63))))","v":1520001}]
["DEPARTAMENTO DE PRESUPUESTO",1340300,"PROFESORADO DE ENSEÑANZA MEDIA EN COMU Y LENGUAJE",5361002,"TECNOLOGIA",4390100,null,null,{"$f":"IF(IF('1. Autorización'!$I$6=\"Altiplano\",C64,IF('1. Autorización'!$I$6=\"Sur\",E64,IF('1. Autorización'!$I$6=\"Colegio Americano del Sur\",G64,A64)))=0,\"\",IF('1. Autorización'!$I$6=\"Altiplano\",C64,IF('1. Autorización'!$I$6=\"Sur\",E64,IF('1. Autorización'!$I$6=\"Colegio Americano del Sur\",G64,A64))))","v":"DEPARTAMENTO DE PRESUPUESTO"},{"$f":"IF(IF('1. Autorización'!$I$6=\"Altiplano\",D64,IF('1. Autorización'!$I$6=\"Sur\",F64,IF('1. Autorización'!$I$6=\"Colegio Americano del Sur\",H64,B64)))=0,\"\",IF('1. Autorización'!$I$6=\"Altiplano\",D64,IF('1. Autorización'!$I$6=\"Sur\",F64,IF('1. Autorización'!$I$6=\"Colegio Americano del Sur\",H64,B64))))","v":1340300}]
["DEPARTAMENTO DE SALARIOS Y PRESTACIONES",1480100,"PROFESORADO DE ENSEÑANZA MEDIA EN MATEMATICA",5360302,"UNIDAD DE CONSEJERIA",4390500,null,null,{"$f":"IF(IF('1. Autorización'!$I$6=\"Altiplano\",C65,IF('1. Autorización'!$I$6=\"Sur\",E65,IF('1. Autorización'!$I$6=\"Colegio Americano del Sur\",G65,A65)))=0,\"\",IF('1. Autorización'!$I$6=\"Altiplano\",C65,IF('1. Autorización'!$I$6=\"Sur\",E65,IF('1. Autorización'!$I$6=\"Colegio Americano del Sur\",G65,A65))))","v":"DEPARTAMENTO DE SALARIOS Y PRESTACIONES"},{"$f":"IF(IF('1. Autorización'!$I$6=\"Altiplano\",D65,IF('1. Autorización'!$I$6=\"Sur\",F65,IF('1. Autorización'!$I$6=\"Colegio Americano del Sur\",H65,B65)))=0,\"\",IF('1. Autorización'!$I$6=\"Altiplano\",D65,IF('1. Autorización'!$I$6=\"Sur\",F65,IF('1. Autorización'!$I$6=\"Colegio Americano del Sur\",H65,B65))))","v":1480100}]
["DEPARTAMENTO DE SEGURIDAD",1330600,"PROFESORADO EN INGLES",5360501,null,null,null,null,{"$f":"IF(IF('1. Autorización'!$I$6=\"Altiplano\",C66,IF('1. Autorización'!$I$6=\"Sur\",E66,IF('1. Autorización'!$I$6=\"Colegio Americano del Sur\",G66,A66)))=0,\"\",IF('1. Autorización'!$I$6=\"Altiplano\",C66,IF('1. Autorización'!$I$6=\"Sur\",E66,IF('1. Autorización'!$I$6=\"Colegio Americano del Sur\",G66,A66))))","v":"DEPARTAMENTO DE SEGURIDAD"},{"$f":"IF(IF('1. Autorización'!$I$6=\"Altiplano\",D66,IF('1. Autorización'!$I$6=\"Sur\",F66,IF('1. Autorización'!$I$6=\"Colegio Americano del Sur\",H66,B66)))=0,\"\",IF('1. Autorización'!$I$6=\"Altiplano\",D66,IF('1. Autorización'!$I$6=\"Sur\",F66,IF('1. Autorización'!$I$6=\"Colegio Americano del Sur\",H66,B66))))","v":1330600}]
["DEPORTE EXTRACURRICULAR",1500204,"PROFESORADO ESPEC.  EN MATEMATICAS Y COMPUTACION",5360301,null,null,null,null,{"$f":"IF(IF('1. Autorización'!$I$6=\"Altiplano\",C67,IF('1. Autorización'!$I$6=\"Sur\",E67,IF('1. Autorización'!$I$6=\"Colegio Americano del Sur\",G67,A67)))=0,\"\",IF('1. Autorización'!$I$6=\"Altiplano\",C67,IF('1. Autorización'!$I$6=\"Sur\",E67,IF('1. Autorización'!$I$6=\"Colegio Americano del Sur\",G67,A67))))","v":"DEPORTE EXTRACURRICULAR"},{"$f":"IF(IF('1. Autorización'!$I$6=\"Altiplano\",D67,IF('1. Autorización'!$I$6=\"Sur\",F67,IF('1. Autorización'!$I$6=\"Colegio Americano del Sur\",H67,B67)))=0,\"\",IF('1. Autorización'!$I$6=\"Altiplano\",D67,IF('1. Autorización'!$I$6=\"Sur\",F67,IF('1. Autorización'!$I$6=\"Colegio Americano del Sur\",H67,B67))))","v":1500204}]
["DIR GRAL DE DESARROLLO Y COORD DE PROG EXTERNOS",1560002,"PROFESORADO ESPECIALIZADO EN EDUCACION  MUSICA",5360701,null,null,null,null,{"$f":"IF(IF('1. Autorización'!$I$6=\"Altiplano\",C68,IF('1. Autorización'!$I$6=\"Sur\",E68,IF('1. Autorización'!$I$6=\"Colegio Americano del Sur\",G68,A68)))=0,\"\",IF('1. Autorización'!$I$6=\"Altiplano\",C68,IF('1. Autorización'!$I$6=\"Sur\",E68,IF('1. Autorización'!$I$6=\"Colegio Americano del Sur\",G68,A68))))","v":"DIR GRAL DE DESARROLLO Y COORD DE PROG EXTERNOS"},{"$f":"IF(IF('1. Autorización'!$I$6=\"Altiplano\",D68,IF('1. Autorización'!$I$6=\"Sur\",F68,IF('1. Autorización'!$I$6=\"Colegio Americano del Sur\",H68,B68)))=0,\"\",IF('1. Autorización'!$I$6=\"Altiplano\",D68,IF('1. Autorización'!$I$6=\"Sur\",F68,IF('1. Autorización'!$I$6=\"Colegio Americano del Sur\",H68,B68))))","v":1560002}]
["DIR GRAL DE GESTION DE RIESGOS Y AUDITORIA INTERNA",1560001,"PROFESORADO ESPECIALIZADO EN EDUCACION PRIMARIA",5360203,null,null,null,null,{"$f":"IF(IF('1. Autorización'!$I$6=\"Altiplano\",C69,IF('1. Autorización'!$I$6=\"Sur\",E69,IF('1. Autorización'!$I$6=\"Colegio Americano del Sur\",G69,A69)))=0,\"\",IF('1. Autorización'!$I$6=\"Altiplano\",C69,IF('1. Autorización'!$I$6=\"Sur\",E69,IF('1. Autorización'!$I$6=\"Colegio Americano del Sur\",G69,A69))))","v":"DIR GRAL DE GESTION DE RIESGOS Y AUDITORIA INTERNA"},{"$f":"IF(IF('1. Autorización'!$I$6=\"Altiplano\",D69,IF('1. Autorización'!$I$6=\"Sur\",F69,IF('1. Autorización'!$I$6=\"Colegio Americano del Sur\",H69,B69)))=0,\"\",IF('1. Autorización'!$I$6=\"Altiplano\",D69,IF('1. Autorización'!$I$6=\"Sur\",F69,IF('1. Autorización'!$I$6=\"Colegio Americano del Sur\",H69,B69))))","v":1560001}]
["DIR.  DE INNOVACION Y TECNOLOGIA DEL APRENDIZAJE",1371900,"PROFESORADO ESPECIALIZADO EN PROBLEMAS DE APRENDIZ",5360401,null,null,null,null,{"$f":"IF(IF('1. Autorización'!$I$6=\"Altiplano\",C70,IF('1. Autorización'!$I$6=\"Sur\",E70,IF('1. Autorización'!$I$6=\"Colegio Americano del Sur\",G70,A70)))=0,\"\",IF('1. Autorización'!$I$6=\"Altiplano\",C70,IF('1. Autorización'!$I$6=\"Sur\",E70,IF('1. Autorización'!$I$6=\"Colegio Americano del Sur\",G70,A70))))","v":"DIR.  DE INNOVACION Y TECNOLOGIA DEL APRENDIZAJE"},{"$f":"IF(IF('1. Autorización'!$I$6=\"Altiplano\",D70,IF('1. Autorización'!$I$6=\"Sur\",F70,IF('1. Autorización'!$I$6=\"Colegio Americano del Sur\",H70,B70)))=0,\"\",IF('1. Autorización'!$I$6=\"Altiplano\",D70,IF('1. Autorización'!$I$6=\"Sur\",F70,IF('1. Autorización'!$I$6=\"Colegio Americano del Sur\",H70,B70))))","v":1371900}]
["DIRECCION AREA DE EDUACION ESPECIAL",1420700,"SECUNDARIA BASICOS",5480101,null,null,null,null,{"$f":"IF(IF('1. Autorización'!$I$6=\"Altiplano\",C71,IF('1. Autorización'!$I$6=\"Sur\",E71,IF('1. Autorización'!$I$6=\"Colegio Americano del Sur\",G71,A71)))=0,\"\",IF('1. Autorización'!$I$6=\"Altiplano\",C71,IF('1. Autorización'!$I$6=\"Sur\",E71,IF('1. Autorización'!$I$6=\"Colegio Americano del Sur\",G71,A71))))","v":"DIRECCION AREA DE EDUACION ESPECIAL"},{"$f":"IF(IF('1. Autorización'!$I$6=\"Altiplano\",D71,IF('1. Autorización'!$I$6=\"Sur\",F71,IF('1. Autorización'!$I$6=\"Colegio Americano del Sur\",H71,B71)))=0,\"\",IF('1. Autorización'!$I$6=\"Altiplano\",D71,IF('1. Autorización'!$I$6=\"Sur\",F71,IF('1. Autorización'!$I$6=\"Colegio Americano del Sur\",H71,B71))))","v":1420700}]
["DIRECCION CENTRO DE ESTUDIOS AMBIENTALES",1430800,"TECNICO UNIVERSITARIO  EN ADMON. DE EMPRESAS",5500302,null,null,null,null,{"$f":"IF(IF('1. Autorización'!$I$6=\"Altiplano\",C72,IF('1. Autorización'!$I$6=\"Sur\",E72,IF('1. Autorización'!$I$6=\"Colegio Americano del Sur\",G72,A72)))=0,\"\",IF('1. Autorización'!$I$6=\"Altiplano\",C72,IF('1. Autorización'!$I$6=\"Sur\",E72,IF('1. Autorización'!$I$6=\"Colegio Americano del Sur\",G72,A72))))","v":"DIRECCION CENTRO DE ESTUDIOS AMBIENTALES"},{"$f":"IF(IF('1. Autorización'!$I$6=\"Altiplano\",D72,IF('1. Autorización'!$I$6=\"Sur\",F72,IF('1. Autorización'!$I$6=\"Colegio Americano del Sur\",H72,B72)))=0,\"\",IF('1. Autorización'!$I$6=\"Altiplano\",D72,IF('1. Autorización'!$I$6=\"Sur\",F72,IF('1. Autorización'!$I$6=\"Colegio Americano del Sur\",H72,B72))))","v":1430800}]
["DIRECCION CENTRO DE ESTUDIOS INFORMATICA APLICADA",1430600,"TECNICO UNIVERSITARIO EN AGROFORESTERIA",5500101,null,null,null,null,{"$f":"IF(IF('1. Autorización'!$I$6=\"Altiplano\",C73,IF('1. Autorización'!$I$6=\"Sur\",E73,IF('1. Autorización'!$I$6=\"Colegio Americano del Sur\",G73,A73)))=0,\"\",IF('1. Autorización'!$I$6=\"Altiplano\",C73,IF('1. Autorización'!$I$6=\"Sur\",E73,IF('1. Autorización'!$I$6=\"Colegio Americano del Sur\",G73,A73))))","v":"DIRECCION CENTRO DE ESTUDIOS INFORMATICA APLICADA"},{"$f":"IF(IF('1. Autorización'!$I$6=\"Altiplano\",D73,IF('1. Autorización'!$I$6=\"Sur\",F73,IF('1. Autorización'!$I$6=\"Colegio Americano del Sur\",H73,B73)))=0,\"\",IF('1. Autorización'!$I$6=\"Altiplano\",D73,IF('1. Autorización'!$I$6=\"Sur\",F73,IF('1. Autorización'!$I$6=\"Colegio Americano del Sur\",H73,B73))))","v":1430600}]
["DIRECCION CENTRO DE INVESTIGACIONES EDUCATIVAS",1430200,"TECNICO UNIVERSITARIO EN INFORMATICA",5500401,null,null,null,null,{"$f":"IF(IF('1. Autorización'!$I$6=\"Altiplano\",C74,IF('1. Autorización'!$I$6=\"Sur\",E74,IF('1. Autorización'!$I$6=\"Colegio Americano del Sur\",G74,A74)))=0,\"\",IF('1. Autorización'!$I$6=\"Altiplano\",C74,IF('1. Autorización'!$I$6=\"Sur\",E74,IF('1. Autorización'!$I$6=\"Colegio Americano del Sur\",G74,A74))))","v":"DIRECCION CENTRO DE INVESTIGACIONES EDUCATIVAS"},{"$f":"IF(IF('1. Autorización'!$I$6=\"Altiplano\",D74,IF('1. Autorización'!$I$6=\"Sur\",F74,IF('1. Autorización'!$I$6=\"Colegio Americano del Sur\",H74,B74)))=0,\"\",IF('1. Autorización'!$I$6=\"Altiplano\",D74,IF('1. Autorización'!$I$6=\"Sur\",F74,IF('1. Autorización'!$I$6=\"Colegio Americano del Sur\",H74,B74))))","v":1430200}]
["DIRECCION CIENTIFICO HUMANISTICO",1421600,"TECNICO UNIVERSITARIO EN TURISMO",5490101,null,null,null,null,{"$f":"IF(IF('1. Autorización'!$I$6=\"Altiplano\",C75,IF('1. Autorización'!$I$6=\"Sur\",E75,IF('1. Autorización'!$I$6=\"Colegio Americano del Sur\",G75,A75)))=0,\"\",IF('1. Autorización'!$I$6=\"Altiplano\",C75,IF('1. Autorización'!$I$6=\"Sur\",E75,IF('1. Autorización'!$I$6=\"Colegio Americano del Sur\",G75,A75))))","v":"DIRECCION CIENTIFICO HUMANISTICO"},{"$f":"IF(IF('1. Autorización'!$I$6=\"Altiplano\",D75,IF('1. Autorización'!$I$6=\"Sur\",F75,IF('1. Autorización'!$I$6=\"Colegio Americano del Sur\",H75,B75)))=0,\"\",IF('1. Autorización'!$I$6=\"Altiplano\",D75,IF('1. Autorización'!$I$6=\"Sur\",F75,IF('1. Autorización'!$I$6=\"Colegio Americano del Sur\",H75,B75))))","v":1421600}]
["DIRECCION COLEGIO UNIVERSITARIO",1390500,"TRABAJO SOCIAL",5510300,null,null,null,null,{"$f":"IF(IF('1. Autorización'!$I$6=\"Altiplano\",C76,IF('1. Autorización'!$I$6=\"Sur\",E76,IF('1. Autorización'!$I$6=\"Colegio Americano del Sur\",G76,A76)))=0,\"\",IF('1. Autorización'!$I$6=\"Altiplano\",C76,IF('1. Autorización'!$I$6=\"Sur\",E76,IF('1. Autorización'!$I$6=\"Colegio Americano del Sur\",G76,A76))))","v":"DIRECCION COLEGIO UNIVERSITARIO"},{"$f":"IF(IF('1. Autorización'!$I$6=\"Altiplano\",D76,IF('1. Autorización'!$I$6=\"Sur\",F76,IF('1. Autorización'!$I$6=\"Colegio Americano del Sur\",H76,B76)))=0,\"\",IF('1. Autorización'!$I$6=\"Altiplano\",D76,IF('1. Autorización'!$I$6=\"Sur\",F76,IF('1. Autorización'!$I$6=\"Colegio Americano del Sur\",H76,B76))))","v":1390500}]
["DIRECCION COLEGIO UNIVERSITARIO (EDUCON)",8050100,"UNIVERSIDAD PARA TODOS",5400300,null,null,null,null,{"$f":"IF(IF('1. Autorización'!$I$6=\"Altiplano\",C77,IF('1. Autorización'!$I$6=\"Sur\",E77,IF('1. Autorización'!$I$6=\"Colegio Americano del Sur\",G77,A77)))=0,\"\",IF('1. Autorización'!$I$6=\"Altiplano\",C77,IF('1. Autorización'!$I$6=\"Sur\",E77,IF('1. Autorización'!$I$6=\"Colegio Americano del Sur\",G77,A77))))","v":"DIRECCION COLEGIO UNIVERSITARIO (EDUCON)"},{"$f":"IF(IF('1. Autorización'!$I$6=\"Altiplano\",D77,IF('1. Autorización'!$I$6=\"Sur\",F77,IF('1. Autorización'!$I$6=\"Colegio Americano del Sur\",H77,B77)))=0,\"\",IF('1. Autorización'!$I$6=\"Altiplano\",D77,IF('1. Autorización'!$I$6=\"Sur\",F77,IF('1. Autorización'!$I$6=\"Colegio Americano del Sur\",H77,B77))))","v":8050100}]
["DIRECCION DE ANTROPOLOGIA Y SOCIOLOGIA",1410900,null,null,null,null,null,null,{"$f":"IF(IF('1. Autorización'!$I$6=\"Altiplano\",C78,IF('1. Autorización'!$I$6=\"Sur\",E78,IF('1. Autorización'!$I$6=\"Colegio Americano del Sur\",G78,A78)))=0,\"\",IF('1. Autorización'!$I$6=\"Altiplano\",C78,IF('1. Autorización'!$I$6=\"Sur\",E78,IF('1. Autorización'!$I$6=\"Colegio Americano del Sur\",G78,A78))))","v":"DIRECCION DE ANTROPOLOGIA Y SOCIOLOGIA"},{"$f":"IF(IF('1. Autorización'!$I$6=\"Altiplano\",D78,IF('1. Autorización'!$I$6=\"Sur\",F78,IF('1. Autorización'!$I$6=\"Colegio Americano del Sur\",H78,B78)))=0,\"\",IF('1. Autorización'!$I$6=\"Altiplano\",D78,IF('1. Autorización'!$I$6=\"Sur\",F78,IF('1. Autorización'!$I$6=\"Colegio Americano del Sur\",H78,B78))))","v":1410900}]
["DIRECCION DE ARQUEOLOGIA",1410200,null,null,null,null,null,null,{"$f":"IF(IF('1. Autorización'!$I$6=\"Altiplano\",C79,IF('1. Autorización'!$I$6=\"Sur\",E79,IF('1. Autorización'!$I$6=\"Colegio Americano del Sur\",G79,A79)))=0,\"\",IF('1. Autorización'!$I$6=\"Altiplano\",C79,IF('1. Autorización'!$I$6=\"Sur\",E79,IF('1. Autorización'!$I$6=\"Colegio Americano del Sur\",G79,A79))))","v":"DIRECCION DE ARQUEOLOGIA"},{"$f":"IF(IF('1. Autorización'!$I$6=\"Altiplano\",D79,IF('1. Autorización'!$I$6=\"Sur\",F79,IF('1. Autorización'!$I$6=\"Colegio Americano del Sur\",H79,B79)))=0,\"\",IF('1. Autorización'!$I$6=\"Altiplano\",D79,IF('1. Autorización'!$I$6=\"Sur\",F79,IF('1. Autorización'!$I$6=\"Colegio Americano del Sur\",H79,B79))))","v":1410200}]
["DIRECCION DE BIOLOGIA",1400100,null,null,null,null,null,null,{"$f":"IF(IF('1. Autorización'!$I$6=\"Altiplano\",C80,IF('1. Autorización'!$I$6=\"Sur\",E80,IF('1. Autorización'!$I$6=\"Colegio Americano del Sur\",G80,A80)))=0,\"\",IF('1. Autorización'!$I$6=\"Altiplano\",C80,IF('1. Autorización'!$I$6=\"Sur\",E80,IF('1. Autorización'!$I$6=\"Colegio Americano del Sur\",G80,A80))))","v":"DIRECCION DE BIOLOGIA"},{"$f":"IF(IF('1. Autorización'!$I$6=\"Altiplano\",D80,IF('1. Autorización'!$I$6=\"Sur\",F80,IF('1. Autorización'!$I$6=\"Colegio Americano del Sur\",H80,B80)))=0,\"\",IF('1. Autorización'!$I$6=\"Altiplano\",D80,IF('1. Autorización'!$I$6=\"Sur\",F80,IF('1. Autorización'!$I$6=\"Colegio Americano del Sur\",H80,B80))))","v":1400100}]
["DIRECCION DE BIOQUIMICA Y MICROBIOLOGIA",1400200,null,null,null,null,null,null,{"$f":"IF(IF('1. Autorización'!$I$6=\"Altiplano\",C81,IF('1. Autorización'!$I$6=\"Sur\",E81,IF('1. Autorización'!$I$6=\"Colegio Americano del Sur\",G81,A81)))=0,\"\",IF('1. Autorización'!$I$6=\"Altiplano\",C81,IF('1. Autorización'!$I$6=\"Sur\",E81,IF('1. Autorización'!$I$6=\"Colegio Americano del Sur\",G81,A81))))","v":"DIRECCION DE BIOQUIMICA Y MICROBIOLOGIA"},{"$f":"IF(IF('1. Autorización'!$I$6=\"Altiplano\",D81,IF('1. Autorización'!$I$6=\"Sur\",F81,IF('1. Autorización'!$I$6=\"Colegio Americano del Sur\",H81,B81)))=0,\"\",IF('1. Autorización'!$I$6=\"Altiplano\",D81,IF('1. Autorización'!$I$6=\"Sur\",F81,IF('1. Autorización'!$I$6=\"Colegio Americano del Sur\",H81,B81))))","v":1400200}]
["DIRECCION DE CIENCIAS DE LA ADMINISTRACION",1473400,null,null,null,null,null,null,{"$f":"IF(IF('1. Autorización'!$I$6=\"Altiplano\",C82,IF('1. Autorización'!$I$6=\"Sur\",E82,IF('1. Autorización'!$I$6=\"Colegio Americano del Sur\",G82,A82)))=0,\"\",IF('1. Autorización'!$I$6=\"Altiplano\",C82,IF('1. Autorización'!$I$6=\"Sur\",E82,IF('1. Autorización'!$I$6=\"Colegio Americano del Sur\",G82,A82))))","v":"DIRECCION DE CIENCIAS DE LA ADMINISTRACION"},{"$f":"IF(IF('1. Autorización'!$I$6=\"Altiplano\",D82,IF('1. Autorización'!$I$6=\"Sur\",F82,IF('1. Autorización'!$I$6=\"Colegio Americano del Sur\",H82,B82)))=0,\"\",IF('1. Autorización'!$I$6=\"Altiplano\",D82,IF('1. Autorización'!$I$6=\"Sur\",F82,IF('1. Autorización'!$I$6=\"Colegio Americano del Sur\",H82,B82))))","v":1473400}]
["DIRECCION DE COMPORTAMIENTO HUMANO",1473300,null,null,null,null,null,null,{"$f":"IF(IF('1. Autorización'!$I$6=\"Altiplano\",C83,IF('1. Autorización'!$I$6=\"Sur\",E83,IF('1. Autorización'!$I$6=\"Colegio Americano del Sur\",G83,A83)))=0,\"\",IF('1. Autorización'!$I$6=\"Altiplano\",C83,IF('1. Autorización'!$I$6=\"Sur\",E83,IF('1. Autorización'!$I$6=\"Colegio Americano del Sur\",G83,A83))))","v":"DIRECCION DE COMPORTAMIENTO HUMANO"},{"$f":"IF(IF('1. Autorización'!$I$6=\"Altiplano\",D83,IF('1. Autorización'!$I$6=\"Sur\",F83,IF('1. Autorización'!$I$6=\"Colegio Americano del Sur\",H83,B83)))=0,\"\",IF('1. Autorización'!$I$6=\"Altiplano\",D83,IF('1. Autorización'!$I$6=\"Sur\",F83,IF('1. Autorización'!$I$6=\"Colegio Americano del Sur\",H83,B83))))","v":1473300}]
["DIRECCION DE COMUNICACIONES Y LETRAS",1402400,null,null,null,null,null,null,{"$f":"IF(IF('1. Autorización'!$I$6=\"Altiplano\",C84,IF('1. Autorización'!$I$6=\"Sur\",E84,IF('1. Autorización'!$I$6=\"Colegio Americano del Sur\",G84,A84)))=0,\"\",IF('1. Autorización'!$I$6=\"Altiplano\",C84,IF('1. Autorización'!$I$6=\"Sur\",E84,IF('1. Autorización'!$I$6=\"Colegio Americano del Sur\",G84,A84))))","v":"DIRECCION DE COMUNICACIONES Y LETRAS"},{"$f":"IF(IF('1. Autorización'!$I$6=\"Altiplano\",D84,IF('1. Autorización'!$I$6=\"Sur\",F84,IF('1. Autorización'!$I$6=\"Colegio Americano del Sur\",H84,B84)))=0,\"\",IF('1. Autorización'!$I$6=\"Altiplano\",D84,IF('1. Autorización'!$I$6=\"Sur\",F84,IF('1. Autorización'!$I$6=\"Colegio Americano del Sur\",H84,B84))))","v":1402400}]
["DIRECCION DE ECOTURISMO",1400500,null,null,null,null,null,null,{"$f":"IF(IF('1. Autorización'!$I$6=\"Altiplano\",C85,IF('1. Autorización'!$I$6=\"Sur\",E85,IF('1. Autorización'!$I$6=\"Colegio Americano del Sur\",G85,A85)))=0,\"\",IF('1. Autorización'!$I$6=\"Altiplano\",C85,IF('1. Autorización'!$I$6=\"Sur\",E85,IF('1. Autorización'!$I$6=\"Colegio Americano del Sur\",G85,A85))))","v":"DIRECCION DE ECOTURISMO"},{"$f":"IF(IF('1. Autorización'!$I$6=\"Altiplano\",D85,IF('1. Autorización'!$I$6=\"Sur\",F85,IF('1. Autorización'!$I$6=\"Colegio Americano del Sur\",H85,B85)))=0,\"\",IF('1. Autorización'!$I$6=\"Altiplano\",D85,IF('1. Autorización'!$I$6=\"Sur\",F85,IF('1. Autorización'!$I$6=\"Colegio Americano del Sur\",H85,B85))))","v":1400500}]
["DIRECCION DE FISICA",1400600,null,null,null,null,null,null,{"$f":"IF(IF('1. Autorización'!$I$6=\"Altiplano\",C86,IF('1. Autorización'!$I$6=\"Sur\",E86,IF('1. Autorización'!$I$6=\"Colegio Americano del Sur\",G86,A86)))=0,\"\",IF('1. Autorización'!$I$6=\"Altiplano\",C86,IF('1. Autorización'!$I$6=\"Sur\",E86,IF('1. Autorización'!$I$6=\"Colegio Americano del Sur\",G86,A86))))","v":"DIRECCION DE FISICA"},{"$f":"IF(IF('1. Autorización'!$I$6=\"Altiplano\",D86,IF('1. Autorización'!$I$6=\"Sur\",F86,IF('1. Autorización'!$I$6=\"Colegio Americano del Sur\",H86,B86)))=0,\"\",IF('1. Autorización'!$I$6=\"Altiplano\",D86,IF('1. Autorización'!$I$6=\"Sur\",F86,IF('1. Autorización'!$I$6=\"Colegio Americano del Sur\",H86,B86))))","v":1400600}]
["DIRECCION DE GESTION DEL TALENTO HUMANO",1480000,null,null,null,null,null,null,{"$f":"IF(IF('1. Autorización'!$I$6=\"Altiplano\",C87,IF('1. Autorización'!$I$6=\"Sur\",E87,IF('1. Autorización'!$I$6=\"Colegio Americano del Sur\",G87,A87)))=0,\"\",IF('1. Autorización'!$I$6=\"Altiplano\",C87,IF('1. Autorización'!$I$6=\"Sur\",E87,IF('1. Autorización'!$I$6=\"Colegio Americano del Sur\",G87,A87))))","v":"DIRECCION DE GESTION DEL TALENTO HUMANO"},{"$f":"IF(IF('1. Autorización'!$I$6=\"Altiplano\",D87,IF('1. Autorización'!$I$6=\"Sur\",F87,IF('1. Autorización'!$I$6=\"Colegio Americano del Sur\",H87,B87)))=0,\"\",IF('1. Autorización'!$I$6=\"Altiplano\",D87,IF('1. Autorización'!$I$6=\"Sur\",F87,IF('1. Autorización'!$I$6=\"Colegio Americano del Sur\",H87,B87))))","v":1480000}]
["DIRECCION DE HISTORIA",1410300,null,null,null,null,null,null,{"$f":"IF(IF('1. Autorización'!$I$6=\"Altiplano\",C88,IF('1. Autorización'!$I$6=\"Sur\",E88,IF('1. Autorización'!$I$6=\"Colegio Americano del Sur\",G88,A88)))=0,\"\",IF('1. Autorización'!$I$6=\"Altiplano\",C88,IF('1. Autorización'!$I$6=\"Sur\",E88,IF('1. Autorización'!$I$6=\"Colegio Americano del Sur\",G88,A88))))","v":"DIRECCION DE HISTORIA"},{"$f":"IF(IF('1. Autorización'!$I$6=\"Altiplano\",D88,IF('1. Autorización'!$I$6=\"Sur\",F88,IF('1. Autorización'!$I$6=\"Colegio Americano del Sur\",H88,B88)))=0,\"\",IF('1. Autorización'!$I$6=\"Altiplano\",D88,IF('1. Autorización'!$I$6=\"Sur\",F88,IF('1. Autorización'!$I$6=\"Colegio Americano del Sur\",H88,B88))))","v":1410300}]
["DIRECCION DE INGLES",1420900,null,null,null,null,null,null,{"$f":"IF(IF('1. Autorización'!$I$6=\"Altiplano\",C89,IF('1. Autorización'!$I$6=\"Sur\",E89,IF('1. Autorización'!$I$6=\"Colegio Americano del Sur\",G89,A89)))=0,\"\",IF('1. Autorización'!$I$6=\"Altiplano\",C89,IF('1. Autorización'!$I$6=\"Sur\",E89,IF('1. Autorización'!$I$6=\"Colegio Americano del Sur\",G89,A89))))","v":"DIRECCION DE INGLES"},{"$f":"IF(IF('1. Autorización'!$I$6=\"Altiplano\",D89,IF('1. Autorización'!$I$6=\"Sur\",F89,IF('1. Autorización'!$I$6=\"Colegio Americano del Sur\",H89,B89)))=0,\"\",IF('1. Autorización'!$I$6=\"Altiplano\",D89,IF('1. Autorización'!$I$6=\"Sur\",F89,IF('1. Autorización'!$I$6=\"Colegio Americano del Sur\",H89,B89))))","v":1420900}]
["DIRECCION DE MAESTRIAS EN TECNOLOGIA DE ALIMENTOS",1473500,null,null,null,null,null,null,{"$f":"IF(IF('1. Autorización'!$I$6=\"Altiplano\",C90,IF('1. Autorización'!$I$6=\"Sur\",E90,IF('1. Autorización'!$I$6=\"Colegio Americano del Sur\",G90,A90)))=0,\"\",IF('1. Autorización'!$I$6=\"Altiplano\",C90,IF('1. Autorización'!$I$6=\"Sur\",E90,IF('1. Autorización'!$I$6=\"Colegio Americano del Sur\",G90,A90))))","v":"DIRECCION DE MAESTRIAS EN TECNOLOGIA DE ALIMENTOS"},{"$f":"IF(IF('1. Autorización'!$I$6=\"Altiplano\",D90,IF('1. Autorización'!$I$6=\"Sur\",F90,IF('1. Autorización'!$I$6=\"Colegio Americano del Sur\",H90,B90)))=0,\"\",IF('1. Autorización'!$I$6=\"Altiplano\",D90,IF('1. Autorización'!$I$6=\"Sur\",F90,IF('1. Autorización'!$I$6=\"Colegio Americano del Sur\",H90,B90))))","v":1473500}]
["DIRECCION DE MAESTRIAS Y LICENCIATURA EN EDUCACION",1421300,null,null,null,null,null,null,{"$f":"IF(IF('1. Autorización'!$I$6=\"Altiplano\",C91,IF('1. Autorización'!$I$6=\"Sur\",E91,IF('1. Autorización'!$I$6=\"Colegio Americano del Sur\",G91,A91)))=0,\"\",IF('1. Autorización'!$I$6=\"Altiplano\",C91,IF('1. Autorización'!$I$6=\"Sur\",E91,IF('1. Autorización'!$I$6=\"Colegio Americano del Sur\",G91,A91))))","v":"DIRECCION DE MAESTRIAS Y LICENCIATURA EN EDUCACION"},{"$f":"IF(IF('1. Autorización'!$I$6=\"Altiplano\",D91,IF('1. Autorización'!$I$6=\"Sur\",F91,IF('1. Autorización'!$I$6=\"Colegio Americano del Sur\",H91,B91)))=0,\"\",IF('1. Autorización'!$I$6=\"Altiplano\",D91,IF('1. Autorización'!$I$6=\"Sur\",F91,IF('1. Autorización'!$I$6=\"Colegio Americano del Sur\",H91,B91))))","v":1421300}]
["DIRECCION DE MATEMATICAS",1401500,null,null,null,null,null,null,{"$f":"IF(IF('1. Autorización'!$I$6=\"Altiplano\",C92,IF('1. Autorización'!$I$6=\"Sur\",E92,IF('1. Autorización'!$I$6=\"Colegio Americano del Sur\",G92,A92)))=0,\"\",IF('1. Autorización'!$I$6=\"Altiplano\",C92,IF('1. Autorización'!$I$6=\"Sur\",E92,IF('1. Autorización'!$I$6=\"Colegio Americano del Sur\",G92,A92))))","v":"DIRECCION DE MATEMATICAS"},{"$f":"IF(IF('1. Autorización'!$I$6=\"Altiplano\",D92,IF('1. Autorización'!$I$6=\"Sur\",F92,IF('1. Autorización'!$I$6=\"Colegio Americano del Sur\",H92,B92)))=0,\"\",IF('1. Autorización'!$I$6=\"Altiplano\",D92,IF('1. Autorización'!$I$6=\"Sur\",F92,IF('1. Autorización'!$I$6=\"Colegio Americano del Sur\",H92,B92))))","v":1401500}]
["DIRECCION DE MUSICA",1420400,null,null,null,null,null,null,{"$f":"IF(IF('1. Autorización'!$I$6=\"Altiplano\",C93,IF('1. Autorización'!$I$6=\"Sur\",E93,IF('1. Autorización'!$I$6=\"Colegio Americano del Sur\",G93,A93)))=0,\"\",IF('1. Autorización'!$I$6=\"Altiplano\",C93,IF('1. Autorización'!$I$6=\"Sur\",E93,IF('1. Autorización'!$I$6=\"Colegio Americano del Sur\",G93,A93))))","v":"DIRECCION DE MUSICA"},{"$f":"IF(IF('1. Autorización'!$I$6=\"Altiplano\",D93,IF('1. Autorización'!$I$6=\"Sur\",F93,IF('1. Autorización'!$I$6=\"Colegio Americano del Sur\",H93,B93)))=0,\"\",IF('1. Autorización'!$I$6=\"Altiplano\",D93,IF('1. Autorización'!$I$6=\"Sur\",F93,IF('1. Autorización'!$I$6=\"Colegio Americano del Sur\",H93,B93))))","v":1420400}]
["DIRECCION DE NUTRICION",1401600,null,null,null,null,null,null,{"$f":"IF(IF('1. Autorización'!$I$6=\"Altiplano\",C94,IF('1. Autorización'!$I$6=\"Sur\",E94,IF('1. Autorización'!$I$6=\"Colegio Americano del Sur\",G94,A94)))=0,\"\",IF('1. Autorización'!$I$6=\"Altiplano\",C94,IF('1. Autorización'!$I$6=\"Sur\",E94,IF('1. Autorización'!$I$6=\"Colegio Americano del Sur\",G94,A94))))","v":"DIRECCION DE NUTRICION"},{"$f":"IF(IF('1. Autorización'!$I$6=\"Altiplano\",D94,IF('1. Autorización'!$I$6=\"Sur\",F94,IF('1. Autorización'!$I$6=\"Colegio Americano del Sur\",H94,B94)))=0,\"\",IF('1. Autorización'!$I$6=\"Altiplano\",D94,IF('1. Autorización'!$I$6=\"Sur\",F94,IF('1. Autorización'!$I$6=\"Colegio Americano del Sur\",H94,B94))))","v":1401600}]
["DIRECCION DE PSICOLOGIA",1410400,null,null,null,null,null,null,{"$f":"IF(IF('1. Autorización'!$I$6=\"Altiplano\",C95,IF('1. Autorización'!$I$6=\"Sur\",E95,IF('1. Autorización'!$I$6=\"Colegio Americano del Sur\",G95,A95)))=0,\"\",IF('1. Autorización'!$I$6=\"Altiplano\",C95,IF('1. Autorización'!$I$6=\"Sur\",E95,IF('1. Autorización'!$I$6=\"Colegio Americano del Sur\",G95,A95))))","v":"DIRECCION DE PSICOLOGIA"},{"$f":"IF(IF('1. Autorización'!$I$6=\"Altiplano\",D95,IF('1. Autorización'!$I$6=\"Sur\",F95,IF('1. Autorización'!$I$6=\"Colegio Americano del Sur\",H95,B95)))=0,\"\",IF('1. Autorización'!$I$6=\"Altiplano\",D95,IF('1. Autorización'!$I$6=\"Sur\",F95,IF('1. Autorización'!$I$6=\"Colegio Americano del Sur\",H95,B95))))","v":1410400}]
["DIRECCION DE QUIMICA",1401700,null,null,null,null,null,null,{"$f":"IF(IF('1. Autorización'!$I$6=\"Altiplano\",C96,IF('1. Autorización'!$I$6=\"Sur\",E96,IF('1. Autorización'!$I$6=\"Colegio Americano del Sur\",G96,A96)))=0,\"\",IF('1. Autorización'!$I$6=\"Altiplano\",C96,IF('1. Autorización'!$I$6=\"Sur\",E96,IF('1. Autorización'!$I$6=\"Colegio Americano del Sur\",G96,A96))))","v":"DIRECCION DE QUIMICA"},{"$f":"IF(IF('1. Autorización'!$I$6=\"Altiplano\",D96,IF('1. Autorización'!$I$6=\"Sur\",F96,IF('1. Autorización'!$I$6=\"Colegio Americano del Sur\",H96,B96)))=0,\"\",IF('1. Autorización'!$I$6=\"Altiplano\",D96,IF('1. Autorización'!$I$6=\"Sur\",F96,IF('1. Autorización'!$I$6=\"Colegio Americano del Sur\",H96,B96))))","v":1401700}]
["DIRECCION DE QUIMICA FARMACEUTICA",1401800,null,null,null,null,null,null,{"$f":"IF(IF('1. Autorización'!$I$6=\"Altiplano\",C97,IF('1. Autorización'!$I$6=\"Sur\",E97,IF('1. Autorización'!$I$6=\"Colegio Americano del Sur\",G97,A97)))=0,\"\",IF('1. Autorización'!$I$6=\"Altiplano\",C97,IF('1. Autorización'!$I$6=\"Sur\",E97,IF('1. Autorización'!$I$6=\"Colegio Americano del Sur\",G97,A97))))","v":"DIRECCION DE QUIMICA FARMACEUTICA"},{"$f":"IF(IF('1. Autorización'!$I$6=\"Altiplano\",D97,IF('1. Autorización'!$I$6=\"Sur\",F97,IF('1. Autorización'!$I$6=\"Colegio Americano del Sur\",H97,B97)))=0,\"\",IF('1. Autorización'!$I$6=\"Altiplano\",D97,IF('1. Autorización'!$I$6=\"Sur\",F97,IF('1. Autorización'!$I$6=\"Colegio Americano del Sur\",H97,B97))))","v":1401800}]
["DIRECCION DE RELACIONES INTERNACIONALES",1411700,null,null,null,null,null,null,{"$f":"IF(IF('1. Autorización'!$I$6=\"Altiplano\",C98,IF('1. Autorización'!$I$6=\"Sur\",E98,IF('1. Autorización'!$I$6=\"Colegio Americano del Sur\",G98,A98)))=0,\"\",IF('1. Autorización'!$I$6=\"Altiplano\",C98,IF('1. Autorización'!$I$6=\"Sur\",E98,IF('1. Autorización'!$I$6=\"Colegio Americano del Sur\",G98,A98))))","v":"DIRECCION DE RELACIONES INTERNACIONALES"},{"$f":"IF(IF('1. Autorización'!$I$6=\"Altiplano\",D98,IF('1. Autorización'!$I$6=\"Sur\",F98,IF('1. Autorización'!$I$6=\"Colegio Americano del Sur\",H98,B98)))=0,\"\",IF('1. Autorización'!$I$6=\"Altiplano\",D98,IF('1. Autorización'!$I$6=\"Sur\",F98,IF('1. Autorización'!$I$6=\"Colegio Americano del Sur\",H98,B98))))","v":1411700}]
["DIRECCION DE TECNOLOGIAS DE INFORM Y COMUNICACION",1520000,null,null,null,null,null,null,{"$f":"IF(IF('1. Autorización'!$I$6=\"Altiplano\",C99,IF('1. Autorización'!$I$6=\"Sur\",E99,IF('1. Autorización'!$I$6=\"Colegio Americano del Sur\",G99,A99)))=0,\"\",IF('1. Autorización'!$I$6=\"Altiplano\",C99,IF('1. Autorización'!$I$6=\"Sur\",E99,IF('1. Autorización'!$I$6=\"Colegio Americano del Sur\",G99,A99))))","v":"DIRECCION DE TECNOLOGIAS DE INFORM Y COMUNICACION"},{"$f":"IF(IF('1. Autorización'!$I$6=\"Altiplano\",D99,IF('1. Autorización'!$I$6=\"Sur\",F99,IF('1. Autorización'!$I$6=\"Colegio Americano del Sur\",H99,B99)))=0,\"\",IF('1. Autorización'!$I$6=\"Altiplano\",D99,IF('1. Autorización'!$I$6=\"Sur\",F99,IF('1. Autorización'!$I$6=\"Colegio Americano del Sur\",H99,B99))))","v":1520000}]
["DIRECCION DE VINCULACION",1570200,null,null,null,null,null,null,{"$f":"IF(IF('1. Autorización'!$I$6=\"Altiplano\",C100,IF('1. Autorización'!$I$6=\"Sur\",E100,IF('1. Autorización'!$I$6=\"Colegio Americano del Sur\",G100,A100)))=0,\"\",IF('1. Autorización'!$I$6=\"Altiplano\",C100,IF('1. Autorización'!$I$6=\"Sur\",E100,IF('1. Autorización'!$I$6=\"Colegio Americano del Sur\",G100,A100))))","v":"DIRECCION DE VINCULACION"},{"$f":"IF(IF('1. Autorización'!$I$6=\"Altiplano\",D100,IF('1. Autorización'!$I$6=\"Sur\",F100,IF('1. Autorización'!$I$6=\"Colegio Americano del Sur\",H100,B100)))=0,\"\",IF('1. Autorización'!$I$6=\"Altiplano\",D100,IF('1. Autorización'!$I$6=\"Sur\",F100,IF('1. Autorización'!$I$6=\"Colegio Americano del Sur\",H100,B100))))","v":1570200}]
["DIRECCION EJECUTIVA DE PROYECTOS ESTRATEGICOS",1350300,null,null,null,null,null,null,{"$f":"IF(IF('1. Autorización'!$I$6=\"Altiplano\",C101,IF('1. Autorización'!$I$6=\"Sur\",E101,IF('1. Autorización'!$I$6=\"Colegio Americano del Sur\",G101,A101)))=0,\"\",IF('1. Autorización'!$I$6=\"Altiplano\",C101,IF('1. Autorización'!$I$6=\"Sur\",E101,IF('1. Autorización'!$I$6=\"Colegio Americano del Sur\",G101,A101))))","v":"DIRECCION EJECUTIVA DE PROYECTOS ESTRATEGICOS"},{"$f":"IF(IF('1. Autorización'!$I$6=\"Altiplano\",D101,IF('1. Autorización'!$I$6=\"Sur\",F101,IF('1. Autorización'!$I$6=\"Colegio Americano del Sur\",H101,B101)))=0,\"\",IF('1. Autorización'!$I$6=\"Altiplano\",D101,IF('1. Autorización'!$I$6=\"Sur\",F101,IF('1. Autorización'!$I$6=\"Colegio Americano del Sur\",H101,B101))))","v":1350300}]
["DIRECCION GENERAL A DE ACREDITACION INSTITUCIONAL",1380101,null,null,null,null,null,null,{"$f":"IF(IF('1. Autorización'!$I$6=\"Altiplano\",C102,IF('1. Autorización'!$I$6=\"Sur\",E102,IF('1. Autorización'!$I$6=\"Colegio Americano del Sur\",G102,A102)))=0,\"\",IF('1. Autorización'!$I$6=\"Altiplano\",C102,IF('1. Autorización'!$I$6=\"Sur\",E102,IF('1. Autorización'!$I$6=\"Colegio Americano del Sur\",G102,A102))))","v":"DIRECCION GENERAL A DE ACREDITACION INSTITUCIONAL"},{"$f":"IF(IF('1. Autorización'!$I$6=\"Altiplano\",D102,IF('1. Autorización'!$I$6=\"Sur\",F102,IF('1. Autorización'!$I$6=\"Colegio Americano del Sur\",H102,B102)))=0,\"\",IF('1. Autorización'!$I$6=\"Altiplano\",D102,IF('1. Autorización'!$I$6=\"Sur\",F102,IF('1. Autorización'!$I$6=\"Colegio Americano del Sur\",H102,B102))))","v":1380101}]
["DIRECCION GENERAL A DE ESTUDIOS",1380100,null,null,null,null,null,null,{"$f":"IF(IF('1. Autorización'!$I$6=\"Altiplano\",C103,IF('1. Autorización'!$I$6=\"Sur\",E103,IF('1. Autorización'!$I$6=\"Colegio Americano del Sur\",G103,A103)))=0,\"\",IF('1. Autorización'!$I$6=\"Altiplano\",C103,IF('1. Autorización'!$I$6=\"Sur\",E103,IF('1. Autorización'!$I$6=\"Colegio Americano del Sur\",G103,A103))))","v":"DIRECCION GENERAL A DE ESTUDIOS"},{"$f":"IF(IF('1. Autorización'!$I$6=\"Altiplano\",D103,IF('1. Autorización'!$I$6=\"Sur\",F103,IF('1. Autorización'!$I$6=\"Colegio Americano del Sur\",H103,B103)))=0,\"\",IF('1. Autorización'!$I$6=\"Altiplano\",D103,IF('1. Autorización'!$I$6=\"Sur\",F103,IF('1. Autorización'!$I$6=\"Colegio Americano del Sur\",H103,B103))))","v":1380100}]
["DIRECCION GENERAL A DE ESTUDIOS",8090000,null,null,null,null,null,null,{"$f":"IF(IF('1. Autorización'!$I$6=\"Altiplano\",C104,IF('1. Autorización'!$I$6=\"Sur\",E104,IF('1. Autorización'!$I$6=\"Colegio Americano del Sur\",G104,A104)))=0,\"\",IF('1. Autorización'!$I$6=\"Altiplano\",C104,IF('1. Autorización'!$I$6=\"Sur\",E104,IF('1. Autorización'!$I$6=\"Colegio Americano del Sur\",G104,A104))))","v":"DIRECCION GENERAL A DE ESTUDIOS"},{"$f":"IF(IF('1. Autorización'!$I$6=\"Altiplano\",D104,IF('1. Autorización'!$I$6=\"Sur\",F104,IF('1. Autorización'!$I$6=\"Colegio Americano del Sur\",H104,B104)))=0,\"\",IF('1. Autorización'!$I$6=\"Altiplano\",D104,IF('1. Autorización'!$I$6=\"Sur\",F104,IF('1. Autorización'!$I$6=\"Colegio Americano del Sur\",H104,B104))))","v":8090000}]
["DIRECCION GENERAL DE  ADMINISTRACION",1330000,null,null,null,null,null,null,{"$f":"IF(IF('1. Autorización'!$I$6=\"Altiplano\",C105,IF('1. Autorización'!$I$6=\"Sur\",E105,IF('1. Autorización'!$I$6=\"Colegio Americano del Sur\",G105,A105)))=0,\"\",IF('1. Autorización'!$I$6=\"Altiplano\",C105,IF('1. Autorización'!$I$6=\"Sur\",E105,IF('1. Autorización'!$I$6=\"Colegio Americano del Sur\",G105,A105))))","v":"DIRECCION GENERAL DE  ADMINISTRACION"},{"$f":"IF(IF('1. Autorización'!$I$6=\"Altiplano\",D105,IF('1. Autorización'!$I$6=\"Sur\",F105,IF('1. Autorización'!$I$6=\"Colegio Americano del Sur\",H105,B105)))=0,\"\",IF('1. Autorización'!$I$6=\"Altiplano\",D105,IF('1. Autorización'!$I$6=\"Sur\",F105,IF('1. Autorización'!$I$6=\"Colegio Americano del Sur\",H105,B105))))","v":1330000}]
["DIRECCION GENERAL DE ADMINISTRACION DE PROYECTOS",1371400,null,null,null,null,null,null,{"$f":"IF(IF('1. Autorización'!$I$6=\"Altiplano\",C106,IF('1. Autorización'!$I$6=\"Sur\",E106,IF('1. Autorización'!$I$6=\"Colegio Americano del Sur\",G106,A106)))=0,\"\",IF('1. Autorización'!$I$6=\"Altiplano\",C106,IF('1. Autorización'!$I$6=\"Sur\",E106,IF('1. Autorización'!$I$6=\"Colegio Americano del Sur\",G106,A106))))","v":"DIRECCION GENERAL DE ADMINISTRACION DE PROYECTOS"},{"$f":"IF(IF('1. Autorización'!$I$6=\"Altiplano\",D106,IF('1. Autorización'!$I$6=\"Sur\",F106,IF('1. Autorización'!$I$6=\"Colegio Americano del Sur\",H106,B106)))=0,\"\",IF('1. Autorización'!$I$6=\"Altiplano\",D106,IF('1. Autorización'!$I$6=\"Sur\",F106,IF('1. Autorización'!$I$6=\"Colegio Americano del Sur\",H106,B106))))","v":1371400}]
["DIRECCION GENERAL DE COMUNICACION",1372100,null,null,null,null,null,null,{"$f":"IF(IF('1. Autorización'!$I$6=\"Altiplano\",C107,IF('1. Autorización'!$I$6=\"Sur\",E107,IF('1. Autorización'!$I$6=\"Colegio Americano del Sur\",G107,A107)))=0,\"\",IF('1. Autorización'!$I$6=\"Altiplano\",C107,IF('1. Autorización'!$I$6=\"Sur\",E107,IF('1. Autorización'!$I$6=\"Colegio Americano del Sur\",G107,A107))))","v":"DIRECCION GENERAL DE COMUNICACION"},{"$f":"IF(IF('1. Autorización'!$I$6=\"Altiplano\",D107,IF('1. Autorización'!$I$6=\"Sur\",F107,IF('1. Autorización'!$I$6=\"Colegio Americano del Sur\",H107,B107)))=0,\"\",IF('1. Autorización'!$I$6=\"Altiplano\",D107,IF('1. Autorización'!$I$6=\"Sur\",F107,IF('1. Autorización'!$I$6=\"Colegio Americano del Sur\",H107,B107))))","v":1372100}]
["DIRECCION GENERAL DE FINANZAS",1340000,null,null,null,null,null,null,{"$f":"IF(IF('1. Autorización'!$I$6=\"Altiplano\",C108,IF('1. Autorización'!$I$6=\"Sur\",E108,IF('1. Autorización'!$I$6=\"Colegio Americano del Sur\",G108,A108)))=0,\"\",IF('1. Autorización'!$I$6=\"Altiplano\",C108,IF('1. Autorización'!$I$6=\"Sur\",E108,IF('1. Autorización'!$I$6=\"Colegio Americano del Sur\",G108,A108))))","v":"DIRECCION GENERAL DE FINANZAS"},{"$f":"IF(IF('1. Autorización'!$I$6=\"Altiplano\",D108,IF('1. Autorización'!$I$6=\"Sur\",F108,IF('1. Autorización'!$I$6=\"Colegio Americano del Sur\",H108,B108)))=0,\"\",IF('1. Autorización'!$I$6=\"Altiplano\",D108,IF('1. Autorización'!$I$6=\"Sur\",F108,IF('1. Autorización'!$I$6=\"Colegio Americano del Sur\",H108,B108))))","v":1340000}]
["DIRECCION INGENIERIA CIVIL",1470100,null,null,null,null,null,null,{"$f":"IF(IF('1. Autorización'!$I$6=\"Altiplano\",C109,IF('1. Autorización'!$I$6=\"Sur\",E109,IF('1. Autorización'!$I$6=\"Colegio Americano del Sur\",G109,A109)))=0,\"\",IF('1. Autorización'!$I$6=\"Altiplano\",C109,IF('1. Autorización'!$I$6=\"Sur\",E109,IF('1. Autorización'!$I$6=\"Colegio Americano del Sur\",G109,A109))))","v":"DIRECCION INGENIERIA CIVIL"},{"$f":"IF(IF('1. Autorización'!$I$6=\"Altiplano\",D109,IF('1. Autorización'!$I$6=\"Sur\",F109,IF('1. Autorización'!$I$6=\"Colegio Americano del Sur\",H109,B109)))=0,\"\",IF('1. Autorización'!$I$6=\"Altiplano\",D109,IF('1. Autorización'!$I$6=\"Sur\",F109,IF('1. Autorización'!$I$6=\"Colegio Americano del Sur\",H109,B109))))","v":1470100}]
["DIRECCION INGENIERIA ELECTRONICA",1470600,null,null,null,null,null,null,{"$f":"IF(IF('1. Autorización'!$I$6=\"Altiplano\",C110,IF('1. Autorización'!$I$6=\"Sur\",E110,IF('1. Autorización'!$I$6=\"Colegio Americano del Sur\",G110,A110)))=0,\"\",IF('1. Autorización'!$I$6=\"Altiplano\",C110,IF('1. Autorización'!$I$6=\"Sur\",E110,IF('1. Autorización'!$I$6=\"Colegio Americano del Sur\",G110,A110))))","v":"DIRECCION INGENIERIA ELECTRONICA"},{"$f":"IF(IF('1. Autorización'!$I$6=\"Altiplano\",D110,IF('1. Autorización'!$I$6=\"Sur\",F110,IF('1. Autorización'!$I$6=\"Colegio Americano del Sur\",H110,B110)))=0,\"\",IF('1. Autorización'!$I$6=\"Altiplano\",D110,IF('1. Autorización'!$I$6=\"Sur\",F110,IF('1. Autorización'!$I$6=\"Colegio Americano del Sur\",H110,B110))))","v":1470600}]
["DIRECCION INGENIERIA EN CIENCIAS DE ALIMENTOS",1470500,null,null,null,null,null,null,{"$f":"IF(IF('1. Autorización'!$I$6=\"Altiplano\",C111,IF('1. Autorización'!$I$6=\"Sur\",E111,IF('1. Autorización'!$I$6=\"Colegio Americano del Sur\",G111,A111)))=0,\"\",IF('1. Autorización'!$I$6=\"Altiplano\",C111,IF('1. Autorización'!$I$6=\"Sur\",E111,IF('1. Autorización'!$I$6=\"Colegio Americano del Sur\",G111,A111))))","v":"DIRECCION INGENIERIA EN CIENCIAS DE ALIMENTOS"},{"$f":"IF(IF('1. Autorización'!$I$6=\"Altiplano\",D111,IF('1. Autorización'!$I$6=\"Sur\",F111,IF('1. Autorización'!$I$6=\"Colegio Americano del Sur\",H111,B111)))=0,\"\",IF('1. Autorización'!$I$6=\"Altiplano\",D111,IF('1. Autorización'!$I$6=\"Sur\",F111,IF('1. Autorización'!$I$6=\"Colegio Americano del Sur\",H111,B111))))","v":1470500}]
["DIRECCION INGENIERIA EN CIENCIAS DE LA COMPUTACION",1470200,null,null,null,null,null,null,{"$f":"IF(IF('1. Autorización'!$I$6=\"Altiplano\",C112,IF('1. Autorización'!$I$6=\"Sur\",E112,IF('1. Autorización'!$I$6=\"Colegio Americano del Sur\",G112,A112)))=0,\"\",IF('1. Autorización'!$I$6=\"Altiplano\",C112,IF('1. Autorización'!$I$6=\"Sur\",E112,IF('1. Autorización'!$I$6=\"Colegio Americano del Sur\",G112,A112))))","v":"DIRECCION INGENIERIA EN CIENCIAS DE LA COMPUTACION"},{"$f":"IF(IF('1. Autorización'!$I$6=\"Altiplano\",D112,IF('1. Autorización'!$I$6=\"Sur\",F112,IF('1. Autorización'!$I$6=\"Colegio Americano del Sur\",H112,B112)))=0,\"\",IF('1. Autorización'!$I$6=\"Altiplano\",D112,IF('1. Autorización'!$I$6=\"Sur\",F112,IF('1. Autorización'!$I$6=\"Colegio Americano del Sur\",H112,B112))))","v":1470200}]
["DIRECCION INGENIERIA INDUSTRIAL",1470700,null,null,null,null,null,null,{"$f":"IF(IF('1. Autorización'!$I$6=\"Altiplano\",C113,IF('1. Autorización'!$I$6=\"Sur\",E113,IF('1. Autorización'!$I$6=\"Colegio Americano del Sur\",G113,A113)))=0,\"\",IF('1. Autorización'!$I$6=\"Altiplano\",C113,IF('1. Autorización'!$I$6=\"Sur\",E113,IF('1. Autorización'!$I$6=\"Colegio Americano del Sur\",G113,A113))))","v":"DIRECCION INGENIERIA INDUSTRIAL"},{"$f":"IF(IF('1. Autorización'!$I$6=\"Altiplano\",D113,IF('1. Autorización'!$I$6=\"Sur\",F113,IF('1. Autorización'!$I$6=\"Colegio Americano del Sur\",H113,B113)))=0,\"\",IF('1. Autorización'!$I$6=\"Altiplano\",D113,IF('1. Autorización'!$I$6=\"Sur\",F113,IF('1. Autorización'!$I$6=\"Colegio Americano del Sur\",H113,B113))))","v":1470700}]
["DIRECCION INGENIERIA MECANICA",1470300,null,null,null,null,null,null,{"$f":"IF(IF('1. Autorización'!$I$6=\"Altiplano\",C114,IF('1. Autorización'!$I$6=\"Sur\",E114,IF('1. Autorización'!$I$6=\"Colegio Americano del Sur\",G114,A114)))=0,\"\",IF('1. Autorización'!$I$6=\"Altiplano\",C114,IF('1. Autorización'!$I$6=\"Sur\",E114,IF('1. Autorización'!$I$6=\"Colegio Americano del Sur\",G114,A114))))","v":"DIRECCION INGENIERIA MECANICA"},{"$f":"IF(IF('1. Autorización'!$I$6=\"Altiplano\",D114,IF('1. Autorización'!$I$6=\"Sur\",F114,IF('1. Autorización'!$I$6=\"Colegio Americano del Sur\",H114,B114)))=0,\"\",IF('1. Autorización'!$I$6=\"Altiplano\",D114,IF('1. Autorización'!$I$6=\"Sur\",F114,IF('1. Autorización'!$I$6=\"Colegio Americano del Sur\",H114,B114))))","v":1470300}]
["DIRECCION INGENIERIA QUIMICA",1470400,null,null,null,null,null,null,{"$f":"IF(IF('1. Autorización'!$I$6=\"Altiplano\",C115,IF('1. Autorización'!$I$6=\"Sur\",E115,IF('1. Autorización'!$I$6=\"Colegio Americano del Sur\",G115,A115)))=0,\"\",IF('1. Autorización'!$I$6=\"Altiplano\",C115,IF('1. Autorización'!$I$6=\"Sur\",E115,IF('1. Autorización'!$I$6=\"Colegio Americano del Sur\",G115,A115))))","v":"DIRECCION INGENIERIA QUIMICA"},{"$f":"IF(IF('1. Autorización'!$I$6=\"Altiplano\",D115,IF('1. Autorización'!$I$6=\"Sur\",F115,IF('1. Autorización'!$I$6=\"Colegio Americano del Sur\",H115,B115)))=0,\"\",IF('1. Autorización'!$I$6=\"Altiplano\",D115,IF('1. Autorización'!$I$6=\"Sur\",F115,IF('1. Autorización'!$I$6=\"Colegio Americano del Sur\",H115,B115))))","v":1470400}]
["DOCTORADO EN PSICOLOGIA APLICADA",1411500,null,null,null,null,null,null,{"$f":"IF(IF('1. Autorización'!$I$6=\"Altiplano\",C116,IF('1. Autorización'!$I$6=\"Sur\",E116,IF('1. Autorización'!$I$6=\"Colegio Americano del Sur\",G116,A116)))=0,\"\",IF('1. Autorización'!$I$6=\"Altiplano\",C116,IF('1. Autorización'!$I$6=\"Sur\",E116,IF('1. Autorización'!$I$6=\"Colegio Americano del Sur\",G116,A116))))","v":"DOCTORADO EN PSICOLOGIA APLICADA"},{"$f":"IF(IF('1. Autorización'!$I$6=\"Altiplano\",D116,IF('1. Autorización'!$I$6=\"Sur\",F116,IF('1. Autorización'!$I$6=\"Colegio Americano del Sur\",H116,B116)))=0,\"\",IF('1. Autorización'!$I$6=\"Altiplano\",D116,IF('1. Autorización'!$I$6=\"Sur\",F116,IF('1. Autorización'!$I$6=\"Colegio Americano del Sur\",H116,B116))))","v":1411500}]
["EDUCACION CEA",1432202,null,null,null,null,null,null,{"$f":"IF(IF('1. Autorización'!$I$6=\"Altiplano\",C117,IF('1. Autorización'!$I$6=\"Sur\",E117,IF('1. Autorización'!$I$6=\"Colegio Americano del Sur\",G117,A117)))=0,\"\",IF('1. Autorización'!$I$6=\"Altiplano\",C117,IF('1. Autorización'!$I$6=\"Sur\",E117,IF('1. Autorización'!$I$6=\"Colegio Americano del Sur\",G117,A117))))","v":"EDUCACION CEA"},{"$f":"IF(IF('1. Autorización'!$I$6=\"Altiplano\",D117,IF('1. Autorización'!$I$6=\"Sur\",F117,IF('1. Autorización'!$I$6=\"Colegio Americano del Sur\",H117,B117)))=0,\"\",IF('1. Autorización'!$I$6=\"Altiplano\",D117,IF('1. Autorización'!$I$6=\"Sur\",F117,IF('1. Autorización'!$I$6=\"Colegio Americano del Sur\",H117,B117))))","v":1432202}]
["EDUCACION ESPECIAL (EDUCON)",8040100,null,null,null,null,null,null,{"$f":"IF(IF('1. Autorización'!$I$6=\"Altiplano\",C118,IF('1. Autorización'!$I$6=\"Sur\",E118,IF('1. Autorización'!$I$6=\"Colegio Americano del Sur\",G118,A118)))=0,\"\",IF('1. Autorización'!$I$6=\"Altiplano\",C118,IF('1. Autorización'!$I$6=\"Sur\",E118,IF('1. Autorización'!$I$6=\"Colegio Americano del Sur\",G118,A118))))","v":"EDUCACION ESPECIAL (EDUCON)"},{"$f":"IF(IF('1. Autorización'!$I$6=\"Altiplano\",D118,IF('1. Autorización'!$I$6=\"Sur\",F118,IF('1. Autorización'!$I$6=\"Colegio Americano del Sur\",H118,B118)))=0,\"\",IF('1. Autorización'!$I$6=\"Altiplano\",D118,IF('1. Autorización'!$I$6=\"Sur\",F118,IF('1. Autorización'!$I$6=\"Colegio Americano del Sur\",H118,B118))))","v":8040100}]
["EDUCON",8000000,null,null,null,null,null,null,{"$f":"IF(IF('1. Autorización'!$I$6=\"Altiplano\",C119,IF('1. Autorización'!$I$6=\"Sur\",E119,IF('1. Autorización'!$I$6=\"Colegio Americano del Sur\",G119,A119)))=0,\"\",IF('1. Autorización'!$I$6=\"Altiplano\",C119,IF('1. Autorización'!$I$6=\"Sur\",E119,IF('1. Autorización'!$I$6=\"Colegio Americano del Sur\",G119,A119))))","v":"EDUCON"},{"$f":"IF(IF('1. Autorización'!$I$6=\"Altiplano\",D119,IF('1. Autorización'!$I$6=\"Sur\",F119,IF('1. Autorización'!$I$6=\"Colegio Americano del Sur\",H119,B119)))=0,\"\",IF('1. Autorización'!$I$6=\"Altiplano\",D119,IF('1. Autorización'!$I$6=\"Sur\",F119,IF('1. Autorización'!$I$6=\"Colegio Americano del Sur\",H119,B119))))","v":8000000}]
["ESTACION EXPERIMENTAL DE CAMPO",1400141,null,null,null,null,null,null,{"$f":"IF(IF('1. Autorización'!$I$6=\"Altiplano\",C120,IF('1. Autorización'!$I$6=\"Sur\",E120,IF('1. Autorización'!$I$6=\"Colegio Americano del Sur\",G120,A120)))=0,\"\",IF('1. Autorización'!$I$6=\"Altiplano\",C120,IF('1. Autorización'!$I$6=\"Sur\",E120,IF('1. Autorización'!$I$6=\"Colegio Americano del Sur\",G120,A120))))","v":"ESTACION EXPERIMENTAL DE CAMPO"},{"$f":"IF(IF('1. Autorización'!$I$6=\"Altiplano\",D120,IF('1. Autorización'!$I$6=\"Sur\",F120,IF('1. Autorización'!$I$6=\"Colegio Americano del Sur\",H120,B120)))=0,\"\",IF('1. Autorización'!$I$6=\"Altiplano\",D120,IF('1. Autorización'!$I$6=\"Sur\",F120,IF('1. Autorización'!$I$6=\"Colegio Americano del Sur\",H120,B120))))","v":1400141}]
["FACULTAD DE CIENCIAS SOCIALES (EDUCON)",8020000,null,null,null,null,null,null,{"$f":"IF(IF('1. Autorización'!$I$6=\"Altiplano\",C121,IF('1. Autorización'!$I$6=\"Sur\",E121,IF('1. Autorización'!$I$6=\"Colegio Americano del Sur\",G121,A121)))=0,\"\",IF('1. Autorización'!$I$6=\"Altiplano\",C121,IF('1. Autorización'!$I$6=\"Sur\",E121,IF('1. Autorización'!$I$6=\"Colegio Americano del Sur\",G121,A121))))","v":"FACULTAD DE CIENCIAS SOCIALES (EDUCON)"},{"$f":"IF(IF('1. Autorización'!$I$6=\"Altiplano\",D121,IF('1. Autorización'!$I$6=\"Sur\",F121,IF('1. Autorización'!$I$6=\"Colegio Americano del Sur\",H121,B121)))=0,\"\",IF('1. Autorización'!$I$6=\"Altiplano\",D121,IF('1. Autorización'!$I$6=\"Sur\",F121,IF('1. Autorización'!$I$6=\"Colegio Americano del Sur\",H121,B121))))","v":8020000}]
["FACULTAD DE CIENCIAS Y HUMANIDADES (EDUCON)",8030000,null,null,null,null,null,null,{"$f":"IF(IF('1. Autorización'!$I$6=\"Altiplano\",C122,IF('1. Autorización'!$I$6=\"Sur\",E122,IF('1. Autorización'!$I$6=\"Colegio Americano del Sur\",G122,A122)))=0,\"\",IF('1. Autorización'!$I$6=\"Altiplano\",C122,IF('1. Autorización'!$I$6=\"Sur\",E122,IF('1. Autorización'!$I$6=\"Colegio Americano del Sur\",G122,A122))))","v":"FACULTAD DE CIENCIAS Y HUMANIDADES (EDUCON)"},{"$f":"IF(IF('1. Autorización'!$I$6=\"Altiplano\",D122,IF('1. Autorización'!$I$6=\"Sur\",F122,IF('1. Autorización'!$I$6=\"Colegio Americano del Sur\",H122,B122)))=0,\"\",IF('1. Autorización'!$I$6=\"Altiplano\",D122,IF('1. Autorización'!$I$6=\"Sur\",F122,IF('1. Autorización'!$I$6=\"Colegio Americano del Sur\",H122,B122))))","v":8030000}]
["FACULTAD DE EDUCACION (EDUCON)",8040000,null,null,null,null,null,null,{"$f":"IF(IF('1. Autorización'!$I$6=\"Altiplano\",C123,IF('1. Autorización'!$I$6=\"Sur\",E123,IF('1. Autorización'!$I$6=\"Colegio Americano del Sur\",G123,A123)))=0,\"\",IF('1. Autorización'!$I$6=\"Altiplano\",C123,IF('1. Autorización'!$I$6=\"Sur\",E123,IF('1. Autorización'!$I$6=\"Colegio Americano del Sur\",G123,A123))))","v":"FACULTAD DE EDUCACION (EDUCON)"},{"$f":"IF(IF('1. Autorización'!$I$6=\"Altiplano\",D123,IF('1. Autorización'!$I$6=\"Sur\",F123,IF('1. Autorización'!$I$6=\"Colegio Americano del Sur\",H123,B123)))=0,\"\",IF('1. Autorización'!$I$6=\"Altiplano\",D123,IF('1. Autorización'!$I$6=\"Sur\",F123,IF('1. Autorización'!$I$6=\"Colegio Americano del Sur\",H123,B123))))","v":8040000}]
["FACULTAD DE INGENIERIA (EDUCON)",8010000,null,null,null,null,null,null,{"$f":"IF(IF('1. Autorización'!$I$6=\"Altiplano\",C124,IF('1. Autorización'!$I$6=\"Sur\",E124,IF('1. Autorización'!$I$6=\"Colegio Americano del Sur\",G124,A124)))=0,\"\",IF('1. Autorización'!$I$6=\"Altiplano\",C124,IF('1. Autorización'!$I$6=\"Sur\",E124,IF('1. Autorización'!$I$6=\"Colegio Americano del Sur\",G124,A124))))","v":"FACULTAD DE INGENIERIA (EDUCON)"},{"$f":"IF(IF('1. Autorización'!$I$6=\"Altiplano\",D124,IF('1. Autorización'!$I$6=\"Sur\",F124,IF('1. Autorización'!$I$6=\"Colegio Americano del Sur\",H124,B124)))=0,\"\",IF('1. Autorización'!$I$6=\"Altiplano\",D124,IF('1. Autorización'!$I$6=\"Sur\",F124,IF('1. Autorización'!$I$6=\"Colegio Americano del Sur\",H124,B124))))","v":8010000}]
["FONDO DE INDEMNIZACIONES ADMINISTRATIVO",1450200,null,null,null,null,null,null,{"$f":"IF(IF('1. Autorización'!$I$6=\"Altiplano\",C125,IF('1. Autorización'!$I$6=\"Sur\",E125,IF('1. Autorización'!$I$6=\"Colegio Americano del Sur\",G125,A125)))=0,\"\",IF('1. Autorización'!$I$6=\"Altiplano\",C125,IF('1. Autorización'!$I$6=\"Sur\",E125,IF('1. Autorización'!$I$6=\"Colegio Americano del Sur\",G125,A125))))","v":"FONDO DE INDEMNIZACIONES ADMINISTRATIVO"},{"$f":"IF(IF('1. Autorización'!$I$6=\"Altiplano\",D125,IF('1. Autorización'!$I$6=\"Sur\",F125,IF('1. Autorización'!$I$6=\"Colegio Americano del Sur\",H125,B125)))=0,\"\",IF('1. Autorización'!$I$6=\"Altiplano\",D125,IF('1. Autorización'!$I$6=\"Sur\",F125,IF('1. Autorización'!$I$6=\"Colegio Americano del Sur\",H125,B125))))","v":1450200}]
["FONDO DE INDEMNIZACIONES EDUCATIVO",1450100,null,null,null,null,null,null,{"$f":"IF(IF('1. Autorización'!$I$6=\"Altiplano\",C126,IF('1. Autorización'!$I$6=\"Sur\",E126,IF('1. Autorización'!$I$6=\"Colegio Americano del Sur\",G126,A126)))=0,\"\",IF('1. Autorización'!$I$6=\"Altiplano\",C126,IF('1. Autorización'!$I$6=\"Sur\",E126,IF('1. Autorización'!$I$6=\"Colegio Americano del Sur\",G126,A126))))","v":"FONDO DE INDEMNIZACIONES EDUCATIVO"},{"$f":"IF(IF('1. Autorización'!$I$6=\"Altiplano\",D126,IF('1. Autorización'!$I$6=\"Sur\",F126,IF('1. Autorización'!$I$6=\"Colegio Americano del Sur\",H126,B126)))=0,\"\",IF('1. Autorización'!$I$6=\"Altiplano\",D126,IF('1. Autorización'!$I$6=\"Sur\",F126,IF('1. Autorización'!$I$6=\"Colegio Americano del Sur\",H126,B126))))","v":1450100}]
["FONDO DE INDEMNIZACIONES OPERATIVO",1450300,null,null,null,null,null,null,{"$f":"IF(IF('1. Autorización'!$I$6=\"Altiplano\",C127,IF('1. Autorización'!$I$6=\"Sur\",E127,IF('1. Autorización'!$I$6=\"Colegio Americano del Sur\",G127,A127)))=0,\"\",IF('1. Autorización'!$I$6=\"Altiplano\",C127,IF('1. Autorización'!$I$6=\"Sur\",E127,IF('1. Autorización'!$I$6=\"Colegio Americano del Sur\",G127,A127))))","v":"FONDO DE INDEMNIZACIONES OPERATIVO"},{"$f":"IF(IF('1. Autorización'!$I$6=\"Altiplano\",D127,IF('1. Autorización'!$I$6=\"Sur\",F127,IF('1. Autorización'!$I$6=\"Colegio Americano del Sur\",H127,B127)))=0,\"\",IF('1. Autorización'!$I$6=\"Altiplano\",D127,IF('1. Autorización'!$I$6=\"Sur\",F127,IF('1. Autorización'!$I$6=\"Colegio Americano del Sur\",H127,B127))))","v":1450300}]
["GESTION DE COBROS",1340601,null,null,null,null,null,null,{"$f":"IF(IF('1. Autorización'!$I$6=\"Altiplano\",C128,IF('1. Autorización'!$I$6=\"Sur\",E128,IF('1. Autorización'!$I$6=\"Colegio Americano del Sur\",G128,A128)))=0,\"\",IF('1. Autorización'!$I$6=\"Altiplano\",C128,IF('1. Autorización'!$I$6=\"Sur\",E128,IF('1. Autorización'!$I$6=\"Colegio Americano del Sur\",G128,A128))))","v":"GESTION DE COBROS"},{"$f":"IF(IF('1. Autorización'!$I$6=\"Altiplano\",D128,IF('1. Autorización'!$I$6=\"Sur\",F128,IF('1. Autorización'!$I$6=\"Colegio Americano del Sur\",H128,B128)))=0,\"\",IF('1. Autorización'!$I$6=\"Altiplano\",D128,IF('1. Autorización'!$I$6=\"Sur\",F128,IF('1. Autorización'!$I$6=\"Colegio Americano del Sur\",H128,B128))))","v":1340601}]
["HERBARIO",1430802,null,null,null,null,null,null,{"$f":"IF(IF('1. Autorización'!$I$6=\"Altiplano\",C129,IF('1. Autorización'!$I$6=\"Sur\",E129,IF('1. Autorización'!$I$6=\"Colegio Americano del Sur\",G129,A129)))=0,\"\",IF('1. Autorización'!$I$6=\"Altiplano\",C129,IF('1. Autorización'!$I$6=\"Sur\",E129,IF('1. Autorización'!$I$6=\"Colegio Americano del Sur\",G129,A129))))","v":"HERBARIO"},{"$f":"IF(IF('1. Autorización'!$I$6=\"Altiplano\",D129,IF('1. Autorización'!$I$6=\"Sur\",F129,IF('1. Autorización'!$I$6=\"Colegio Americano del Sur\",H129,B129)))=0,\"\",IF('1. Autorización'!$I$6=\"Altiplano\",D129,IF('1. Autorización'!$I$6=\"Sur\",F129,IF('1. Autorización'!$I$6=\"Colegio Americano del Sur\",H129,B129))))","v":1430802}]
["HERENCIAS UVG",1330700,null,null,null,null,null,null,{"$f":"IF(IF('1. Autorización'!$I$6=\"Altiplano\",C130,IF('1. Autorización'!$I$6=\"Sur\",E130,IF('1. Autorización'!$I$6=\"Colegio Americano del Sur\",G130,A130)))=0,\"\",IF('1. Autorización'!$I$6=\"Altiplano\",C130,IF('1. Autorización'!$I$6=\"Sur\",E130,IF('1. Autorización'!$I$6=\"Colegio Americano del Sur\",G130,A130))))","v":"HERENCIAS UVG"},{"$f":"IF(IF('1. Autorización'!$I$6=\"Altiplano\",D130,IF('1. Autorización'!$I$6=\"Sur\",F130,IF('1. Autorización'!$I$6=\"Colegio Americano del Sur\",H130,B130)))=0,\"\",IF('1. Autorización'!$I$6=\"Altiplano\",D130,IF('1. Autorización'!$I$6=\"Sur\",F130,IF('1. Autorización'!$I$6=\"Colegio Americano del Sur\",H130,B130))))","v":1330700}]
["INFORMACION Y RECEPCION",1350600,null,null,null,null,null,null,{"$f":"IF(IF('1. Autorización'!$I$6=\"Altiplano\",C131,IF('1. Autorización'!$I$6=\"Sur\",E131,IF('1. Autorización'!$I$6=\"Colegio Americano del Sur\",G131,A131)))=0,\"\",IF('1. Autorización'!$I$6=\"Altiplano\",C131,IF('1. Autorización'!$I$6=\"Sur\",E131,IF('1. Autorización'!$I$6=\"Colegio Americano del Sur\",G131,A131))))","v":"INFORMACION Y RECEPCION"},{"$f":"IF(IF('1. Autorización'!$I$6=\"Altiplano\",D131,IF('1. Autorización'!$I$6=\"Sur\",F131,IF('1. Autorización'!$I$6=\"Colegio Americano del Sur\",H131,B131)))=0,\"\",IF('1. Autorización'!$I$6=\"Altiplano\",D131,IF('1. Autorización'!$I$6=\"Sur\",F131,IF('1. Autorización'!$I$6=\"Colegio Americano del Sur\",H131,B131))))","v":1350600}]
["INGENIERIA CIVIL (EDUCON)",8010200,null,null,null,null,null,null,{"$f":"IF(IF('1. Autorización'!$I$6=\"Altiplano\",C132,IF('1. Autorización'!$I$6=\"Sur\",E132,IF('1. Autorización'!$I$6=\"Colegio Americano del Sur\",G132,A132)))=0,\"\",IF('1. Autorización'!$I$6=\"Altiplano\",C132,IF('1. Autorización'!$I$6=\"Sur\",E132,IF('1. Autorización'!$I$6=\"Colegio Americano del Sur\",G132,A132))))","v":"INGENIERIA CIVIL (EDUCON)"},{"$f":"IF(IF('1. Autorización'!$I$6=\"Altiplano\",D132,IF('1. Autorización'!$I$6=\"Sur\",F132,IF('1. Autorización'!$I$6=\"Colegio Americano del Sur\",H132,B132)))=0,\"\",IF('1. Autorización'!$I$6=\"Altiplano\",D132,IF('1. Autorización'!$I$6=\"Sur\",F132,IF('1. Autorización'!$I$6=\"Colegio Americano del Sur\",H132,B132))))","v":8010200}]
["INGENIERIA EN CIENCIAS DE ALIMENTOS (EDUCON)",8010100,null,null,null,null,null,null,{"$f":"IF(IF('1. Autorización'!$I$6=\"Altiplano\",C133,IF('1. Autorización'!$I$6=\"Sur\",E133,IF('1. Autorización'!$I$6=\"Colegio Americano del Sur\",G133,A133)))=0,\"\",IF('1. Autorización'!$I$6=\"Altiplano\",C133,IF('1. Autorización'!$I$6=\"Sur\",E133,IF('1. Autorización'!$I$6=\"Colegio Americano del Sur\",G133,A133))))","v":"INGENIERIA EN CIENCIAS DE ALIMENTOS (EDUCON)"},{"$f":"IF(IF('1. Autorización'!$I$6=\"Altiplano\",D133,IF('1. Autorización'!$I$6=\"Sur\",F133,IF('1. Autorización'!$I$6=\"Colegio Americano del Sur\",H133,B133)))=0,\"\",IF('1. Autorización'!$I$6=\"Altiplano\",D133,IF('1. Autorización'!$I$6=\"Sur\",F133,IF('1. Autorización'!$I$6=\"Colegio Americano del Sur\",H133,B133))))","v":8010100}]
["INGENIERIA EN CIENCIAS DE LA COMPU Y TI (EDUCON)",8010600,null,null,null,null,null,null,{"$f":"IF(IF('1. Autorización'!$I$6=\"Altiplano\",C134,IF('1. Autorización'!$I$6=\"Sur\",E134,IF('1. Autorización'!$I$6=\"Colegio Americano del Sur\",G134,A134)))=0,\"\",IF('1. Autorización'!$I$6=\"Altiplano\",C134,IF('1. Autorización'!$I$6=\"Sur\",E134,IF('1. Autorización'!$I$6=\"Colegio Americano del Sur\",G134,A134))))","v":"INGENIERIA EN CIENCIAS DE LA COMPU Y TI (EDUCON)"},{"$f":"IF(IF('1. Autorización'!$I$6=\"Altiplano\",D134,IF('1. Autorización'!$I$6=\"Sur\",F134,IF('1. Autorización'!$I$6=\"Colegio Americano del Sur\",H134,B134)))=0,\"\",IF('1. Autorización'!$I$6=\"Altiplano\",D134,IF('1. Autorización'!$I$6=\"Sur\",F134,IF('1. Autorización'!$I$6=\"Colegio Americano del Sur\",H134,B134))))","v":8010600}]
["INGENIERIA INDUSTRIAL (EDUCON)",8010400,null,null,null,null,null,null,{"$f":"IF(IF('1. Autorización'!$I$6=\"Altiplano\",C135,IF('1. Autorización'!$I$6=\"Sur\",E135,IF('1. Autorización'!$I$6=\"Colegio Americano del Sur\",G135,A135)))=0,\"\",IF('1. Autorización'!$I$6=\"Altiplano\",C135,IF('1. Autorización'!$I$6=\"Sur\",E135,IF('1. Autorización'!$I$6=\"Colegio Americano del Sur\",G135,A135))))","v":"INGENIERIA INDUSTRIAL (EDUCON)"},{"$f":"IF(IF('1. Autorización'!$I$6=\"Altiplano\",D135,IF('1. Autorización'!$I$6=\"Sur\",F135,IF('1. Autorización'!$I$6=\"Colegio Americano del Sur\",H135,B135)))=0,\"\",IF('1. Autorización'!$I$6=\"Altiplano\",D135,IF('1. Autorización'!$I$6=\"Sur\",F135,IF('1. Autorización'!$I$6=\"Colegio Americano del Sur\",H135,B135))))","v":8010400}]
["INGENIERIA MECANICA (EDUCON)",8010700,null,null,null,null,null,null,{"$f":"IF(IF('1. Autorización'!$I$6=\"Altiplano\",C136,IF('1. Autorización'!$I$6=\"Sur\",E136,IF('1. Autorización'!$I$6=\"Colegio Americano del Sur\",G136,A136)))=0,\"\",IF('1. Autorización'!$I$6=\"Altiplano\",C136,IF('1. Autorización'!$I$6=\"Sur\",E136,IF('1. Autorización'!$I$6=\"Colegio Americano del Sur\",G136,A136))))","v":"INGENIERIA MECANICA (EDUCON)"},{"$f":"IF(IF('1. Autorización'!$I$6=\"Altiplano\",D136,IF('1. Autorización'!$I$6=\"Sur\",F136,IF('1. Autorización'!$I$6=\"Colegio Americano del Sur\",H136,B136)))=0,\"\",IF('1. Autorización'!$I$6=\"Altiplano\",D136,IF('1. Autorización'!$I$6=\"Sur\",F136,IF('1. Autorización'!$I$6=\"Colegio Americano del Sur\",H136,B136))))","v":8010700}]
["INGENIERIA QUIMICA (EDUCON)",8010500,null,null,null,null,null,null,{"$f":"IF(IF('1. Autorización'!$I$6=\"Altiplano\",C137,IF('1. Autorización'!$I$6=\"Sur\",E137,IF('1. Autorización'!$I$6=\"Colegio Americano del Sur\",G137,A137)))=0,\"\",IF('1. Autorización'!$I$6=\"Altiplano\",C137,IF('1. Autorización'!$I$6=\"Sur\",E137,IF('1. Autorización'!$I$6=\"Colegio Americano del Sur\",G137,A137))))","v":"INGENIERIA QUIMICA (EDUCON)"},{"$f":"IF(IF('1. Autorización'!$I$6=\"Altiplano\",D137,IF('1. Autorización'!$I$6=\"Sur\",F137,IF('1. Autorización'!$I$6=\"Colegio Americano del Sur\",H137,B137)))=0,\"\",IF('1. Autorización'!$I$6=\"Altiplano\",D137,IF('1. Autorización'!$I$6=\"Sur\",F137,IF('1. Autorización'!$I$6=\"Colegio Americano del Sur\",H137,B137))))","v":8010500}]
["INGRESOS/GASTOS FINANC (DIF CAMBIARIO, COMISIONES)",1360400,null,null,null,null,null,null,{"$f":"IF(IF('1. Autorización'!$I$6=\"Altiplano\",C138,IF('1. Autorización'!$I$6=\"Sur\",E138,IF('1. Autorización'!$I$6=\"Colegio Americano del Sur\",G138,A138)))=0,\"\",IF('1. Autorización'!$I$6=\"Altiplano\",C138,IF('1. Autorización'!$I$6=\"Sur\",E138,IF('1. Autorización'!$I$6=\"Colegio Americano del Sur\",G138,A138))))","v":"INGRESOS/GASTOS FINANC (DIF CAMBIARIO, COMISIONES)"},{"$f":"IF(IF('1. Autorización'!$I$6=\"Altiplano\",D138,IF('1. Autorización'!$I$6=\"Sur\",F138,IF('1. Autorización'!$I$6=\"Colegio Americano del Sur\",H138,B138)))=0,\"\",IF('1. Autorización'!$I$6=\"Altiplano\",D138,IF('1. Autorización'!$I$6=\"Sur\",F138,IF('1. Autorización'!$I$6=\"Colegio Americano del Sur\",H138,B138))))","v":1360400}]
["INSTITUTO DE INVESTIGACIONES (EDUCON)",8060000,null,null,null,null,null,null,{"$f":"IF(IF('1. Autorización'!$I$6=\"Altiplano\",C139,IF('1. Autorización'!$I$6=\"Sur\",E139,IF('1. Autorización'!$I$6=\"Colegio Americano del Sur\",G139,A139)))=0,\"\",IF('1. Autorización'!$I$6=\"Altiplano\",C139,IF('1. Autorización'!$I$6=\"Sur\",E139,IF('1. Autorización'!$I$6=\"Colegio Americano del Sur\",G139,A139))))","v":"INSTITUTO DE INVESTIGACIONES (EDUCON)"},{"$f":"IF(IF('1. Autorización'!$I$6=\"Altiplano\",D139,IF('1. Autorización'!$I$6=\"Sur\",F139,IF('1. Autorización'!$I$6=\"Colegio Americano del Sur\",H139,B139)))=0,\"\",IF('1. Autorización'!$I$6=\"Altiplano\",D139,IF('1. Autorización'!$I$6=\"Sur\",F139,IF('1. Autorización'!$I$6=\"Colegio Americano del Sur\",H139,B139))))","v":8060000}]
["INTERNET II",1430602,null,null,null,null,null,null,{"$f":"IF(IF('1. Autorización'!$I$6=\"Altiplano\",C140,IF('1. Autorización'!$I$6=\"Sur\",E140,IF('1. Autorización'!$I$6=\"Colegio Americano del Sur\",G140,A140)))=0,\"\",IF('1. Autorización'!$I$6=\"Altiplano\",C140,IF('1. Autorización'!$I$6=\"Sur\",E140,IF('1. Autorización'!$I$6=\"Colegio Americano del Sur\",G140,A140))))","v":"INTERNET II"},{"$f":"IF(IF('1. Autorización'!$I$6=\"Altiplano\",D140,IF('1. Autorización'!$I$6=\"Sur\",F140,IF('1. Autorización'!$I$6=\"Colegio Americano del Sur\",H140,B140)))=0,\"\",IF('1. Autorización'!$I$6=\"Altiplano\",D140,IF('1. Autorización'!$I$6=\"Sur\",F140,IF('1. Autorización'!$I$6=\"Colegio Americano del Sur\",H140,B140))))","v":1430602}]
["INVENTARIOS",1330500,null,null,null,null,null,null,{"$f":"IF(IF('1. Autorización'!$I$6=\"Altiplano\",C141,IF('1. Autorización'!$I$6=\"Sur\",E141,IF('1. Autorización'!$I$6=\"Colegio Americano del Sur\",G141,A141)))=0,\"\",IF('1. Autorización'!$I$6=\"Altiplano\",C141,IF('1. Autorización'!$I$6=\"Sur\",E141,IF('1. Autorización'!$I$6=\"Colegio Americano del Sur\",G141,A141))))","v":"INVENTARIOS"},{"$f":"IF(IF('1. Autorización'!$I$6=\"Altiplano\",D141,IF('1. Autorización'!$I$6=\"Sur\",F141,IF('1. Autorización'!$I$6=\"Colegio Americano del Sur\",H141,B141)))=0,\"\",IF('1. Autorización'!$I$6=\"Altiplano\",D141,IF('1. Autorización'!$I$6=\"Sur\",F141,IF('1. Autorización'!$I$6=\"Colegio Americano del Sur\",H141,B141))))","v":1330500}]
["LABORATORIO CEA",1432201,null,null,null,null,null,null,{"$f":"IF(IF('1. Autorización'!$I$6=\"Altiplano\",C142,IF('1. Autorización'!$I$6=\"Sur\",E142,IF('1. Autorización'!$I$6=\"Colegio Americano del Sur\",G142,A142)))=0,\"\",IF('1. Autorización'!$I$6=\"Altiplano\",C142,IF('1. Autorización'!$I$6=\"Sur\",E142,IF('1. Autorización'!$I$6=\"Colegio Americano del Sur\",G142,A142))))","v":"LABORATORIO CEA"},{"$f":"IF(IF('1. Autorización'!$I$6=\"Altiplano\",D142,IF('1. Autorización'!$I$6=\"Sur\",F142,IF('1. Autorización'!$I$6=\"Colegio Americano del Sur\",H142,B142)))=0,\"\",IF('1. Autorización'!$I$6=\"Altiplano\",D142,IF('1. Autorización'!$I$6=\"Sur\",F142,IF('1. Autorización'!$I$6=\"Colegio Americano del Sur\",H142,B142))))","v":1432201}]
["LABORATORIO DE BIOLOGIA",1400140,null,null,null,null,null,null,{"$f":"IF(IF('1. Autorización'!$I$6=\"Altiplano\",C143,IF('1. Autorización'!$I$6=\"Sur\",E143,IF('1. Autorización'!$I$6=\"Colegio Americano del Sur\",G143,A143)))=0,\"\",IF('1. Autorización'!$I$6=\"Altiplano\",C143,IF('1. Autorización'!$I$6=\"Sur\",E143,IF('1. Autorización'!$I$6=\"Colegio Americano del Sur\",G143,A143))))","v":"LABORATORIO DE BIOLOGIA"},{"$f":"IF(IF('1. Autorización'!$I$6=\"Altiplano\",D143,IF('1. Autorización'!$I$6=\"Sur\",F143,IF('1. Autorización'!$I$6=\"Colegio Americano del Sur\",H143,B143)))=0,\"\",IF('1. Autorización'!$I$6=\"Altiplano\",D143,IF('1. Autorización'!$I$6=\"Sur\",F143,IF('1. Autorización'!$I$6=\"Colegio Americano del Sur\",H143,B143))))","v":1400140}]
["LABORATORIO DE BIOQUIMICA Y MICROBIOLOGIA",1400240,null,null,null,null,null,null,{"$f":"IF(IF('1. Autorización'!$I$6=\"Altiplano\",C144,IF('1. Autorización'!$I$6=\"Sur\",E144,IF('1. Autorización'!$I$6=\"Colegio Americano del Sur\",G144,A144)))=0,\"\",IF('1. Autorización'!$I$6=\"Altiplano\",C144,IF('1. Autorización'!$I$6=\"Sur\",E144,IF('1. Autorización'!$I$6=\"Colegio Americano del Sur\",G144,A144))))","v":"LABORATORIO DE BIOQUIMICA Y MICROBIOLOGIA"},{"$f":"IF(IF('1. Autorización'!$I$6=\"Altiplano\",D144,IF('1. Autorización'!$I$6=\"Sur\",F144,IF('1. Autorización'!$I$6=\"Colegio Americano del Sur\",H144,B144)))=0,\"\",IF('1. Autorización'!$I$6=\"Altiplano\",D144,IF('1. Autorización'!$I$6=\"Sur\",F144,IF('1. Autorización'!$I$6=\"Colegio Americano del Sur\",H144,B144))))","v":1400240}]
["LABORATORIO DE ENTOMOLOGIA APLICADA",1430401,null,null,null,null,null,null,{"$f":"IF(IF('1. Autorización'!$I$6=\"Altiplano\",C145,IF('1. Autorización'!$I$6=\"Sur\",E145,IF('1. Autorización'!$I$6=\"Colegio Americano del Sur\",G145,A145)))=0,\"\",IF('1. Autorización'!$I$6=\"Altiplano\",C145,IF('1. Autorización'!$I$6=\"Sur\",E145,IF('1. Autorización'!$I$6=\"Colegio Americano del Sur\",G145,A145))))","v":"LABORATORIO DE ENTOMOLOGIA APLICADA"},{"$f":"IF(IF('1. Autorización'!$I$6=\"Altiplano\",D145,IF('1. Autorización'!$I$6=\"Sur\",F145,IF('1. Autorización'!$I$6=\"Colegio Americano del Sur\",H145,B145)))=0,\"\",IF('1. Autorización'!$I$6=\"Altiplano\",D145,IF('1. Autorización'!$I$6=\"Sur\",F145,IF('1. Autorización'!$I$6=\"Colegio Americano del Sur\",H145,B145))))","v":1430401}]
["LABORATORIO DE ENTOMOLOGIA APLICADA (EDUCON)",8060200,null,null,null,null,null,null,{"$f":"IF(IF('1. Autorización'!$I$6=\"Altiplano\",C146,IF('1. Autorización'!$I$6=\"Sur\",E146,IF('1. Autorización'!$I$6=\"Colegio Americano del Sur\",G146,A146)))=0,\"\",IF('1. Autorización'!$I$6=\"Altiplano\",C146,IF('1. Autorización'!$I$6=\"Sur\",E146,IF('1. Autorización'!$I$6=\"Colegio Americano del Sur\",G146,A146))))","v":"LABORATORIO DE ENTOMOLOGIA APLICADA (EDUCON)"},{"$f":"IF(IF('1. Autorización'!$I$6=\"Altiplano\",D146,IF('1. Autorización'!$I$6=\"Sur\",F146,IF('1. Autorización'!$I$6=\"Colegio Americano del Sur\",H146,B146)))=0,\"\",IF('1. Autorización'!$I$6=\"Altiplano\",D146,IF('1. Autorización'!$I$6=\"Sur\",F146,IF('1. Autorización'!$I$6=\"Colegio Americano del Sur\",H146,B146))))","v":8060200}]
["LABORATORIO DE FISICA",1400640,null,null,null,null,null,null,{"$f":"IF(IF('1. Autorización'!$I$6=\"Altiplano\",C147,IF('1. Autorización'!$I$6=\"Sur\",E147,IF('1. Autorización'!$I$6=\"Colegio Americano del Sur\",G147,A147)))=0,\"\",IF('1. Autorización'!$I$6=\"Altiplano\",C147,IF('1. Autorización'!$I$6=\"Sur\",E147,IF('1. Autorización'!$I$6=\"Colegio Americano del Sur\",G147,A147))))","v":"LABORATORIO DE FISICA"},{"$f":"IF(IF('1. Autorización'!$I$6=\"Altiplano\",D147,IF('1. Autorización'!$I$6=\"Sur\",F147,IF('1. Autorización'!$I$6=\"Colegio Americano del Sur\",H147,B147)))=0,\"\",IF('1. Autorización'!$I$6=\"Altiplano\",D147,IF('1. Autorización'!$I$6=\"Sur\",F147,IF('1. Autorización'!$I$6=\"Colegio Americano del Sur\",H147,B147))))","v":1400640}]
["LABORATORIO DE PROTECCION VEGETAL",1430406,null,null,null,null,null,null,{"$f":"IF(IF('1. Autorización'!$I$6=\"Altiplano\",C148,IF('1. Autorización'!$I$6=\"Sur\",E148,IF('1. Autorización'!$I$6=\"Colegio Americano del Sur\",G148,A148)))=0,\"\",IF('1. Autorización'!$I$6=\"Altiplano\",C148,IF('1. Autorización'!$I$6=\"Sur\",E148,IF('1. Autorización'!$I$6=\"Colegio Americano del Sur\",G148,A148))))","v":"LABORATORIO DE PROTECCION VEGETAL"},{"$f":"IF(IF('1. Autorización'!$I$6=\"Altiplano\",D148,IF('1. Autorización'!$I$6=\"Sur\",F148,IF('1. Autorización'!$I$6=\"Colegio Americano del Sur\",H148,B148)))=0,\"\",IF('1. Autorización'!$I$6=\"Altiplano\",D148,IF('1. Autorización'!$I$6=\"Sur\",F148,IF('1. Autorización'!$I$6=\"Colegio Americano del Sur\",H148,B148))))","v":1430406}]
["LABORATORIO DE QUIMICA",1401740,null,null,null,null,null,null,{"$f":"IF(IF('1. Autorización'!$I$6=\"Altiplano\",C149,IF('1. Autorización'!$I$6=\"Sur\",E149,IF('1. Autorización'!$I$6=\"Colegio Americano del Sur\",G149,A149)))=0,\"\",IF('1. Autorización'!$I$6=\"Altiplano\",C149,IF('1. Autorización'!$I$6=\"Sur\",E149,IF('1. Autorización'!$I$6=\"Colegio Americano del Sur\",G149,A149))))","v":"LABORATORIO DE QUIMICA"},{"$f":"IF(IF('1. Autorización'!$I$6=\"Altiplano\",D149,IF('1. Autorización'!$I$6=\"Sur\",F149,IF('1. Autorización'!$I$6=\"Colegio Americano del Sur\",H149,B149)))=0,\"\",IF('1. Autorización'!$I$6=\"Altiplano\",D149,IF('1. Autorización'!$I$6=\"Sur\",F149,IF('1. Autorización'!$I$6=\"Colegio Americano del Sur\",H149,B149))))","v":1401740}]
["LABORATORIO DE QUIMICA FARMACEUTICA",1401840,null,null,null,null,null,null,{"$f":"IF(IF('1. Autorización'!$I$6=\"Altiplano\",C150,IF('1. Autorización'!$I$6=\"Sur\",E150,IF('1. Autorización'!$I$6=\"Colegio Americano del Sur\",G150,A150)))=0,\"\",IF('1. Autorización'!$I$6=\"Altiplano\",C150,IF('1. Autorización'!$I$6=\"Sur\",E150,IF('1. Autorización'!$I$6=\"Colegio Americano del Sur\",G150,A150))))","v":"LABORATORIO DE QUIMICA FARMACEUTICA"},{"$f":"IF(IF('1. Autorización'!$I$6=\"Altiplano\",D150,IF('1. Autorización'!$I$6=\"Sur\",F150,IF('1. Autorización'!$I$6=\"Colegio Americano del Sur\",H150,B150)))=0,\"\",IF('1. Autorización'!$I$6=\"Altiplano\",D150,IF('1. Autorización'!$I$6=\"Sur\",F150,IF('1. Autorización'!$I$6=\"Colegio Americano del Sur\",H150,B150))))","v":1401840}]
["LABORATORIOS DE COMPUTACION",1370600,null,null,null,null,null,null,{"$f":"IF(IF('1. Autorización'!$I$6=\"Altiplano\",C151,IF('1. Autorización'!$I$6=\"Sur\",E151,IF('1. Autorización'!$I$6=\"Colegio Americano del Sur\",G151,A151)))=0,\"\",IF('1. Autorización'!$I$6=\"Altiplano\",C151,IF('1. Autorización'!$I$6=\"Sur\",E151,IF('1. Autorización'!$I$6=\"Colegio Americano del Sur\",G151,A151))))","v":"LABORATORIOS DE COMPUTACION"},{"$f":"IF(IF('1. Autorización'!$I$6=\"Altiplano\",D151,IF('1. Autorización'!$I$6=\"Sur\",F151,IF('1. Autorización'!$I$6=\"Colegio Americano del Sur\",H151,B151)))=0,\"\",IF('1. Autorización'!$I$6=\"Altiplano\",D151,IF('1. Autorización'!$I$6=\"Sur\",F151,IF('1. Autorización'!$I$6=\"Colegio Americano del Sur\",H151,B151))))","v":1370600}]
["LAS FINANZAS EN EL MUNDO CORPORATIVO, COMP MAESTRI",8010303,null,null,null,null,null,null,{"$f":"IF(IF('1. Autorización'!$I$6=\"Altiplano\",C152,IF('1. Autorización'!$I$6=\"Sur\",E152,IF('1. Autorización'!$I$6=\"Colegio Americano del Sur\",G152,A152)))=0,\"\",IF('1. Autorización'!$I$6=\"Altiplano\",C152,IF('1. Autorización'!$I$6=\"Sur\",E152,IF('1. Autorización'!$I$6=\"Colegio Americano del Sur\",G152,A152))))","v":"LAS FINANZAS EN EL MUNDO CORPORATIVO, COMP MAESTRI"},{"$f":"IF(IF('1. Autorización'!$I$6=\"Altiplano\",D152,IF('1. Autorización'!$I$6=\"Sur\",F152,IF('1. Autorización'!$I$6=\"Colegio Americano del Sur\",H152,B152)))=0,\"\",IF('1. Autorización'!$I$6=\"Altiplano\",D152,IF('1. Autorización'!$I$6=\"Sur\",F152,IF('1. Autorización'!$I$6=\"Colegio Americano del Sur\",H152,B152))))","v":8010303}]
["LIC. EN INGENIERIA EN CC COMPU Y TEC DE LA INFO",1470210,null,null,null,null,null,null,{"$f":"IF(IF('1. Autorización'!$I$6=\"Altiplano\",C153,IF('1. Autorización'!$I$6=\"Sur\",E153,IF('1. Autorización'!$I$6=\"Colegio Americano del Sur\",G153,A153)))=0,\"\",IF('1. Autorización'!$I$6=\"Altiplano\",C153,IF('1. Autorización'!$I$6=\"Sur\",E153,IF('1. Autorización'!$I$6=\"Colegio Americano del Sur\",G153,A153))))","v":"LIC. EN INGENIERIA EN CC COMPU Y TEC DE LA INFO"},{"$f":"IF(IF('1. Autorización'!$I$6=\"Altiplano\",D153,IF('1. Autorización'!$I$6=\"Sur\",F153,IF('1. Autorización'!$I$6=\"Colegio Americano del Sur\",H153,B153)))=0,\"\",IF('1. Autorización'!$I$6=\"Altiplano\",D153,IF('1. Autorización'!$I$6=\"Sur\",F153,IF('1. Autorización'!$I$6=\"Colegio Americano del Sur\",H153,B153))))","v":1470210}]
["LIC. INTERNAT. MARKETING AND BUSINESS ANALYTICS",1473402,null,null,null,null,null,null,{"$f":"IF(IF('1. Autorización'!$I$6=\"Altiplano\",C154,IF('1. Autorización'!$I$6=\"Sur\",E154,IF('1. Autorización'!$I$6=\"Colegio Americano del Sur\",G154,A154)))=0,\"\",IF('1. Autorización'!$I$6=\"Altiplano\",C154,IF('1. Autorización'!$I$6=\"Sur\",E154,IF('1. Autorización'!$I$6=\"Colegio Americano del Sur\",G154,A154))))","v":"LIC. INTERNAT. MARKETING AND BUSINESS ANALYTICS"},{"$f":"IF(IF('1. Autorización'!$I$6=\"Altiplano\",D154,IF('1. Autorización'!$I$6=\"Sur\",F154,IF('1. Autorización'!$I$6=\"Colegio Americano del Sur\",H154,B154)))=0,\"\",IF('1. Autorización'!$I$6=\"Altiplano\",D154,IF('1. Autorización'!$I$6=\"Sur\",F154,IF('1. Autorización'!$I$6=\"Colegio Americano del Sur\",H154,B154))))","v":1473402}]
["LICENCIATURA DE ANTROPOLOGIA Y SOCIOLOGIA",1410910,null,null,null,null,null,null,{"$f":"IF(IF('1. Autorización'!$I$6=\"Altiplano\",C155,IF('1. Autorización'!$I$6=\"Sur\",E155,IF('1. Autorización'!$I$6=\"Colegio Americano del Sur\",G155,A155)))=0,\"\",IF('1. Autorización'!$I$6=\"Altiplano\",C155,IF('1. Autorización'!$I$6=\"Sur\",E155,IF('1. Autorización'!$I$6=\"Colegio Americano del Sur\",G155,A155))))","v":"LICENCIATURA DE ANTROPOLOGIA Y SOCIOLOGIA"},{"$f":"IF(IF('1. Autorización'!$I$6=\"Altiplano\",D155,IF('1. Autorización'!$I$6=\"Sur\",F155,IF('1. Autorización'!$I$6=\"Colegio Americano del Sur\",H155,B155)))=0,\"\",IF('1. Autorización'!$I$6=\"Altiplano\",D155,IF('1. Autorización'!$I$6=\"Sur\",F155,IF('1. Autorización'!$I$6=\"Colegio Americano del Sur\",H155,B155))))","v":1410910}]
["LICENCIATURA DE ARQUEOLOGIA",1410210,null,null,null,null,null,null,{"$f":"IF(IF('1. Autorización'!$I$6=\"Altiplano\",C156,IF('1. Autorización'!$I$6=\"Sur\",E156,IF('1. Autorización'!$I$6=\"Colegio Americano del Sur\",G156,A156)))=0,\"\",IF('1. Autorización'!$I$6=\"Altiplano\",C156,IF('1. Autorización'!$I$6=\"Sur\",E156,IF('1. Autorización'!$I$6=\"Colegio Americano del Sur\",G156,A156))))","v":"LICENCIATURA DE ARQUEOLOGIA"},{"$f":"IF(IF('1. Autorización'!$I$6=\"Altiplano\",D156,IF('1. Autorización'!$I$6=\"Sur\",F156,IF('1. Autorización'!$I$6=\"Colegio Americano del Sur\",H156,B156)))=0,\"\",IF('1. Autorización'!$I$6=\"Altiplano\",D156,IF('1. Autorización'!$I$6=\"Sur\",F156,IF('1. Autorización'!$I$6=\"Colegio Americano del Sur\",H156,B156))))","v":1410210}]
["LICENCIATURA DE BIOLOGIA",1400110,null,null,null,null,null,null,{"$f":"IF(IF('1. Autorización'!$I$6=\"Altiplano\",C157,IF('1. Autorización'!$I$6=\"Sur\",E157,IF('1. Autorización'!$I$6=\"Colegio Americano del Sur\",G157,A157)))=0,\"\",IF('1. Autorización'!$I$6=\"Altiplano\",C157,IF('1. Autorización'!$I$6=\"Sur\",E157,IF('1. Autorización'!$I$6=\"Colegio Americano del Sur\",G157,A157))))","v":"LICENCIATURA DE BIOLOGIA"},{"$f":"IF(IF('1. Autorización'!$I$6=\"Altiplano\",D157,IF('1. Autorización'!$I$6=\"Sur\",F157,IF('1. Autorización'!$I$6=\"Colegio Americano del Sur\",H157,B157)))=0,\"\",IF('1. Autorización'!$I$6=\"Altiplano\",D157,IF('1. Autorización'!$I$6=\"Sur\",F157,IF('1. Autorización'!$I$6=\"Colegio Americano del Sur\",H157,B157))))","v":1400110}]
["LICENCIATURA DE BIOQUIMICA Y MICROBIOLOGIA",1400210,null,null,null,null,null,null,{"$f":"IF(IF('1. Autorización'!$I$6=\"Altiplano\",C158,IF('1. Autorización'!$I$6=\"Sur\",E158,IF('1. Autorización'!$I$6=\"Colegio Americano del Sur\",G158,A158)))=0,\"\",IF('1. Autorización'!$I$6=\"Altiplano\",C158,IF('1. Autorización'!$I$6=\"Sur\",E158,IF('1. Autorización'!$I$6=\"Colegio Americano del Sur\",G158,A158))))","v":"LICENCIATURA DE BIOQUIMICA Y MICROBIOLOGIA"},{"$f":"IF(IF('1. Autorización'!$I$6=\"Altiplano\",D158,IF('1. Autorización'!$I$6=\"Sur\",F158,IF('1. Autorización'!$I$6=\"Colegio Americano del Sur\",H158,B158)))=0,\"\",IF('1. Autorización'!$I$6=\"Altiplano\",D158,IF('1. Autorización'!$I$6=\"Sur\",F158,IF('1. Autorización'!$I$6=\"Colegio Americano del Sur\",H158,B158))))","v":1400210}]
["LICENCIATURA DE COMUNICACION Y LETRAS",1402410,null,null,null,null,null,null,{"$f":"IF(IF('1. Autorización'!$I$6=\"Altiplano\",C159,IF('1. Autorización'!$I$6=\"Sur\",E159,IF('1. Autorización'!$I$6=\"Colegio Americano del Sur\",G159,A159)))=0,\"\",IF('1. Autorización'!$I$6=\"Altiplano\",C159,IF('1. Autorización'!$I$6=\"Sur\",E159,IF('1. Autorización'!$I$6=\"Colegio Americano del Sur\",G159,A159))))","v":"LICENCIATURA DE COMUNICACION Y LETRAS"},{"$f":"IF(IF('1. Autorización'!$I$6=\"Altiplano\",D159,IF('1. Autorización'!$I$6=\"Sur\",F159,IF('1. Autorización'!$I$6=\"Colegio Americano del Sur\",H159,B159)))=0,\"\",IF('1. Autorización'!$I$6=\"Altiplano\",D159,IF('1. Autorización'!$I$6=\"Sur\",F159,IF('1. Autorización'!$I$6=\"Colegio Americano del Sur\",H159,B159))))","v":1402410}]
["LICENCIATURA DE FISICA",1400610,null,null,null,null,null,null,{"$f":"IF(IF('1. Autorización'!$I$6=\"Altiplano\",C160,IF('1. Autorización'!$I$6=\"Sur\",E160,IF('1. Autorización'!$I$6=\"Colegio Americano del Sur\",G160,A160)))=0,\"\",IF('1. Autorización'!$I$6=\"Altiplano\",C160,IF('1. Autorización'!$I$6=\"Sur\",E160,IF('1. Autorización'!$I$6=\"Colegio Americano del Sur\",G160,A160))))","v":"LICENCIATURA DE FISICA"},{"$f":"IF(IF('1. Autorización'!$I$6=\"Altiplano\",D160,IF('1. Autorización'!$I$6=\"Sur\",F160,IF('1. Autorización'!$I$6=\"Colegio Americano del Sur\",H160,B160)))=0,\"\",IF('1. Autorización'!$I$6=\"Altiplano\",D160,IF('1. Autorización'!$I$6=\"Sur\",F160,IF('1. Autorización'!$I$6=\"Colegio Americano del Sur\",H160,B160))))","v":1400610}]
["LICENCIATURA DE HISTORIA",1410310,null,null,null,null,null,null,{"$f":"IF(IF('1. Autorización'!$I$6=\"Altiplano\",C161,IF('1. Autorización'!$I$6=\"Sur\",E161,IF('1. Autorización'!$I$6=\"Colegio Americano del Sur\",G161,A161)))=0,\"\",IF('1. Autorización'!$I$6=\"Altiplano\",C161,IF('1. Autorización'!$I$6=\"Sur\",E161,IF('1. Autorización'!$I$6=\"Colegio Americano del Sur\",G161,A161))))","v":"LICENCIATURA DE HISTORIA"},{"$f":"IF(IF('1. Autorización'!$I$6=\"Altiplano\",D161,IF('1. Autorización'!$I$6=\"Sur\",F161,IF('1. Autorización'!$I$6=\"Colegio Americano del Sur\",H161,B161)))=0,\"\",IF('1. Autorización'!$I$6=\"Altiplano\",D161,IF('1. Autorización'!$I$6=\"Sur\",F161,IF('1. Autorización'!$I$6=\"Colegio Americano del Sur\",H161,B161))))","v":1410310}]
["LICENCIATURA DE INGENIERIA EN TECNOLOGIA DE AUDIO",1473403,null,null,null,null,null,null,{"$f":"IF(IF('1. Autorización'!$I$6=\"Altiplano\",C162,IF('1. Autorización'!$I$6=\"Sur\",E162,IF('1. Autorización'!$I$6=\"Colegio Americano del Sur\",G162,A162)))=0,\"\",IF('1. Autorización'!$I$6=\"Altiplano\",C162,IF('1. Autorización'!$I$6=\"Sur\",E162,IF('1. Autorización'!$I$6=\"Colegio Americano del Sur\",G162,A162))))","v":"LICENCIATURA DE INGENIERIA EN TECNOLOGIA DE AUDIO"},{"$f":"IF(IF('1. Autorización'!$I$6=\"Altiplano\",D162,IF('1. Autorización'!$I$6=\"Sur\",F162,IF('1. Autorización'!$I$6=\"Colegio Americano del Sur\",H162,B162)))=0,\"\",IF('1. Autorización'!$I$6=\"Altiplano\",D162,IF('1. Autorización'!$I$6=\"Sur\",F162,IF('1. Autorización'!$I$6=\"Colegio Americano del Sur\",H162,B162))))","v":1473403}]
["LICENCIATURA DE NUTRICION",1401610,null,null,null,null,null,null,{"$f":"IF(IF('1. Autorización'!$I$6=\"Altiplano\",C163,IF('1. Autorización'!$I$6=\"Sur\",E163,IF('1. Autorización'!$I$6=\"Colegio Americano del Sur\",G163,A163)))=0,\"\",IF('1. Autorización'!$I$6=\"Altiplano\",C163,IF('1. Autorización'!$I$6=\"Sur\",E163,IF('1. Autorización'!$I$6=\"Colegio Americano del Sur\",G163,A163))))","v":"LICENCIATURA DE NUTRICION"},{"$f":"IF(IF('1. Autorización'!$I$6=\"Altiplano\",D163,IF('1. Autorización'!$I$6=\"Sur\",F163,IF('1. Autorización'!$I$6=\"Colegio Americano del Sur\",H163,B163)))=0,\"\",IF('1. Autorización'!$I$6=\"Altiplano\",D163,IF('1. Autorización'!$I$6=\"Sur\",F163,IF('1. Autorización'!$I$6=\"Colegio Americano del Sur\",H163,B163))))","v":1401610}]
["LICENCIATURA DE QUIMICA",1401710,null,null,null,null,null,null,{"$f":"IF(IF('1. Autorización'!$I$6=\"Altiplano\",C164,IF('1. Autorización'!$I$6=\"Sur\",E164,IF('1. Autorización'!$I$6=\"Colegio Americano del Sur\",G164,A164)))=0,\"\",IF('1. Autorización'!$I$6=\"Altiplano\",C164,IF('1. Autorización'!$I$6=\"Sur\",E164,IF('1. Autorización'!$I$6=\"Colegio Americano del Sur\",G164,A164))))","v":"LICENCIATURA DE QUIMICA"},{"$f":"IF(IF('1. Autorización'!$I$6=\"Altiplano\",D164,IF('1. Autorización'!$I$6=\"Sur\",F164,IF('1. Autorización'!$I$6=\"Colegio Americano del Sur\",H164,B164)))=0,\"\",IF('1. Autorización'!$I$6=\"Altiplano\",D164,IF('1. Autorización'!$I$6=\"Sur\",F164,IF('1. Autorización'!$I$6=\"Colegio Americano del Sur\",H164,B164))))","v":1401710}]
["LICENCIATURA DE RELACIONES INTERNACIONALES",1411710,null,null,null,null,null,null,{"$f":"IF(IF('1. Autorización'!$I$6=\"Altiplano\",C165,IF('1. Autorización'!$I$6=\"Sur\",E165,IF('1. Autorización'!$I$6=\"Colegio Americano del Sur\",G165,A165)))=0,\"\",IF('1. Autorización'!$I$6=\"Altiplano\",C165,IF('1. Autorización'!$I$6=\"Sur\",E165,IF('1. Autorización'!$I$6=\"Colegio Americano del Sur\",G165,A165))))","v":"LICENCIATURA DE RELACIONES INTERNACIONALES"},{"$f":"IF(IF('1. Autorización'!$I$6=\"Altiplano\",D165,IF('1. Autorización'!$I$6=\"Sur\",F165,IF('1. Autorización'!$I$6=\"Colegio Americano del Sur\",H165,B165)))=0,\"\",IF('1. Autorización'!$I$6=\"Altiplano\",D165,IF('1. Autorización'!$I$6=\"Sur\",F165,IF('1. Autorización'!$I$6=\"Colegio Americano del Sur\",H165,B165))))","v":1411710}]
["LICENCIATURA EN ADMON DEL TURISMO SOSTENIBLE",1400510,null,null,null,null,null,null,{"$f":"IF(IF('1. Autorización'!$I$6=\"Altiplano\",C166,IF('1. Autorización'!$I$6=\"Sur\",E166,IF('1. Autorización'!$I$6=\"Colegio Americano del Sur\",G166,A166)))=0,\"\",IF('1. Autorización'!$I$6=\"Altiplano\",C166,IF('1. Autorización'!$I$6=\"Sur\",E166,IF('1. Autorización'!$I$6=\"Colegio Americano del Sur\",G166,A166))))","v":"LICENCIATURA EN ADMON DEL TURISMO SOSTENIBLE"},{"$f":"IF(IF('1. Autorización'!$I$6=\"Altiplano\",D166,IF('1. Autorización'!$I$6=\"Sur\",F166,IF('1. Autorización'!$I$6=\"Colegio Americano del Sur\",H166,B166)))=0,\"\",IF('1. Autorización'!$I$6=\"Altiplano\",D166,IF('1. Autorización'!$I$6=\"Sur\",F166,IF('1. Autorización'!$I$6=\"Colegio Americano del Sur\",H166,B166))))","v":1400510}]
["LICENCIATURA EN BIOTECNOLOGIA MOLECULAR",1400211,null,null,null,null,null,null,{"$f":"IF(IF('1. Autorización'!$I$6=\"Altiplano\",C167,IF('1. Autorización'!$I$6=\"Sur\",E167,IF('1. Autorización'!$I$6=\"Colegio Americano del Sur\",G167,A167)))=0,\"\",IF('1. Autorización'!$I$6=\"Altiplano\",C167,IF('1. Autorización'!$I$6=\"Sur\",E167,IF('1. Autorización'!$I$6=\"Colegio Americano del Sur\",G167,A167))))","v":"LICENCIATURA EN BIOTECNOLOGIA MOLECULAR"},{"$f":"IF(IF('1. Autorización'!$I$6=\"Altiplano\",D167,IF('1. Autorización'!$I$6=\"Sur\",F167,IF('1. Autorización'!$I$6=\"Colegio Americano del Sur\",H167,B167)))=0,\"\",IF('1. Autorización'!$I$6=\"Altiplano\",D167,IF('1. Autorización'!$I$6=\"Sur\",F167,IF('1. Autorización'!$I$6=\"Colegio Americano del Sur\",H167,B167))))","v":1400211}]
["LICENCIATURA EN COMPOSICION Y PRODUCCION MUSICAL",1390504,null,null,null,null,null,null,{"$f":"IF(IF('1. Autorización'!$I$6=\"Altiplano\",C168,IF('1. Autorización'!$I$6=\"Sur\",E168,IF('1. Autorización'!$I$6=\"Colegio Americano del Sur\",G168,A168)))=0,\"\",IF('1. Autorización'!$I$6=\"Altiplano\",C168,IF('1. Autorización'!$I$6=\"Sur\",E168,IF('1. Autorización'!$I$6=\"Colegio Americano del Sur\",G168,A168))))","v":"LICENCIATURA EN COMPOSICION Y PRODUCCION MUSICAL"},{"$f":"IF(IF('1. Autorización'!$I$6=\"Altiplano\",D168,IF('1. Autorización'!$I$6=\"Sur\",F168,IF('1. Autorización'!$I$6=\"Colegio Americano del Sur\",H168,B168)))=0,\"\",IF('1. Autorización'!$I$6=\"Altiplano\",D168,IF('1. Autorización'!$I$6=\"Sur\",F168,IF('1. Autorización'!$I$6=\"Colegio Americano del Sur\",H168,B168))))","v":1390504}]
["LICENCIATURA EN DISEÑO DE PRODUCTO E INNOVACION",1390505,null,null,null,null,null,null,{"$f":"IF(IF('1. Autorización'!$I$6=\"Altiplano\",C169,IF('1. Autorización'!$I$6=\"Sur\",E169,IF('1. Autorización'!$I$6=\"Colegio Americano del Sur\",G169,A169)))=0,\"\",IF('1. Autorización'!$I$6=\"Altiplano\",C169,IF('1. Autorización'!$I$6=\"Sur\",E169,IF('1. Autorización'!$I$6=\"Colegio Americano del Sur\",G169,A169))))","v":"LICENCIATURA EN DISEÑO DE PRODUCTO E INNOVACION"},{"$f":"IF(IF('1. Autorización'!$I$6=\"Altiplano\",D169,IF('1. Autorización'!$I$6=\"Sur\",F169,IF('1. Autorización'!$I$6=\"Colegio Americano del Sur\",H169,B169)))=0,\"\",IF('1. Autorización'!$I$6=\"Altiplano\",D169,IF('1. Autorización'!$I$6=\"Sur\",F169,IF('1. Autorización'!$I$6=\"Colegio Americano del Sur\",H169,B169))))","v":1390505}]
["LICENCIATURA EN EDUCACION",1421310,null,null,null,null,null,null,{"$f":"IF(IF('1. Autorización'!$I$6=\"Altiplano\",C170,IF('1. Autorización'!$I$6=\"Sur\",E170,IF('1. Autorización'!$I$6=\"Colegio Americano del Sur\",G170,A170)))=0,\"\",IF('1. Autorización'!$I$6=\"Altiplano\",C170,IF('1. Autorización'!$I$6=\"Sur\",E170,IF('1. Autorización'!$I$6=\"Colegio Americano del Sur\",G170,A170))))","v":"LICENCIATURA EN EDUCACION"},{"$f":"IF(IF('1. Autorización'!$I$6=\"Altiplano\",D170,IF('1. Autorización'!$I$6=\"Sur\",F170,IF('1. Autorización'!$I$6=\"Colegio Americano del Sur\",H170,B170)))=0,\"\",IF('1. Autorización'!$I$6=\"Altiplano\",D170,IF('1. Autorización'!$I$6=\"Sur\",F170,IF('1. Autorización'!$I$6=\"Colegio Americano del Sur\",H170,B170))))","v":1421310}]
["LICENCIATURA EN ENGLISH LANGUAGE TEACHING ELT",1420910,null,null,null,null,null,null,{"$f":"IF(IF('1. Autorización'!$I$6=\"Altiplano\",C171,IF('1. Autorización'!$I$6=\"Sur\",E171,IF('1. Autorización'!$I$6=\"Colegio Americano del Sur\",G171,A171)))=0,\"\",IF('1. Autorización'!$I$6=\"Altiplano\",C171,IF('1. Autorización'!$I$6=\"Sur\",E171,IF('1. Autorización'!$I$6=\"Colegio Americano del Sur\",G171,A171))))","v":"LICENCIATURA EN ENGLISH LANGUAGE TEACHING ELT"},{"$f":"IF(IF('1. Autorización'!$I$6=\"Altiplano\",D171,IF('1. Autorización'!$I$6=\"Sur\",F171,IF('1. Autorización'!$I$6=\"Colegio Americano del Sur\",H171,B171)))=0,\"\",IF('1. Autorización'!$I$6=\"Altiplano\",D171,IF('1. Autorización'!$I$6=\"Sur\",F171,IF('1. Autorización'!$I$6=\"Colegio Americano del Sur\",H171,B171))))","v":1420910}]
["LICENCIATURA EN ENSEÑANZA DE FISICA Y MATEMATICA",1421606,null,null,null,null,null,null,{"$f":"IF(IF('1. Autorización'!$I$6=\"Altiplano\",C172,IF('1. Autorización'!$I$6=\"Sur\",E172,IF('1. Autorización'!$I$6=\"Colegio Americano del Sur\",G172,A172)))=0,\"\",IF('1. Autorización'!$I$6=\"Altiplano\",C172,IF('1. Autorización'!$I$6=\"Sur\",E172,IF('1. Autorización'!$I$6=\"Colegio Americano del Sur\",G172,A172))))","v":"LICENCIATURA EN ENSEÑANZA DE FISICA Y MATEMATICA"},{"$f":"IF(IF('1. Autorización'!$I$6=\"Altiplano\",D172,IF('1. Autorización'!$I$6=\"Sur\",F172,IF('1. Autorización'!$I$6=\"Colegio Americano del Sur\",H172,B172)))=0,\"\",IF('1. Autorización'!$I$6=\"Altiplano\",D172,IF('1. Autorización'!$I$6=\"Sur\",F172,IF('1. Autorización'!$I$6=\"Colegio Americano del Sur\",H172,B172))))","v":1421606}]
["LICENCIATURA EN ENSEÑANZA DE QUIMICA Y BIOLOGIA",1421607,null,null,null,null,null,null,{"$f":"IF(IF('1. Autorización'!$I$6=\"Altiplano\",C173,IF('1. Autorización'!$I$6=\"Sur\",E173,IF('1. Autorización'!$I$6=\"Colegio Americano del Sur\",G173,A173)))=0,\"\",IF('1. Autorización'!$I$6=\"Altiplano\",C173,IF('1. Autorización'!$I$6=\"Sur\",E173,IF('1. Autorización'!$I$6=\"Colegio Americano del Sur\",G173,A173))))","v":"LICENCIATURA EN ENSEÑANZA DE QUIMICA Y BIOLOGIA"},{"$f":"IF(IF('1. Autorización'!$I$6=\"Altiplano\",D173,IF('1. Autorización'!$I$6=\"Sur\",F173,IF('1. Autorización'!$I$6=\"Colegio Americano del Sur\",H173,B173)))=0,\"\",IF('1. Autorización'!$I$6=\"Altiplano\",D173,IF('1. Autorización'!$I$6=\"Sur\",F173,IF('1. Autorización'!$I$6=\"Colegio Americano del Sur\",H173,B173))))","v":1421607}]
["LICENCIATURA EN FOOD BUSINESS AND MARKETING",1470511,null,null,null,null,null,null,{"$f":"IF(IF('1. Autorización'!$I$6=\"Altiplano\",C174,IF('1. Autorización'!$I$6=\"Sur\",E174,IF('1. Autorización'!$I$6=\"Colegio Americano del Sur\",G174,A174)))=0,\"\",IF('1. Autorización'!$I$6=\"Altiplano\",C174,IF('1. Autorización'!$I$6=\"Sur\",E174,IF('1. Autorización'!$I$6=\"Colegio Americano del Sur\",G174,A174))))","v":"LICENCIATURA EN FOOD BUSINESS AND MARKETING"},{"$f":"IF(IF('1. Autorización'!$I$6=\"Altiplano\",D174,IF('1. Autorización'!$I$6=\"Sur\",F174,IF('1. Autorización'!$I$6=\"Colegio Americano del Sur\",H174,B174)))=0,\"\",IF('1. Autorización'!$I$6=\"Altiplano\",D174,IF('1. Autorización'!$I$6=\"Sur\",F174,IF('1. Autorización'!$I$6=\"Colegio Americano del Sur\",H174,B174))))","v":1470511}]
["LICENCIATURA EN ING. EN BIOTECNOLOGIA INDUSTRIAL",1470411,null,null,null,null,null,null,{"$f":"IF(IF('1. Autorización'!$I$6=\"Altiplano\",C175,IF('1. Autorización'!$I$6=\"Sur\",E175,IF('1. Autorización'!$I$6=\"Colegio Americano del Sur\",G175,A175)))=0,\"\",IF('1. Autorización'!$I$6=\"Altiplano\",C175,IF('1. Autorización'!$I$6=\"Sur\",E175,IF('1. Autorización'!$I$6=\"Colegio Americano del Sur\",G175,A175))))","v":"LICENCIATURA EN ING. EN BIOTECNOLOGIA INDUSTRIAL"},{"$f":"IF(IF('1. Autorización'!$I$6=\"Altiplano\",D175,IF('1. Autorización'!$I$6=\"Sur\",F175,IF('1. Autorización'!$I$6=\"Colegio Americano del Sur\",H175,B175)))=0,\"\",IF('1. Autorización'!$I$6=\"Altiplano\",D175,IF('1. Autorización'!$I$6=\"Sur\",F175,IF('1. Autorización'!$I$6=\"Colegio Americano del Sur\",H175,B175))))","v":1470411}]
["LICENCIATURA EN ING. MECANICA INDUSTRIAL",1470311,null,null,null,null,null,null,{"$f":"IF(IF('1. Autorización'!$I$6=\"Altiplano\",C176,IF('1. Autorización'!$I$6=\"Sur\",E176,IF('1. Autorización'!$I$6=\"Colegio Americano del Sur\",G176,A176)))=0,\"\",IF('1. Autorización'!$I$6=\"Altiplano\",C176,IF('1. Autorización'!$I$6=\"Sur\",E176,IF('1. Autorización'!$I$6=\"Colegio Americano del Sur\",G176,A176))))","v":"LICENCIATURA EN ING. MECANICA INDUSTRIAL"},{"$f":"IF(IF('1. Autorización'!$I$6=\"Altiplano\",D176,IF('1. Autorización'!$I$6=\"Sur\",F176,IF('1. Autorización'!$I$6=\"Colegio Americano del Sur\",H176,B176)))=0,\"\",IF('1. Autorización'!$I$6=\"Altiplano\",D176,IF('1. Autorización'!$I$6=\"Sur\",F176,IF('1. Autorización'!$I$6=\"Colegio Americano del Sur\",H176,B176))))","v":1470311}]
["LICENCIATURA EN INGENIERIA BIOMEDICA",1470612,null,null,null,null,null,null,{"$f":"IF(IF('1. Autorización'!$I$6=\"Altiplano\",C177,IF('1. Autorización'!$I$6=\"Sur\",E177,IF('1. Autorización'!$I$6=\"Colegio Americano del Sur\",G177,A177)))=0,\"\",IF('1. Autorización'!$I$6=\"Altiplano\",C177,IF('1. Autorización'!$I$6=\"Sur\",E177,IF('1. Autorización'!$I$6=\"Colegio Americano del Sur\",G177,A177))))","v":"LICENCIATURA EN INGENIERIA BIOMEDICA"},{"$f":"IF(IF('1. Autorización'!$I$6=\"Altiplano\",D177,IF('1. Autorización'!$I$6=\"Sur\",F177,IF('1. Autorización'!$I$6=\"Colegio Americano del Sur\",H177,B177)))=0,\"\",IF('1. Autorización'!$I$6=\"Altiplano\",D177,IF('1. Autorización'!$I$6=\"Sur\",F177,IF('1. Autorización'!$I$6=\"Colegio Americano del Sur\",H177,B177))))","v":1470612}]
["LICENCIATURA EN INGENIERIA CIVIL",1470110,null,null,null,null,null,null,{"$f":"IF(IF('1. Autorización'!$I$6=\"Altiplano\",C178,IF('1. Autorización'!$I$6=\"Sur\",E178,IF('1. Autorización'!$I$6=\"Colegio Americano del Sur\",G178,A178)))=0,\"\",IF('1. Autorización'!$I$6=\"Altiplano\",C178,IF('1. Autorización'!$I$6=\"Sur\",E178,IF('1. Autorización'!$I$6=\"Colegio Americano del Sur\",G178,A178))))","v":"LICENCIATURA EN INGENIERIA CIVIL"},{"$f":"IF(IF('1. Autorización'!$I$6=\"Altiplano\",D178,IF('1. Autorización'!$I$6=\"Sur\",F178,IF('1. Autorización'!$I$6=\"Colegio Americano del Sur\",H178,B178)))=0,\"\",IF('1. Autorización'!$I$6=\"Altiplano\",D178,IF('1. Autorización'!$I$6=\"Sur\",F178,IF('1. Autorización'!$I$6=\"Colegio Americano del Sur\",H178,B178))))","v":1470110}]
["LICENCIATURA EN INGENIERIA CIVIL AMBIENTAL",1470113,null,null,null,null,null,null,{"$f":"IF(IF('1. Autorización'!$I$6=\"Altiplano\",C179,IF('1. Autorización'!$I$6=\"Sur\",E179,IF('1. Autorización'!$I$6=\"Colegio Americano del Sur\",G179,A179)))=0,\"\",IF('1. Autorización'!$I$6=\"Altiplano\",C179,IF('1. Autorización'!$I$6=\"Sur\",E179,IF('1. Autorización'!$I$6=\"Colegio Americano del Sur\",G179,A179))))","v":"LICENCIATURA EN INGENIERIA CIVIL AMBIENTAL"},{"$f":"IF(IF('1. Autorización'!$I$6=\"Altiplano\",D179,IF('1. Autorización'!$I$6=\"Sur\",F179,IF('1. Autorización'!$I$6=\"Colegio Americano del Sur\",H179,B179)))=0,\"\",IF('1. Autorización'!$I$6=\"Altiplano\",D179,IF('1. Autorización'!$I$6=\"Sur\",F179,IF('1. Autorización'!$I$6=\"Colegio Americano del Sur\",H179,B179))))","v":1470113}]
["LICENCIATURA EN INGENIERIA CIVIL ARQUITECTONICO",1470112,null,null,null,null,null,null,{"$f":"IF(IF('1. Autorización'!$I$6=\"Altiplano\",C180,IF('1. Autorización'!$I$6=\"Sur\",E180,IF('1. Autorización'!$I$6=\"Colegio Americano del Sur\",G180,A180)))=0,\"\",IF('1. Autorización'!$I$6=\"Altiplano\",C180,IF('1. Autorización'!$I$6=\"Sur\",E180,IF('1. Autorización'!$I$6=\"Colegio Americano del Sur\",G180,A180))))","v":"LICENCIATURA EN INGENIERIA CIVIL ARQUITECTONICO"},{"$f":"IF(IF('1. Autorización'!$I$6=\"Altiplano\",D180,IF('1. Autorización'!$I$6=\"Sur\",F180,IF('1. Autorización'!$I$6=\"Colegio Americano del Sur\",H180,B180)))=0,\"\",IF('1. Autorización'!$I$6=\"Altiplano\",D180,IF('1. Autorización'!$I$6=\"Sur\",F180,IF('1. Autorización'!$I$6=\"Colegio Americano del Sur\",H180,B180))))","v":1470112}]
["LICENCIATURA EN INGENIERIA CIVIL INDUSTRIAL",1470111,null,null,null,null,null,null,{"$f":"IF(IF('1. Autorización'!$I$6=\"Altiplano\",C181,IF('1. Autorización'!$I$6=\"Sur\",E181,IF('1. Autorización'!$I$6=\"Colegio Americano del Sur\",G181,A181)))=0,\"\",IF('1. Autorización'!$I$6=\"Altiplano\",C181,IF('1. Autorización'!$I$6=\"Sur\",E181,IF('1. Autorización'!$I$6=\"Colegio Americano del Sur\",G181,A181))))","v":"LICENCIATURA EN INGENIERIA CIVIL INDUSTRIAL"},{"$f":"IF(IF('1. Autorización'!$I$6=\"Altiplano\",D181,IF('1. Autorización'!$I$6=\"Sur\",F181,IF('1. Autorización'!$I$6=\"Colegio Americano del Sur\",H181,B181)))=0,\"\",IF('1. Autorización'!$I$6=\"Altiplano\",D181,IF('1. Autorización'!$I$6=\"Sur\",F181,IF('1. Autorización'!$I$6=\"Colegio Americano del Sur\",H181,B181))))","v":1470111}]
["LICENCIATURA EN INGENIERIA ELECTRONICA",1470610,null,null,null,null,null,null,{"$f":"IF(IF('1. Autorización'!$I$6=\"Altiplano\",C182,IF('1. Autorización'!$I$6=\"Sur\",E182,IF('1. Autorización'!$I$6=\"Colegio Americano del Sur\",G182,A182)))=0,\"\",IF('1. Autorización'!$I$6=\"Altiplano\",C182,IF('1. Autorización'!$I$6=\"Sur\",E182,IF('1. Autorización'!$I$6=\"Colegio Americano del Sur\",G182,A182))))","v":"LICENCIATURA EN INGENIERIA ELECTRONICA"},{"$f":"IF(IF('1. Autorización'!$I$6=\"Altiplano\",D182,IF('1. Autorización'!$I$6=\"Sur\",F182,IF('1. Autorización'!$I$6=\"Colegio Americano del Sur\",H182,B182)))=0,\"\",IF('1. Autorización'!$I$6=\"Altiplano\",D182,IF('1. Autorización'!$I$6=\"Sur\",F182,IF('1. Autorización'!$I$6=\"Colegio Americano del Sur\",H182,B182))))","v":1470610}]
["LICENCIATURA EN INGENIERIA EN BIOINFORMATICA",1470211,null,null,null,null,null,null,{"$f":"IF(IF('1. Autorización'!$I$6=\"Altiplano\",C183,IF('1. Autorización'!$I$6=\"Sur\",E183,IF('1. Autorización'!$I$6=\"Colegio Americano del Sur\",G183,A183)))=0,\"\",IF('1. Autorización'!$I$6=\"Altiplano\",C183,IF('1. Autorización'!$I$6=\"Sur\",E183,IF('1. Autorización'!$I$6=\"Colegio Americano del Sur\",G183,A183))))","v":"LICENCIATURA EN INGENIERIA EN BIOINFORMATICA"},{"$f":"IF(IF('1. Autorización'!$I$6=\"Altiplano\",D183,IF('1. Autorización'!$I$6=\"Sur\",F183,IF('1. Autorización'!$I$6=\"Colegio Americano del Sur\",H183,B183)))=0,\"\",IF('1. Autorización'!$I$6=\"Altiplano\",D183,IF('1. Autorización'!$I$6=\"Sur\",F183,IF('1. Autorización'!$I$6=\"Colegio Americano del Sur\",H183,B183))))","v":1470211}]
["LICENCIATURA EN INGENIERIA EN CIENCIAS DE ALIMENTO",1470510,null,null,null,null,null,null,{"$f":"IF(IF('1. Autorización'!$I$6=\"Altiplano\",C184,IF('1. Autorización'!$I$6=\"Sur\",E184,IF('1. Autorización'!$I$6=\"Colegio Americano del Sur\",G184,A184)))=0,\"\",IF('1. Autorización'!$I$6=\"Altiplano\",C184,IF('1. Autorización'!$I$6=\"Sur\",E184,IF('1. Autorización'!$I$6=\"Colegio Americano del Sur\",G184,A184))))","v":"LICENCIATURA EN INGENIERIA EN CIENCIAS DE ALIMENTO"},{"$f":"IF(IF('1. Autorización'!$I$6=\"Altiplano\",D184,IF('1. Autorización'!$I$6=\"Sur\",F184,IF('1. Autorización'!$I$6=\"Colegio Americano del Sur\",H184,B184)))=0,\"\",IF('1. Autorización'!$I$6=\"Altiplano\",D184,IF('1. Autorización'!$I$6=\"Sur\",F184,IF('1. Autorización'!$I$6=\"Colegio Americano del Sur\",H184,B184))))","v":1470510}]
["LICENCIATURA EN INGENIERIA INDUSTRIAL",1470710,null,null,null,null,null,null,{"$f":"IF(IF('1. Autorización'!$I$6=\"Altiplano\",C185,IF('1. Autorización'!$I$6=\"Sur\",E185,IF('1. Autorización'!$I$6=\"Colegio Americano del Sur\",G185,A185)))=0,\"\",IF('1. Autorización'!$I$6=\"Altiplano\",C185,IF('1. Autorización'!$I$6=\"Sur\",E185,IF('1. Autorización'!$I$6=\"Colegio Americano del Sur\",G185,A185))))","v":"LICENCIATURA EN INGENIERIA INDUSTRIAL"},{"$f":"IF(IF('1. Autorización'!$I$6=\"Altiplano\",D185,IF('1. Autorización'!$I$6=\"Sur\",F185,IF('1. Autorización'!$I$6=\"Colegio Americano del Sur\",H185,B185)))=0,\"\",IF('1. Autorización'!$I$6=\"Altiplano\",D185,IF('1. Autorización'!$I$6=\"Sur\",F185,IF('1. Autorización'!$I$6=\"Colegio Americano del Sur\",H185,B185))))","v":1470710}]
["LICENCIATURA EN INGENIERIA MECANICA",1470310,null,null,null,null,null,null,{"$f":"IF(IF('1. Autorización'!$I$6=\"Altiplano\",C186,IF('1. Autorización'!$I$6=\"Sur\",E186,IF('1. Autorización'!$I$6=\"Colegio Americano del Sur\",G186,A186)))=0,\"\",IF('1. Autorización'!$I$6=\"Altiplano\",C186,IF('1. Autorización'!$I$6=\"Sur\",E186,IF('1. Autorización'!$I$6=\"Colegio Americano del Sur\",G186,A186))))","v":"LICENCIATURA EN INGENIERIA MECANICA"},{"$f":"IF(IF('1. Autorización'!$I$6=\"Altiplano\",D186,IF('1. Autorización'!$I$6=\"Sur\",F186,IF('1. Autorización'!$I$6=\"Colegio Americano del Sur\",H186,B186)))=0,\"\",IF('1. Autorización'!$I$6=\"Altiplano\",D186,IF('1. Autorización'!$I$6=\"Sur\",F186,IF('1. Autorización'!$I$6=\"Colegio Americano del Sur\",H186,B186))))","v":1470310}]
["LICENCIATURA EN INGENIERIA MECATRONICA",1470611,null,null,null,null,null,null,{"$f":"IF(IF('1. Autorización'!$I$6=\"Altiplano\",C187,IF('1. Autorización'!$I$6=\"Sur\",E187,IF('1. Autorización'!$I$6=\"Colegio Americano del Sur\",G187,A187)))=0,\"\",IF('1. Autorización'!$I$6=\"Altiplano\",C187,IF('1. Autorización'!$I$6=\"Sur\",E187,IF('1. Autorización'!$I$6=\"Colegio Americano del Sur\",G187,A187))))","v":"LICENCIATURA EN INGENIERIA MECATRONICA"},{"$f":"IF(IF('1. Autorización'!$I$6=\"Altiplano\",D187,IF('1. Autorización'!$I$6=\"Sur\",F187,IF('1. Autorización'!$I$6=\"Colegio Americano del Sur\",H187,B187)))=0,\"\",IF('1. Autorización'!$I$6=\"Altiplano\",D187,IF('1. Autorización'!$I$6=\"Sur\",F187,IF('1. Autorización'!$I$6=\"Colegio Americano del Sur\",H187,B187))))","v":1470611}]
["LICENCIATURA EN INGENIERIA QUIMICA",1470410,null,null,null,null,null,null,{"$f":"IF(IF('1. Autorización'!$I$6=\"Altiplano\",C188,IF('1. Autorización'!$I$6=\"Sur\",E188,IF('1. Autorización'!$I$6=\"Colegio Americano del Sur\",G188,A188)))=0,\"\",IF('1. Autorización'!$I$6=\"Altiplano\",C188,IF('1. Autorización'!$I$6=\"Sur\",E188,IF('1. Autorización'!$I$6=\"Colegio Americano del Sur\",G188,A188))))","v":"LICENCIATURA EN INGENIERIA QUIMICA"},{"$f":"IF(IF('1. Autorización'!$I$6=\"Altiplano\",D188,IF('1. Autorización'!$I$6=\"Sur\",F188,IF('1. Autorización'!$I$6=\"Colegio Americano del Sur\",H188,B188)))=0,\"\",IF('1. Autorización'!$I$6=\"Altiplano\",D188,IF('1. Autorización'!$I$6=\"Sur\",F188,IF('1. Autorización'!$I$6=\"Colegio Americano del Sur\",H188,B188))))","v":1470410}]
["LICENCIATURA EN INGENIERIA QUIMICA INDUSTRIAL",1470412,null,null,null,null,null,null,{"$f":"IF(IF('1. Autorización'!$I$6=\"Altiplano\",C189,IF('1. Autorización'!$I$6=\"Sur\",E189,IF('1. Autorización'!$I$6=\"Colegio Americano del Sur\",G189,A189)))=0,\"\",IF('1. Autorización'!$I$6=\"Altiplano\",C189,IF('1. Autorización'!$I$6=\"Sur\",E189,IF('1. Autorización'!$I$6=\"Colegio Americano del Sur\",G189,A189))))","v":"LICENCIATURA EN INGENIERIA QUIMICA INDUSTRIAL"},{"$f":"IF(IF('1. Autorización'!$I$6=\"Altiplano\",D189,IF('1. Autorización'!$I$6=\"Sur\",F189,IF('1. Autorización'!$I$6=\"Colegio Americano del Sur\",H189,B189)))=0,\"\",IF('1. Autorización'!$I$6=\"Altiplano\",D189,IF('1. Autorización'!$I$6=\"Sur\",F189,IF('1. Autorización'!$I$6=\"Colegio Americano del Sur\",H189,B189))))","v":1470412}]
["LICENCIATURA EN MATEMATICA APLICADA",1401511,null,null,null,null,null,null,{"$f":"IF(IF('1. Autorización'!$I$6=\"Altiplano\",C190,IF('1. Autorización'!$I$6=\"Sur\",E190,IF('1. Autorización'!$I$6=\"Colegio Americano del Sur\",G190,A190)))=0,\"\",IF('1. Autorización'!$I$6=\"Altiplano\",C190,IF('1. Autorización'!$I$6=\"Sur\",E190,IF('1. Autorización'!$I$6=\"Colegio Americano del Sur\",G190,A190))))","v":"LICENCIATURA EN MATEMATICA APLICADA"},{"$f":"IF(IF('1. Autorización'!$I$6=\"Altiplano\",D190,IF('1. Autorización'!$I$6=\"Sur\",F190,IF('1. Autorización'!$I$6=\"Colegio Americano del Sur\",H190,B190)))=0,\"\",IF('1. Autorización'!$I$6=\"Altiplano\",D190,IF('1. Autorización'!$I$6=\"Sur\",F190,IF('1. Autorización'!$I$6=\"Colegio Americano del Sur\",H190,B190))))","v":1401511}]
["LICENCIATURA EN MUSICA",1420410,null,null,null,null,null,null,{"$f":"IF(IF('1. Autorización'!$I$6=\"Altiplano\",C191,IF('1. Autorización'!$I$6=\"Sur\",E191,IF('1. Autorización'!$I$6=\"Colegio Americano del Sur\",G191,A191)))=0,\"\",IF('1. Autorización'!$I$6=\"Altiplano\",C191,IF('1. Autorización'!$I$6=\"Sur\",E191,IF('1. Autorización'!$I$6=\"Colegio Americano del Sur\",G191,A191))))","v":"LICENCIATURA EN MUSICA"},{"$f":"IF(IF('1. Autorización'!$I$6=\"Altiplano\",D191,IF('1. Autorización'!$I$6=\"Sur\",F191,IF('1. Autorización'!$I$6=\"Colegio Americano del Sur\",H191,B191)))=0,\"\",IF('1. Autorización'!$I$6=\"Altiplano\",D191,IF('1. Autorización'!$I$6=\"Sur\",F191,IF('1. Autorización'!$I$6=\"Colegio Americano del Sur\",H191,B191))))","v":1420410}]
["LICENCIATURA EN PSICOLOGIA",1410410,null,null,null,null,null,null,{"$f":"IF(IF('1. Autorización'!$I$6=\"Altiplano\",C192,IF('1. Autorización'!$I$6=\"Sur\",E192,IF('1. Autorización'!$I$6=\"Colegio Americano del Sur\",G192,A192)))=0,\"\",IF('1. Autorización'!$I$6=\"Altiplano\",C192,IF('1. Autorización'!$I$6=\"Sur\",E192,IF('1. Autorización'!$I$6=\"Colegio Americano del Sur\",G192,A192))))","v":"LICENCIATURA EN PSICOLOGIA"},{"$f":"IF(IF('1. Autorización'!$I$6=\"Altiplano\",D192,IF('1. Autorización'!$I$6=\"Sur\",F192,IF('1. Autorización'!$I$6=\"Colegio Americano del Sur\",H192,B192)))=0,\"\",IF('1. Autorización'!$I$6=\"Altiplano\",D192,IF('1. Autorización'!$I$6=\"Sur\",F192,IF('1. Autorización'!$I$6=\"Colegio Americano del Sur\",H192,B192))))","v":1410410}]
["LICENCIATURA EN PSICOPEDAGOGIA",1420710,null,null,null,null,null,null,{"$f":"IF(IF('1. Autorización'!$I$6=\"Altiplano\",C193,IF('1. Autorización'!$I$6=\"Sur\",E193,IF('1. Autorización'!$I$6=\"Colegio Americano del Sur\",G193,A193)))=0,\"\",IF('1. Autorización'!$I$6=\"Altiplano\",C193,IF('1. Autorización'!$I$6=\"Sur\",E193,IF('1. Autorización'!$I$6=\"Colegio Americano del Sur\",G193,A193))))","v":"LICENCIATURA EN PSICOPEDAGOGIA"},{"$f":"IF(IF('1. Autorización'!$I$6=\"Altiplano\",D193,IF('1. Autorización'!$I$6=\"Sur\",F193,IF('1. Autorización'!$I$6=\"Colegio Americano del Sur\",H193,B193)))=0,\"\",IF('1. Autorización'!$I$6=\"Altiplano\",D193,IF('1. Autorización'!$I$6=\"Sur\",F193,IF('1. Autorización'!$I$6=\"Colegio Americano del Sur\",H193,B193))))","v":1420710}]
["LICENCIATURA EN QUIMICA FARMACEUTICA",1401810,null,null,null,null,null,null,{"$f":"IF(IF('1. Autorización'!$I$6=\"Altiplano\",C194,IF('1. Autorización'!$I$6=\"Sur\",E194,IF('1. Autorización'!$I$6=\"Colegio Americano del Sur\",G194,A194)))=0,\"\",IF('1. Autorización'!$I$6=\"Altiplano\",C194,IF('1. Autorización'!$I$6=\"Sur\",E194,IF('1. Autorización'!$I$6=\"Colegio Americano del Sur\",G194,A194))))","v":"LICENCIATURA EN QUIMICA FARMACEUTICA"},{"$f":"IF(IF('1. Autorización'!$I$6=\"Altiplano\",D194,IF('1. Autorización'!$I$6=\"Sur\",F194,IF('1. Autorización'!$I$6=\"Colegio Americano del Sur\",H194,B194)))=0,\"\",IF('1. Autorización'!$I$6=\"Altiplano\",D194,IF('1. Autorización'!$I$6=\"Sur\",F194,IF('1. Autorización'!$I$6=\"Colegio Americano del Sur\",H194,B194))))","v":1401810}]
["LICENCIATURA INGENIERIA EN CC DE LA ADMINISTRACION",1473401,null,null,null,null,null,null,{"$f":"IF(IF('1. Autorización'!$I$6=\"Altiplano\",C195,IF('1. Autorización'!$I$6=\"Sur\",E195,IF('1. Autorización'!$I$6=\"Colegio Americano del Sur\",G195,A195)))=0,\"\",IF('1. Autorización'!$I$6=\"Altiplano\",C195,IF('1. Autorización'!$I$6=\"Sur\",E195,IF('1. Autorización'!$I$6=\"Colegio Americano del Sur\",G195,A195))))","v":"LICENCIATURA INGENIERIA EN CC DE LA ADMINISTRACION"},{"$f":"IF(IF('1. Autorización'!$I$6=\"Altiplano\",D195,IF('1. Autorización'!$I$6=\"Sur\",F195,IF('1. Autorización'!$I$6=\"Colegio Americano del Sur\",H195,B195)))=0,\"\",IF('1. Autorización'!$I$6=\"Altiplano\",D195,IF('1. Autorización'!$I$6=\"Sur\",F195,IF('1. Autorización'!$I$6=\"Colegio Americano del Sur\",H195,B195))))","v":1473401}]
["LIDERAZGO EN EL AMBITO EDUCATIVO",8040401,null,null,null,null,null,null,{"$f":"IF(IF('1. Autorización'!$I$6=\"Altiplano\",C196,IF('1. Autorización'!$I$6=\"Sur\",E196,IF('1. Autorización'!$I$6=\"Colegio Americano del Sur\",G196,A196)))=0,\"\",IF('1. Autorización'!$I$6=\"Altiplano\",C196,IF('1. Autorización'!$I$6=\"Sur\",E196,IF('1. Autorización'!$I$6=\"Colegio Americano del Sur\",G196,A196))))","v":"LIDERAZGO EN EL AMBITO EDUCATIVO"},{"$f":"IF(IF('1. Autorización'!$I$6=\"Altiplano\",D196,IF('1. Autorización'!$I$6=\"Sur\",F196,IF('1. Autorización'!$I$6=\"Colegio Americano del Sur\",H196,B196)))=0,\"\",IF('1. Autorización'!$I$6=\"Altiplano\",D196,IF('1. Autorización'!$I$6=\"Sur\",F196,IF('1. Autorización'!$I$6=\"Colegio Americano del Sur\",H196,B196))))","v":8040401}]
["MAESTRIA COMPORT. NO VERBAL Y DETECCION DE ENGAÑO",1473302,null,null,null,null,null,null,{"$f":"IF(IF('1. Autorización'!$I$6=\"Altiplano\",C197,IF('1. Autorización'!$I$6=\"Sur\",E197,IF('1. Autorización'!$I$6=\"Colegio Americano del Sur\",G197,A197)))=0,\"\",IF('1. Autorización'!$I$6=\"Altiplano\",C197,IF('1. Autorización'!$I$6=\"Sur\",E197,IF('1. Autorización'!$I$6=\"Colegio Americano del Sur\",G197,A197))))","v":"MAESTRIA COMPORT. NO VERBAL Y DETECCION DE ENGAÑO"},{"$f":"IF(IF('1. Autorización'!$I$6=\"Altiplano\",D197,IF('1. Autorización'!$I$6=\"Sur\",F197,IF('1. Autorización'!$I$6=\"Colegio Americano del Sur\",H197,B197)))=0,\"\",IF('1. Autorización'!$I$6=\"Altiplano\",D197,IF('1. Autorización'!$I$6=\"Sur\",F197,IF('1. Autorización'!$I$6=\"Colegio Americano del Sur\",H197,B197))))","v":1473302}]
["MAESTRIA EN ADMINISTRACION DE EMPRESAS MBA+",1473407,null,null,null,null,null,null,{"$f":"IF(IF('1. Autorización'!$I$6=\"Altiplano\",C198,IF('1. Autorización'!$I$6=\"Sur\",E198,IF('1. Autorización'!$I$6=\"Colegio Americano del Sur\",G198,A198)))=0,\"\",IF('1. Autorización'!$I$6=\"Altiplano\",C198,IF('1. Autorización'!$I$6=\"Sur\",E198,IF('1. Autorización'!$I$6=\"Colegio Americano del Sur\",G198,A198))))","v":"MAESTRIA EN ADMINISTRACION DE EMPRESAS MBA+"},{"$f":"IF(IF('1. Autorización'!$I$6=\"Altiplano\",D198,IF('1. Autorización'!$I$6=\"Sur\",F198,IF('1. Autorización'!$I$6=\"Colegio Americano del Sur\",H198,B198)))=0,\"\",IF('1. Autorización'!$I$6=\"Altiplano\",D198,IF('1. Autorización'!$I$6=\"Sur\",F198,IF('1. Autorización'!$I$6=\"Colegio Americano del Sur\",H198,B198))))","v":1473407}]
["MAESTRIA EN COACHING NUTRIC Y NVOS ENFOC ATENCION",1401612,null,null,null,null,null,null,{"$f":"IF(IF('1. Autorización'!$I$6=\"Altiplano\",C199,IF('1. Autorización'!$I$6=\"Sur\",E199,IF('1. Autorización'!$I$6=\"Colegio Americano del Sur\",G199,A199)))=0,\"\",IF('1. Autorización'!$I$6=\"Altiplano\",C199,IF('1. Autorización'!$I$6=\"Sur\",E199,IF('1. Autorización'!$I$6=\"Colegio Americano del Sur\",G199,A199))))","v":"MAESTRIA EN COACHING NUTRIC Y NVOS ENFOC ATENCION"},{"$f":"IF(IF('1. Autorización'!$I$6=\"Altiplano\",D199,IF('1. Autorización'!$I$6=\"Sur\",F199,IF('1. Autorización'!$I$6=\"Colegio Americano del Sur\",H199,B199)))=0,\"\",IF('1. Autorización'!$I$6=\"Altiplano\",D199,IF('1. Autorización'!$I$6=\"Sur\",F199,IF('1. Autorización'!$I$6=\"Colegio Americano del Sur\",H199,B199))))","v":1401612}]
["MAESTRIA EN CONSEJERIA PSICO Y SALUD MENT (EDUCON)",8020300,null,null,null,null,null,null,{"$f":"IF(IF('1. Autorización'!$I$6=\"Altiplano\",C200,IF('1. Autorización'!$I$6=\"Sur\",E200,IF('1. Autorización'!$I$6=\"Colegio Americano del Sur\",G200,A200)))=0,\"\",IF('1. Autorización'!$I$6=\"Altiplano\",C200,IF('1. Autorización'!$I$6=\"Sur\",E200,IF('1. Autorización'!$I$6=\"Colegio Americano del Sur\",G200,A200))))","v":"MAESTRIA EN CONSEJERIA PSICO Y SALUD MENT (EDUCON)"},{"$f":"IF(IF('1. Autorización'!$I$6=\"Altiplano\",D200,IF('1. Autorización'!$I$6=\"Sur\",F200,IF('1. Autorización'!$I$6=\"Colegio Americano del Sur\",H200,B200)))=0,\"\",IF('1. Autorización'!$I$6=\"Altiplano\",D200,IF('1. Autorización'!$I$6=\"Sur\",F200,IF('1. Autorización'!$I$6=\"Colegio Americano del Sur\",H200,B200))))","v":8020300}]
["MAESTRIA EN CONSEJERIA PSICOLOGICA Y SALUD MENTAL",1411000,null,null,null,null,null,null,{"$f":"IF(IF('1. Autorización'!$I$6=\"Altiplano\",C201,IF('1. Autorización'!$I$6=\"Sur\",E201,IF('1. Autorización'!$I$6=\"Colegio Americano del Sur\",G201,A201)))=0,\"\",IF('1. Autorización'!$I$6=\"Altiplano\",C201,IF('1. Autorización'!$I$6=\"Sur\",E201,IF('1. Autorización'!$I$6=\"Colegio Americano del Sur\",G201,A201))))","v":"MAESTRIA EN CONSEJERIA PSICOLOGICA Y SALUD MENTAL"},{"$f":"IF(IF('1. Autorización'!$I$6=\"Altiplano\",D201,IF('1. Autorización'!$I$6=\"Sur\",F201,IF('1. Autorización'!$I$6=\"Colegio Americano del Sur\",H201,B201)))=0,\"\",IF('1. Autorización'!$I$6=\"Altiplano\",D201,IF('1. Autorización'!$I$6=\"Sur\",F201,IF('1. Autorización'!$I$6=\"Colegio Americano del Sur\",H201,B201))))","v":1411000}]
["MAESTRIA EN CRIMINAL PROFILING",1473304,null,null,null,null,null,null,{"$f":"IF(IF('1. Autorización'!$I$6=\"Altiplano\",C202,IF('1. Autorización'!$I$6=\"Sur\",E202,IF('1. Autorización'!$I$6=\"Colegio Americano del Sur\",G202,A202)))=0,\"\",IF('1. Autorización'!$I$6=\"Altiplano\",C202,IF('1. Autorización'!$I$6=\"Sur\",E202,IF('1. Autorización'!$I$6=\"Colegio Americano del Sur\",G202,A202))))","v":"MAESTRIA EN CRIMINAL PROFILING"},{"$f":"IF(IF('1. Autorización'!$I$6=\"Altiplano\",D202,IF('1. Autorización'!$I$6=\"Sur\",F202,IF('1. Autorización'!$I$6=\"Colegio Americano del Sur\",H202,B202)))=0,\"\",IF('1. Autorización'!$I$6=\"Altiplano\",D202,IF('1. Autorización'!$I$6=\"Sur\",F202,IF('1. Autorización'!$I$6=\"Colegio Americano del Sur\",H202,B202))))","v":1473304}]
["MAESTRIA EN CURRICULO Y TECNOLOGIA EDUCATIVA",1421307,null,null,null,null,null,null,{"$f":"IF(IF('1. Autorización'!$I$6=\"Altiplano\",C203,IF('1. Autorización'!$I$6=\"Sur\",E203,IF('1. Autorización'!$I$6=\"Colegio Americano del Sur\",G203,A203)))=0,\"\",IF('1. Autorización'!$I$6=\"Altiplano\",C203,IF('1. Autorización'!$I$6=\"Sur\",E203,IF('1. Autorización'!$I$6=\"Colegio Americano del Sur\",G203,A203))))","v":"MAESTRIA EN CURRICULO Y TECNOLOGIA EDUCATIVA"},{"$f":"IF(IF('1. Autorización'!$I$6=\"Altiplano\",D203,IF('1. Autorización'!$I$6=\"Sur\",F203,IF('1. Autorización'!$I$6=\"Colegio Americano del Sur\",H203,B203)))=0,\"\",IF('1. Autorización'!$I$6=\"Altiplano\",D203,IF('1. Autorización'!$I$6=\"Sur\",F203,IF('1. Autorización'!$I$6=\"Colegio Americano del Sur\",H203,B203))))","v":1421307}]
["MAESTRIA EN DESARROLLO",1411100,null,null,null,null,null,null,{"$f":"IF(IF('1. Autorización'!$I$6=\"Altiplano\",C204,IF('1. Autorización'!$I$6=\"Sur\",E204,IF('1. Autorización'!$I$6=\"Colegio Americano del Sur\",G204,A204)))=0,\"\",IF('1. Autorización'!$I$6=\"Altiplano\",C204,IF('1. Autorización'!$I$6=\"Sur\",E204,IF('1. Autorización'!$I$6=\"Colegio Americano del Sur\",G204,A204))))","v":"MAESTRIA EN DESARROLLO"},{"$f":"IF(IF('1. Autorización'!$I$6=\"Altiplano\",D204,IF('1. Autorización'!$I$6=\"Sur\",F204,IF('1. Autorización'!$I$6=\"Colegio Americano del Sur\",H204,B204)))=0,\"\",IF('1. Autorización'!$I$6=\"Altiplano\",D204,IF('1. Autorización'!$I$6=\"Sur\",F204,IF('1. Autorización'!$I$6=\"Colegio Americano del Sur\",H204,B204))))","v":1411100}]
["MAESTRIA EN DESARROLLO (EDUCON)",8020500,null,null,null,null,null,null,{"$f":"IF(IF('1. Autorización'!$I$6=\"Altiplano\",C205,IF('1. Autorización'!$I$6=\"Sur\",E205,IF('1. Autorización'!$I$6=\"Colegio Americano del Sur\",G205,A205)))=0,\"\",IF('1. Autorización'!$I$6=\"Altiplano\",C205,IF('1. Autorización'!$I$6=\"Sur\",E205,IF('1. Autorización'!$I$6=\"Colegio Americano del Sur\",G205,A205))))","v":"MAESTRIA EN DESARROLLO (EDUCON)"},{"$f":"IF(IF('1. Autorización'!$I$6=\"Altiplano\",D205,IF('1. Autorización'!$I$6=\"Sur\",F205,IF('1. Autorización'!$I$6=\"Colegio Americano del Sur\",H205,B205)))=0,\"\",IF('1. Autorización'!$I$6=\"Altiplano\",D205,IF('1. Autorización'!$I$6=\"Sur\",F205,IF('1. Autorización'!$I$6=\"Colegio Americano del Sur\",H205,B205))))","v":8020500}]
["MAESTRIA EN DIRECCION Y GESTION DE PROYECTOS",1473405,null,null,null,null,null,null,{"$f":"IF(IF('1. Autorización'!$I$6=\"Altiplano\",C206,IF('1. Autorización'!$I$6=\"Sur\",E206,IF('1. Autorización'!$I$6=\"Colegio Americano del Sur\",G206,A206)))=0,\"\",IF('1. Autorización'!$I$6=\"Altiplano\",C206,IF('1. Autorización'!$I$6=\"Sur\",E206,IF('1. Autorización'!$I$6=\"Colegio Americano del Sur\",G206,A206))))","v":"MAESTRIA EN DIRECCION Y GESTION DE PROYECTOS"},{"$f":"IF(IF('1. Autorización'!$I$6=\"Altiplano\",D206,IF('1. Autorización'!$I$6=\"Sur\",F206,IF('1. Autorización'!$I$6=\"Colegio Americano del Sur\",H206,B206)))=0,\"\",IF('1. Autorización'!$I$6=\"Altiplano\",D206,IF('1. Autorización'!$I$6=\"Sur\",F206,IF('1. Autorización'!$I$6=\"Colegio Americano del Sur\",H206,B206))))","v":1473405}]
["MAESTRIA EN DOCENCIA SUPERIOR",1421304,null,null,null,null,null,null,{"$f":"IF(IF('1. Autorización'!$I$6=\"Altiplano\",C207,IF('1. Autorización'!$I$6=\"Sur\",E207,IF('1. Autorización'!$I$6=\"Colegio Americano del Sur\",G207,A207)))=0,\"\",IF('1. Autorización'!$I$6=\"Altiplano\",C207,IF('1. Autorización'!$I$6=\"Sur\",E207,IF('1. Autorización'!$I$6=\"Colegio Americano del Sur\",G207,A207))))","v":"MAESTRIA EN DOCENCIA SUPERIOR"},{"$f":"IF(IF('1. Autorización'!$I$6=\"Altiplano\",D207,IF('1. Autorización'!$I$6=\"Sur\",F207,IF('1. Autorización'!$I$6=\"Colegio Americano del Sur\",H207,B207)))=0,\"\",IF('1. Autorización'!$I$6=\"Altiplano\",D207,IF('1. Autorización'!$I$6=\"Sur\",F207,IF('1. Autorización'!$I$6=\"Colegio Americano del Sur\",H207,B207))))","v":1421304}]
["MAESTRIA EN DOCENCIA SUPERIOR E INNOVACION",1421312,null,null,null,null,null,null,{"$f":"IF(IF('1. Autorización'!$I$6=\"Altiplano\",C208,IF('1. Autorización'!$I$6=\"Sur\",E208,IF('1. Autorización'!$I$6=\"Colegio Americano del Sur\",G208,A208)))=0,\"\",IF('1. Autorización'!$I$6=\"Altiplano\",C208,IF('1. Autorización'!$I$6=\"Sur\",E208,IF('1. Autorización'!$I$6=\"Colegio Americano del Sur\",G208,A208))))","v":"MAESTRIA EN DOCENCIA SUPERIOR E INNOVACION"},{"$f":"IF(IF('1. Autorización'!$I$6=\"Altiplano\",D208,IF('1. Autorización'!$I$6=\"Sur\",F208,IF('1. Autorización'!$I$6=\"Colegio Americano del Sur\",H208,B208)))=0,\"\",IF('1. Autorización'!$I$6=\"Altiplano\",D208,IF('1. Autorización'!$I$6=\"Sur\",F208,IF('1. Autorización'!$I$6=\"Colegio Americano del Sur\",H208,B208))))","v":1421312}]
["MAESTRIA EN EPIDEMIOLOGIA",1402701,null,null,null,null,null,null,{"$f":"IF(IF('1. Autorización'!$I$6=\"Altiplano\",C209,IF('1. Autorización'!$I$6=\"Sur\",E209,IF('1. Autorización'!$I$6=\"Colegio Americano del Sur\",G209,A209)))=0,\"\",IF('1. Autorización'!$I$6=\"Altiplano\",C209,IF('1. Autorización'!$I$6=\"Sur\",E209,IF('1. Autorización'!$I$6=\"Colegio Americano del Sur\",G209,A209))))","v":"MAESTRIA EN EPIDEMIOLOGIA"},{"$f":"IF(IF('1. Autorización'!$I$6=\"Altiplano\",D209,IF('1. Autorización'!$I$6=\"Sur\",F209,IF('1. Autorización'!$I$6=\"Colegio Americano del Sur\",H209,B209)))=0,\"\",IF('1. Autorización'!$I$6=\"Altiplano\",D209,IF('1. Autorización'!$I$6=\"Sur\",F209,IF('1. Autorización'!$I$6=\"Colegio Americano del Sur\",H209,B209))))","v":1402701}]
["MAESTRIA EN FINANZAS AVANZADAS",1473406,null,null,null,null,null,null,{"$f":"IF(IF('1. Autorización'!$I$6=\"Altiplano\",C210,IF('1. Autorización'!$I$6=\"Sur\",E210,IF('1. Autorización'!$I$6=\"Colegio Americano del Sur\",G210,A210)))=0,\"\",IF('1. Autorización'!$I$6=\"Altiplano\",C210,IF('1. Autorización'!$I$6=\"Sur\",E210,IF('1. Autorización'!$I$6=\"Colegio Americano del Sur\",G210,A210))))","v":"MAESTRIA EN FINANZAS AVANZADAS"},{"$f":"IF(IF('1. Autorización'!$I$6=\"Altiplano\",D210,IF('1. Autorización'!$I$6=\"Sur\",F210,IF('1. Autorización'!$I$6=\"Colegio Americano del Sur\",H210,B210)))=0,\"\",IF('1. Autorización'!$I$6=\"Altiplano\",D210,IF('1. Autorización'!$I$6=\"Sur\",F210,IF('1. Autorización'!$I$6=\"Colegio Americano del Sur\",H210,B210))))","v":1473406}]
["MAESTRIA EN GESTION AMBIENTAL Y SOSTENIBILIDAD",1403201,null,null,null,null,null,null,{"$f":"IF(IF('1. Autorización'!$I$6=\"Altiplano\",C211,IF('1. Autorización'!$I$6=\"Sur\",E211,IF('1. Autorización'!$I$6=\"Colegio Americano del Sur\",G211,A211)))=0,\"\",IF('1. Autorización'!$I$6=\"Altiplano\",C211,IF('1. Autorización'!$I$6=\"Sur\",E211,IF('1. Autorización'!$I$6=\"Colegio Americano del Sur\",G211,A211))))","v":"MAESTRIA EN GESTION AMBIENTAL Y SOSTENIBILIDAD"},{"$f":"IF(IF('1. Autorización'!$I$6=\"Altiplano\",D211,IF('1. Autorización'!$I$6=\"Sur\",F211,IF('1. Autorización'!$I$6=\"Colegio Americano del Sur\",H211,B211)))=0,\"\",IF('1. Autorización'!$I$6=\"Altiplano\",D211,IF('1. Autorización'!$I$6=\"Sur\",F211,IF('1. Autorización'!$I$6=\"Colegio Americano del Sur\",H211,B211))))","v":1403201}]
["MAESTRIA EN GESTION DE PATRIMONIO ENFASIS EN MUSEO",1411600,null,null,null,null,null,null,{"$f":"IF(IF('1. Autorización'!$I$6=\"Altiplano\",C212,IF('1. Autorización'!$I$6=\"Sur\",E212,IF('1. Autorización'!$I$6=\"Colegio Americano del Sur\",G212,A212)))=0,\"\",IF('1. Autorización'!$I$6=\"Altiplano\",C212,IF('1. Autorización'!$I$6=\"Sur\",E212,IF('1. Autorización'!$I$6=\"Colegio Americano del Sur\",G212,A212))))","v":"MAESTRIA EN GESTION DE PATRIMONIO ENFASIS EN MUSEO"},{"$f":"IF(IF('1. Autorización'!$I$6=\"Altiplano\",D212,IF('1. Autorización'!$I$6=\"Sur\",F212,IF('1. Autorización'!$I$6=\"Colegio Americano del Sur\",H212,B212)))=0,\"\",IF('1. Autorización'!$I$6=\"Altiplano\",D212,IF('1. Autorización'!$I$6=\"Sur\",F212,IF('1. Autorización'!$I$6=\"Colegio Americano del Sur\",H212,B212))))","v":1411600}]
["MAESTRIA EN GESTION DEL TALENTO HUMANO",1473301,null,null,null,null,null,null,{"$f":"IF(IF('1. Autorización'!$I$6=\"Altiplano\",C213,IF('1. Autorización'!$I$6=\"Sur\",E213,IF('1. Autorización'!$I$6=\"Colegio Americano del Sur\",G213,A213)))=0,\"\",IF('1. Autorización'!$I$6=\"Altiplano\",C213,IF('1. Autorización'!$I$6=\"Sur\",E213,IF('1. Autorización'!$I$6=\"Colegio Americano del Sur\",G213,A213))))","v":"MAESTRIA EN GESTION DEL TALENTO HUMANO"},{"$f":"IF(IF('1. Autorización'!$I$6=\"Altiplano\",D213,IF('1. Autorización'!$I$6=\"Sur\",F213,IF('1. Autorización'!$I$6=\"Colegio Americano del Sur\",H213,B213)))=0,\"\",IF('1. Autorización'!$I$6=\"Altiplano\",D213,IF('1. Autorización'!$I$6=\"Sur\",F213,IF('1. Autorización'!$I$6=\"Colegio Americano del Sur\",H213,B213))))","v":1473301}]
["MAESTRIA EN LIDERAZGO Y COACHING EDUCATIVO",1421308,null,null,null,null,null,null,{"$f":"IF(IF('1. Autorización'!$I$6=\"Altiplano\",C214,IF('1. Autorización'!$I$6=\"Sur\",E214,IF('1. Autorización'!$I$6=\"Colegio Americano del Sur\",G214,A214)))=0,\"\",IF('1. Autorización'!$I$6=\"Altiplano\",C214,IF('1. Autorización'!$I$6=\"Sur\",E214,IF('1. Autorización'!$I$6=\"Colegio Americano del Sur\",G214,A214))))","v":"MAESTRIA EN LIDERAZGO Y COACHING EDUCATIVO"},{"$f":"IF(IF('1. Autorización'!$I$6=\"Altiplano\",D214,IF('1. Autorización'!$I$6=\"Sur\",F214,IF('1. Autorización'!$I$6=\"Colegio Americano del Sur\",H214,B214)))=0,\"\",IF('1. Autorización'!$I$6=\"Altiplano\",D214,IF('1. Autorización'!$I$6=\"Sur\",F214,IF('1. Autorización'!$I$6=\"Colegio Americano del Sur\",H214,B214))))","v":1421308}]
["MAESTRIA EN MEDICION EVALUACION E INVEST.EDUCATIVA",1421303,null,null,null,null,null,null,{"$f":"IF(IF('1. Autorización'!$I$6=\"Altiplano\",C215,IF('1. Autorización'!$I$6=\"Sur\",E215,IF('1. Autorización'!$I$6=\"Colegio Americano del Sur\",G215,A215)))=0,\"\",IF('1. Autorización'!$I$6=\"Altiplano\",C215,IF('1. Autorización'!$I$6=\"Sur\",E215,IF('1. Autorización'!$I$6=\"Colegio Americano del Sur\",G215,A215))))","v":"MAESTRIA EN MEDICION EVALUACION E INVEST.EDUCATIVA"},{"$f":"IF(IF('1. Autorización'!$I$6=\"Altiplano\",D215,IF('1. Autorización'!$I$6=\"Sur\",F215,IF('1. Autorización'!$I$6=\"Colegio Americano del Sur\",H215,B215)))=0,\"\",IF('1. Autorización'!$I$6=\"Altiplano\",D215,IF('1. Autorización'!$I$6=\"Sur\",F215,IF('1. Autorización'!$I$6=\"Colegio Americano del Sur\",H215,B215))))","v":1421303}]
["MAESTRIA EN MODELADO Y GEST. DE PROY. DE CONSTRUCC",1470114,null,null,null,null,null,null,{"$f":"IF(IF('1. Autorización'!$I$6=\"Altiplano\",C216,IF('1. Autorización'!$I$6=\"Sur\",E216,IF('1. Autorización'!$I$6=\"Colegio Americano del Sur\",G216,A216)))=0,\"\",IF('1. Autorización'!$I$6=\"Altiplano\",C216,IF('1. Autorización'!$I$6=\"Sur\",E216,IF('1. Autorización'!$I$6=\"Colegio Americano del Sur\",G216,A216))))","v":"MAESTRIA EN MODELADO Y GEST. DE PROY. DE CONSTRUCC"},{"$f":"IF(IF('1. Autorización'!$I$6=\"Altiplano\",D216,IF('1. Autorización'!$I$6=\"Sur\",F216,IF('1. Autorización'!$I$6=\"Colegio Americano del Sur\",H216,B216)))=0,\"\",IF('1. Autorización'!$I$6=\"Altiplano\",D216,IF('1. Autorización'!$I$6=\"Sur\",F216,IF('1. Autorización'!$I$6=\"Colegio Americano del Sur\",H216,B216))))","v":1470114}]
["MAESTRIA EN NEUROPSICOLOGIA CLINICA",1411400,null,null,null,null,null,null,{"$f":"IF(IF('1. Autorización'!$I$6=\"Altiplano\",C217,IF('1. Autorización'!$I$6=\"Sur\",E217,IF('1. Autorización'!$I$6=\"Colegio Americano del Sur\",G217,A217)))=0,\"\",IF('1. Autorización'!$I$6=\"Altiplano\",C217,IF('1. Autorización'!$I$6=\"Sur\",E217,IF('1. Autorización'!$I$6=\"Colegio Americano del Sur\",G217,A217))))","v":"MAESTRIA EN NEUROPSICOLOGIA CLINICA"},{"$f":"IF(IF('1. Autorización'!$I$6=\"Altiplano\",D217,IF('1. Autorización'!$I$6=\"Sur\",F217,IF('1. Autorización'!$I$6=\"Colegio Americano del Sur\",H217,B217)))=0,\"\",IF('1. Autorización'!$I$6=\"Altiplano\",D217,IF('1. Autorización'!$I$6=\"Sur\",F217,IF('1. Autorización'!$I$6=\"Colegio Americano del Sur\",H217,B217))))","v":1411400}]
["MAESTRIA EN NEUROPSICOLOGIA CLINICA (EDUCON)",8020400,null,null,null,null,null,null,{"$f":"IF(IF('1. Autorización'!$I$6=\"Altiplano\",C218,IF('1. Autorización'!$I$6=\"Sur\",E218,IF('1. Autorización'!$I$6=\"Colegio Americano del Sur\",G218,A218)))=0,\"\",IF('1. Autorización'!$I$6=\"Altiplano\",C218,IF('1. Autorización'!$I$6=\"Sur\",E218,IF('1. Autorización'!$I$6=\"Colegio Americano del Sur\",G218,A218))))","v":"MAESTRIA EN NEUROPSICOLOGIA CLINICA (EDUCON)"},{"$f":"IF(IF('1. Autorización'!$I$6=\"Altiplano\",D218,IF('1. Autorización'!$I$6=\"Sur\",F218,IF('1. Autorización'!$I$6=\"Colegio Americano del Sur\",H218,B218)))=0,\"\",IF('1. Autorización'!$I$6=\"Altiplano\",D218,IF('1. Autorización'!$I$6=\"Sur\",F218,IF('1. Autorización'!$I$6=\"Colegio Americano del Sur\",H218,B218))))","v":8020400}]
["MAESTRIA EN NEUROPSICOLOGIA CLINICA (SERVICIOS)",9100100,null,null,null,null,null,null,{"$f":"IF(IF('1. Autorización'!$I$6=\"Altiplano\",C219,IF('1. Autorización'!$I$6=\"Sur\",E219,IF('1. Autorización'!$I$6=\"Colegio Americano del Sur\",G219,A219)))=0,\"\",IF('1. Autorización'!$I$6=\"Altiplano\",C219,IF('1. Autorización'!$I$6=\"Sur\",E219,IF('1. Autorización'!$I$6=\"Colegio Americano del Sur\",G219,A219))))","v":"MAESTRIA EN NEUROPSICOLOGIA CLINICA (SERVICIOS)"},{"$f":"IF(IF('1. Autorización'!$I$6=\"Altiplano\",D219,IF('1. Autorización'!$I$6=\"Sur\",F219,IF('1. Autorización'!$I$6=\"Colegio Americano del Sur\",H219,B219)))=0,\"\",IF('1. Autorización'!$I$6=\"Altiplano\",D219,IF('1. Autorización'!$I$6=\"Sur\",F219,IF('1. Autorización'!$I$6=\"Colegio Americano del Sur\",H219,B219))))","v":9100100}]
["MAESTRIA EN NUTRICION EN LA ACT FISICA Y DEPORTE",1401611,null,null,null,null,null,null,{"$f":"IF(IF('1. Autorización'!$I$6=\"Altiplano\",C220,IF('1. Autorización'!$I$6=\"Sur\",E220,IF('1. Autorización'!$I$6=\"Colegio Americano del Sur\",G220,A220)))=0,\"\",IF('1. Autorización'!$I$6=\"Altiplano\",C220,IF('1. Autorización'!$I$6=\"Sur\",E220,IF('1. Autorización'!$I$6=\"Colegio Americano del Sur\",G220,A220))))","v":"MAESTRIA EN NUTRICION EN LA ACT FISICA Y DEPORTE"},{"$f":"IF(IF('1. Autorización'!$I$6=\"Altiplano\",D220,IF('1. Autorización'!$I$6=\"Sur\",F220,IF('1. Autorización'!$I$6=\"Colegio Americano del Sur\",H220,B220)))=0,\"\",IF('1. Autorización'!$I$6=\"Altiplano\",D220,IF('1. Autorización'!$I$6=\"Sur\",F220,IF('1. Autorización'!$I$6=\"Colegio Americano del Sur\",H220,B220))))","v":1401611}]
["MAESTRIA EN PERFILACION DE LA PERSONALIDAD",1473303,null,null,null,null,null,null,{"$f":"IF(IF('1. Autorización'!$I$6=\"Altiplano\",C221,IF('1. Autorización'!$I$6=\"Sur\",E221,IF('1. Autorización'!$I$6=\"Colegio Americano del Sur\",G221,A221)))=0,\"\",IF('1. Autorización'!$I$6=\"Altiplano\",C221,IF('1. Autorización'!$I$6=\"Sur\",E221,IF('1. Autorización'!$I$6=\"Colegio Americano del Sur\",G221,A221))))","v":"MAESTRIA EN PERFILACION DE LA PERSONALIDAD"},{"$f":"IF(IF('1. Autorización'!$I$6=\"Altiplano\",D221,IF('1. Autorización'!$I$6=\"Sur\",F221,IF('1. Autorización'!$I$6=\"Colegio Americano del Sur\",H221,B221)))=0,\"\",IF('1. Autorización'!$I$6=\"Altiplano\",D221,IF('1. Autorización'!$I$6=\"Sur\",F221,IF('1. Autorización'!$I$6=\"Colegio Americano del Sur\",H221,B221))))","v":1473303}]
["MAESTRIA EN TECNOLOGIA DE ALIMENTOS Y GESTION",1473501,null,null,null,null,null,null,{"$f":"IF(IF('1. Autorización'!$I$6=\"Altiplano\",C222,IF('1. Autorización'!$I$6=\"Sur\",E222,IF('1. Autorización'!$I$6=\"Colegio Americano del Sur\",G222,A222)))=0,\"\",IF('1. Autorización'!$I$6=\"Altiplano\",C222,IF('1. Autorización'!$I$6=\"Sur\",E222,IF('1. Autorización'!$I$6=\"Colegio Americano del Sur\",G222,A222))))","v":"MAESTRIA EN TECNOLOGIA DE ALIMENTOS Y GESTION"},{"$f":"IF(IF('1. Autorización'!$I$6=\"Altiplano\",D222,IF('1. Autorización'!$I$6=\"Sur\",F222,IF('1. Autorización'!$I$6=\"Colegio Americano del Sur\",H222,B222)))=0,\"\",IF('1. Autorización'!$I$6=\"Altiplano\",D222,IF('1. Autorización'!$I$6=\"Sur\",F222,IF('1. Autorización'!$I$6=\"Colegio Americano del Sur\",H222,B222))))","v":1473501}]
["MAESTRIA EN TECNOLOGIA Y SOSTENIBILIDAD ENERGETICA",1470413,null,null,null,null,null,null,{"$f":"IF(IF('1. Autorización'!$I$6=\"Altiplano\",C223,IF('1. Autorización'!$I$6=\"Sur\",E223,IF('1. Autorización'!$I$6=\"Colegio Americano del Sur\",G223,A223)))=0,\"\",IF('1. Autorización'!$I$6=\"Altiplano\",C223,IF('1. Autorización'!$I$6=\"Sur\",E223,IF('1. Autorización'!$I$6=\"Colegio Americano del Sur\",G223,A223))))","v":"MAESTRIA EN TECNOLOGIA Y SOSTENIBILIDAD ENERGETICA"},{"$f":"IF(IF('1. Autorización'!$I$6=\"Altiplano\",D223,IF('1. Autorización'!$I$6=\"Sur\",F223,IF('1. Autorización'!$I$6=\"Colegio Americano del Sur\",H223,B223)))=0,\"\",IF('1. Autorización'!$I$6=\"Altiplano\",D223,IF('1. Autorización'!$I$6=\"Sur\",F223,IF('1. Autorización'!$I$6=\"Colegio Americano del Sur\",H223,B223))))","v":1470413}]
["MAESTRIA EN TURISMO SOSTENIBLE",1403001,null,null,null,null,null,null,{"$f":"IF(IF('1. Autorización'!$I$6=\"Altiplano\",C224,IF('1. Autorización'!$I$6=\"Sur\",E224,IF('1. Autorización'!$I$6=\"Colegio Americano del Sur\",G224,A224)))=0,\"\",IF('1. Autorización'!$I$6=\"Altiplano\",C224,IF('1. Autorización'!$I$6=\"Sur\",E224,IF('1. Autorización'!$I$6=\"Colegio Americano del Sur\",G224,A224))))","v":"MAESTRIA EN TURISMO SOSTENIBLE"},{"$f":"IF(IF('1. Autorización'!$I$6=\"Altiplano\",D224,IF('1. Autorización'!$I$6=\"Sur\",F224,IF('1. Autorización'!$I$6=\"Colegio Americano del Sur\",H224,B224)))=0,\"\",IF('1. Autorización'!$I$6=\"Altiplano\",D224,IF('1. Autorización'!$I$6=\"Sur\",F224,IF('1. Autorización'!$I$6=\"Colegio Americano del Sur\",H224,B224))))","v":1403001}]
["MAESTRIA GESTION Y EVALU. DE SISTEMAS PRODUCTIVOS",1470414,null,null,null,null,null,null,{"$f":"IF(IF('1. Autorización'!$I$6=\"Altiplano\",C225,IF('1. Autorización'!$I$6=\"Sur\",E225,IF('1. Autorización'!$I$6=\"Colegio Americano del Sur\",G225,A225)))=0,\"\",IF('1. Autorización'!$I$6=\"Altiplano\",C225,IF('1. Autorización'!$I$6=\"Sur\",E225,IF('1. Autorización'!$I$6=\"Colegio Americano del Sur\",G225,A225))))","v":"MAESTRIA GESTION Y EVALU. DE SISTEMAS PRODUCTIVOS"},{"$f":"IF(IF('1. Autorización'!$I$6=\"Altiplano\",D225,IF('1. Autorización'!$I$6=\"Sur\",F225,IF('1. Autorización'!$I$6=\"Colegio Americano del Sur\",H225,B225)))=0,\"\",IF('1. Autorización'!$I$6=\"Altiplano\",D225,IF('1. Autorización'!$I$6=\"Sur\",F225,IF('1. Autorización'!$I$6=\"Colegio Americano del Sur\",H225,B225))))","v":1470414}]
["MAESTRIAS EN EPIDEMIOLOGIA (EDUCON)",8030600,null,null,null,null,null,null,{"$f":"IF(IF('1. Autorización'!$I$6=\"Altiplano\",C226,IF('1. Autorización'!$I$6=\"Sur\",E226,IF('1. Autorización'!$I$6=\"Colegio Americano del Sur\",G226,A226)))=0,\"\",IF('1. Autorización'!$I$6=\"Altiplano\",C226,IF('1. Autorización'!$I$6=\"Sur\",E226,IF('1. Autorización'!$I$6=\"Colegio Americano del Sur\",G226,A226))))","v":"MAESTRIAS EN EPIDEMIOLOGIA (EDUCON)"},{"$f":"IF(IF('1. Autorización'!$I$6=\"Altiplano\",D226,IF('1. Autorización'!$I$6=\"Sur\",F226,IF('1. Autorización'!$I$6=\"Colegio Americano del Sur\",H226,B226)))=0,\"\",IF('1. Autorización'!$I$6=\"Altiplano\",D226,IF('1. Autorización'!$I$6=\"Sur\",F226,IF('1. Autorización'!$I$6=\"Colegio Americano del Sur\",H226,B226))))","v":8030600}]
["MAESTRIAS EN TEC DE ALIMENTOS (EDUCON)",8010800,null,null,null,null,null,null,{"$f":"IF(IF('1. Autorización'!$I$6=\"Altiplano\",C227,IF('1. Autorización'!$I$6=\"Sur\",E227,IF('1. Autorización'!$I$6=\"Colegio Americano del Sur\",G227,A227)))=0,\"\",IF('1. Autorización'!$I$6=\"Altiplano\",C227,IF('1. Autorización'!$I$6=\"Sur\",E227,IF('1. Autorización'!$I$6=\"Colegio Americano del Sur\",G227,A227))))","v":"MAESTRIAS EN TEC DE ALIMENTOS (EDUCON)"},{"$f":"IF(IF('1. Autorización'!$I$6=\"Altiplano\",D227,IF('1. Autorización'!$I$6=\"Sur\",F227,IF('1. Autorización'!$I$6=\"Colegio Americano del Sur\",H227,B227)))=0,\"\",IF('1. Autorización'!$I$6=\"Altiplano\",D227,IF('1. Autorización'!$I$6=\"Sur\",F227,IF('1. Autorización'!$I$6=\"Colegio Americano del Sur\",H227,B227))))","v":8010800}]
["MAESTRIAS Y LICENCIATURA EN EDUCACION (EDUCON)",8040400,null,null,null,null,null,null,{"$f":"IF(IF('1. Autorización'!$I$6=\"Altiplano\",C228,IF('1. Autorización'!$I$6=\"Sur\",E228,IF('1. Autorización'!$I$6=\"Colegio Americano del Sur\",G228,A228)))=0,\"\",IF('1. Autorización'!$I$6=\"Altiplano\",C228,IF('1. Autorización'!$I$6=\"Sur\",E228,IF('1. Autorización'!$I$6=\"Colegio Americano del Sur\",G228,A228))))","v":"MAESTRIAS Y LICENCIATURA EN EDUCACION (EDUCON)"},{"$f":"IF(IF('1. Autorización'!$I$6=\"Altiplano\",D228,IF('1. Autorización'!$I$6=\"Sur\",F228,IF('1. Autorización'!$I$6=\"Colegio Americano del Sur\",H228,B228)))=0,\"\",IF('1. Autorización'!$I$6=\"Altiplano\",D228,IF('1. Autorización'!$I$6=\"Sur\",F228,IF('1. Autorización'!$I$6=\"Colegio Americano del Sur\",H228,B228))))","v":8040400}]
["MAKER SPACE",1470002,null,null,null,null,null,null,{"$f":"IF(IF('1. Autorización'!$I$6=\"Altiplano\",C229,IF('1. Autorización'!$I$6=\"Sur\",E229,IF('1. Autorización'!$I$6=\"Colegio Americano del Sur\",G229,A229)))=0,\"\",IF('1. Autorización'!$I$6=\"Altiplano\",C229,IF('1. Autorización'!$I$6=\"Sur\",E229,IF('1. Autorización'!$I$6=\"Colegio Americano del Sur\",G229,A229))))","v":"MAKER SPACE"},{"$f":"IF(IF('1. Autorización'!$I$6=\"Altiplano\",D229,IF('1. Autorización'!$I$6=\"Sur\",F229,IF('1. Autorización'!$I$6=\"Colegio Americano del Sur\",H229,B229)))=0,\"\",IF('1. Autorización'!$I$6=\"Altiplano\",D229,IF('1. Autorización'!$I$6=\"Sur\",F229,IF('1. Autorización'!$I$6=\"Colegio Americano del Sur\",H229,B229))))","v":1470002}]
["MASTER IN BUSINESS INTELLIGENCE AND ANALYTICS",1473404,null,null,null,null,null,null,{"$f":"IF(IF('1. Autorización'!$I$6=\"Altiplano\",C230,IF('1. Autorización'!$I$6=\"Sur\",E230,IF('1. Autorización'!$I$6=\"Colegio Americano del Sur\",G230,A230)))=0,\"\",IF('1. Autorización'!$I$6=\"Altiplano\",C230,IF('1. Autorización'!$I$6=\"Sur\",E230,IF('1. Autorización'!$I$6=\"Colegio Americano del Sur\",G230,A230))))","v":"MASTER IN BUSINESS INTELLIGENCE AND ANALYTICS"},{"$f":"IF(IF('1. Autorización'!$I$6=\"Altiplano\",D230,IF('1. Autorización'!$I$6=\"Sur\",F230,IF('1. Autorización'!$I$6=\"Colegio Americano del Sur\",H230,B230)))=0,\"\",IF('1. Autorización'!$I$6=\"Altiplano\",D230,IF('1. Autorización'!$I$6=\"Sur\",F230,IF('1. Autorización'!$I$6=\"Colegio Americano del Sur\",H230,B230))))","v":1473404}]
["MASTER IN FOOD INNOVATION & GLOBAL MANAGEMENT",1473502,null,null,null,null,null,null,{"$f":"IF(IF('1. Autorización'!$I$6=\"Altiplano\",C231,IF('1. Autorización'!$I$6=\"Sur\",E231,IF('1. Autorización'!$I$6=\"Colegio Americano del Sur\",G231,A231)))=0,\"\",IF('1. Autorización'!$I$6=\"Altiplano\",C231,IF('1. Autorización'!$I$6=\"Sur\",E231,IF('1. Autorización'!$I$6=\"Colegio Americano del Sur\",G231,A231))))","v":"MASTER IN FOOD INNOVATION & GLOBAL MANAGEMENT"},{"$f":"IF(IF('1. Autorización'!$I$6=\"Altiplano\",D231,IF('1. Autorización'!$I$6=\"Sur\",F231,IF('1. Autorización'!$I$6=\"Colegio Americano del Sur\",H231,B231)))=0,\"\",IF('1. Autorización'!$I$6=\"Altiplano\",D231,IF('1. Autorización'!$I$6=\"Sur\",F231,IF('1. Autorización'!$I$6=\"Colegio Americano del Sur\",H231,B231))))","v":1473502}]
["MASTER IN SECURITY DATA SCIENCE AND CYBERSECURITY",1470213,null,null,null,null,null,null,{"$f":"IF(IF('1. Autorización'!$I$6=\"Altiplano\",C232,IF('1. Autorización'!$I$6=\"Sur\",E232,IF('1. Autorización'!$I$6=\"Colegio Americano del Sur\",G232,A232)))=0,\"\",IF('1. Autorización'!$I$6=\"Altiplano\",C232,IF('1. Autorización'!$I$6=\"Sur\",E232,IF('1. Autorización'!$I$6=\"Colegio Americano del Sur\",G232,A232))))","v":"MASTER IN SECURITY DATA SCIENCE AND CYBERSECURITY"},{"$f":"IF(IF('1. Autorización'!$I$6=\"Altiplano\",D232,IF('1. Autorización'!$I$6=\"Sur\",F232,IF('1. Autorización'!$I$6=\"Colegio Americano del Sur\",H232,B232)))=0,\"\",IF('1. Autorización'!$I$6=\"Altiplano\",D232,IF('1. Autorización'!$I$6=\"Sur\",F232,IF('1. Autorización'!$I$6=\"Colegio Americano del Sur\",H232,B232))))","v":1470213}]
["MERCADEO",1372101,null,null,null,null,null,null,{"$f":"IF(IF('1. Autorización'!$I$6=\"Altiplano\",C233,IF('1. Autorización'!$I$6=\"Sur\",E233,IF('1. Autorización'!$I$6=\"Colegio Americano del Sur\",G233,A233)))=0,\"\",IF('1. Autorización'!$I$6=\"Altiplano\",C233,IF('1. Autorización'!$I$6=\"Sur\",E233,IF('1. Autorización'!$I$6=\"Colegio Americano del Sur\",G233,A233))))","v":"MERCADEO"},{"$f":"IF(IF('1. Autorización'!$I$6=\"Altiplano\",D233,IF('1. Autorización'!$I$6=\"Sur\",F233,IF('1. Autorización'!$I$6=\"Colegio Americano del Sur\",H233,B233)))=0,\"\",IF('1. Autorización'!$I$6=\"Altiplano\",D233,IF('1. Autorización'!$I$6=\"Sur\",F233,IF('1. Autorización'!$I$6=\"Colegio Americano del Sur\",H233,B233))))","v":1372101}]
["MUSICA (EDUCON)",8040200,null,null,null,null,null,null,{"$f":"IF(IF('1. Autorización'!$I$6=\"Altiplano\",C234,IF('1. Autorización'!$I$6=\"Sur\",E234,IF('1. Autorización'!$I$6=\"Colegio Americano del Sur\",G234,A234)))=0,\"\",IF('1. Autorización'!$I$6=\"Altiplano\",C234,IF('1. Autorización'!$I$6=\"Sur\",E234,IF('1. Autorización'!$I$6=\"Colegio Americano del Sur\",G234,A234))))","v":"MUSICA (EDUCON)"},{"$f":"IF(IF('1. Autorización'!$I$6=\"Altiplano\",D234,IF('1. Autorización'!$I$6=\"Sur\",F234,IF('1. Autorización'!$I$6=\"Colegio Americano del Sur\",H234,B234)))=0,\"\",IF('1. Autorización'!$I$6=\"Altiplano\",D234,IF('1. Autorización'!$I$6=\"Sur\",F234,IF('1. Autorización'!$I$6=\"Colegio Americano del Sur\",H234,B234))))","v":8040200}]
["NUEVO EDIFICIO",1360314,null,null,null,null,null,null,{"$f":"IF(IF('1. Autorización'!$I$6=\"Altiplano\",C235,IF('1. Autorización'!$I$6=\"Sur\",E235,IF('1. Autorización'!$I$6=\"Colegio Americano del Sur\",G235,A235)))=0,\"\",IF('1. Autorización'!$I$6=\"Altiplano\",C235,IF('1. Autorización'!$I$6=\"Sur\",E235,IF('1. Autorización'!$I$6=\"Colegio Americano del Sur\",G235,A235))))","v":"NUEVO EDIFICIO"},{"$f":"IF(IF('1. Autorización'!$I$6=\"Altiplano\",D235,IF('1. Autorización'!$I$6=\"Sur\",F235,IF('1. Autorización'!$I$6=\"Colegio Americano del Sur\",H235,B235)))=0,\"\",IF('1. Autorización'!$I$6=\"Altiplano\",D235,IF('1. Autorización'!$I$6=\"Sur\",F235,IF('1. Autorización'!$I$6=\"Colegio Americano del Sur\",H235,B235))))","v":1360314}]
["NUTRICION (EDUCON)",8030400,null,null,null,null,null,null,{"$f":"IF(IF('1. Autorización'!$I$6=\"Altiplano\",C236,IF('1. Autorización'!$I$6=\"Sur\",E236,IF('1. Autorización'!$I$6=\"Colegio Americano del Sur\",G236,A236)))=0,\"\",IF('1. Autorización'!$I$6=\"Altiplano\",C236,IF('1. Autorización'!$I$6=\"Sur\",E236,IF('1. Autorización'!$I$6=\"Colegio Americano del Sur\",G236,A236))))","v":"NUTRICION (EDUCON)"},{"$f":"IF(IF('1. Autorización'!$I$6=\"Altiplano\",D236,IF('1. Autorización'!$I$6=\"Sur\",F236,IF('1. Autorización'!$I$6=\"Colegio Americano del Sur\",H236,B236)))=0,\"\",IF('1. Autorización'!$I$6=\"Altiplano\",D236,IF('1. Autorización'!$I$6=\"Sur\",F236,IF('1. Autorización'!$I$6=\"Colegio Americano del Sur\",H236,B236))))","v":8030400}]
["NUTRICION DEPORTIVA NIVEL 2",8103808,null,null,null,null,null,null,{"$f":"IF(IF('1. Autorización'!$I$6=\"Altiplano\",C237,IF('1. Autorización'!$I$6=\"Sur\",E237,IF('1. Autorización'!$I$6=\"Colegio Americano del Sur\",E237,A237)))=0,\"\",IF('1. Autorización'!$I$6=\"Altiplano\",C237,IF('1. Autorización'!$I$6=\"Sur\",E237,IF('1. Autorización'!$I$6=\"Colegio Americano del Sur\",E237,A237))))","v":"NUTRICION DEPORTIVA NIVEL 2"},{"$f":"IF(IF('1. Autorización'!$I$6=\"Altiplano\",D237,IF('1. Autorización'!$I$6=\"Sur\",F237,IF('1. Autorización'!$I$6=\"Colegio Americano del Sur\",H237,B237)))=0,\"\",IF('1. Autorización'!$I$6=\"Altiplano\",D237,IF('1. Autorización'!$I$6=\"Sur\",F237,IF('1. Autorización'!$I$6=\"Colegio Americano del Sur\",H237,B237))))","v":8103808}]
["OTROS DIRECCION ADMINISTRATIVA",1360307,null,null,null,null,null,null,{"$f":"IF(IF('1. Autorización'!$I$6=\"Altiplano\",C238,IF('1. Autorización'!$I$6=\"Sur\",E238,IF('1. Autorización'!$I$6=\"Colegio Americano del Sur\",E238,A238)))=0,\"\",IF('1. Autorización'!$I$6=\"Altiplano\",C238,IF('1. Autorización'!$I$6=\"Sur\",E238,IF('1. Autorización'!$I$6=\"Colegio Americano del Sur\",E238,A238))))","v":"OTROS DIRECCION ADMINISTRATIVA"},{"$f":"IF(IF('1. Autorización'!$I$6=\"Altiplano\",D238,IF('1. Autorización'!$I$6=\"Sur\",F238,IF('1. Autorización'!$I$6=\"Colegio Americano del Sur\",H238,B238)))=0,\"\",IF('1. Autorización'!$I$6=\"Altiplano\",D238,IF('1. Autorización'!$I$6=\"Sur\",F238,IF('1. Autorización'!$I$6=\"Colegio Americano del Sur\",H238,B238))))","v":1360307}]
["POSTGRADO EN COACHING EDUCATIVO (EDUCON)",8040500,null,null,null,null,null,null,{"$f":"IF(IF('1. Autorización'!$I$6=\"Altiplano\",C239,IF('1. Autorización'!$I$6=\"Sur\",E239,IF('1. Autorización'!$I$6=\"Colegio Americano del Sur\",E239,A239)))=0,\"\",IF('1. Autorización'!$I$6=\"Altiplano\",C239,IF('1. Autorización'!$I$6=\"Sur\",E239,IF('1. Autorización'!$I$6=\"Colegio Americano del Sur\",E239,A239))))","v":"POSTGRADO EN COACHING EDUCATIVO (EDUCON)"},{"$f":"IF(IF('1. Autorización'!$I$6=\"Altiplano\",D239,IF('1. Autorización'!$I$6=\"Sur\",F239,IF('1. Autorización'!$I$6=\"Colegio Americano del Sur\",F239,B239)))=0,\"\",IF('1. Autorización'!$I$6=\"Altiplano\",D239,IF('1. Autorización'!$I$6=\"Sur\",F239,IF('1. Autorización'!$I$6=\"Colegio Americano del Sur\",F239,B239))))","v":8040500}]
["POSTGRADO EN MONITOREO Y EVA DE PROYECTOS SOC",1411101,null,null,null,null,null,null,{"$f":"IF(IF('1. Autorización'!$I$6=\"Altiplano\",C240,IF('1. Autorización'!$I$6=\"Sur\",E240,IF('1. Autorización'!$I$6=\"Colegio Americano del Sur\",E240,A240)))=0,\"\",IF('1. Autorización'!$I$6=\"Altiplano\",C240,IF('1. Autorización'!$I$6=\"Sur\",E240,IF('1. Autorización'!$I$6=\"Colegio Americano del Sur\",E240,A240))))","v":"POSTGRADO EN MONITOREO Y EVA DE PROYECTOS SOC"},{"$f":"IF(IF('1. Autorización'!$I$6=\"Altiplano\",D240,IF('1. Autorización'!$I$6=\"Sur\",F240,IF('1. Autorización'!$I$6=\"Colegio Americano del Sur\",F240,B240)))=0,\"\",IF('1. Autorización'!$I$6=\"Altiplano\",D240,IF('1. Autorización'!$I$6=\"Sur\",F240,IF('1. Autorización'!$I$6=\"Colegio Americano del Sur\",F240,B240))))","v":1411101}]
["POSTGRADO EN POLITICAS PUBLICAS PARA EL DESARROLLO",1411102,null,null,null,null,null,null,{"$f":"IF(IF('1. Autorización'!$I$6=\"Altiplano\",C241,IF('1. Autorización'!$I$6=\"Sur\",E241,IF('1. Autorización'!$I$6=\"Colegio Americano del Sur\",E241,A241)))=0,\"\",IF('1. Autorización'!$I$6=\"Altiplano\",C241,IF('1. Autorización'!$I$6=\"Sur\",E241,IF('1. Autorización'!$I$6=\"Colegio Americano del Sur\",E241,A241))))","v":"POSTGRADO EN POLITICAS PUBLICAS PARA EL DESARROLLO"},{"$f":"IF(IF('1. Autorización'!$I$6=\"Altiplano\",D241,IF('1. Autorización'!$I$6=\"Sur\",F241,IF('1. Autorización'!$I$6=\"Colegio Americano del Sur\",F241,B241)))=0,\"\",IF('1. Autorización'!$I$6=\"Altiplano\",D241,IF('1. Autorización'!$I$6=\"Sur\",F241,IF('1. Autorización'!$I$6=\"Colegio Americano del Sur\",F241,B241))))","v":1411102}]
["POSTGRADO INTERVENCIONES CON ARTES EXPRESIVAS",1411001,null,null,null,null,null,null,{"$f":"IF(IF('1. Autorización'!$I$6=\"Altiplano\",C242,IF('1. Autorización'!$I$6=\"Sur\",E242,IF('1. Autorización'!$I$6=\"Colegio Americano del Sur\",E242,A242)))=0,\"\",IF('1. Autorización'!$I$6=\"Altiplano\",C242,IF('1. Autorización'!$I$6=\"Sur\",E242,IF('1. Autorización'!$I$6=\"Colegio Americano del Sur\",E242,A242))))","v":"POSTGRADO INTERVENCIONES CON ARTES EXPRESIVAS"},{"$f":"IF(IF('1. Autorización'!$I$6=\"Altiplano\",D242,IF('1. Autorización'!$I$6=\"Sur\",F242,IF('1. Autorización'!$I$6=\"Colegio Americano del Sur\",F242,B242)))=0,\"\",IF('1. Autorización'!$I$6=\"Altiplano\",D242,IF('1. Autorización'!$I$6=\"Sur\",F242,IF('1. Autorización'!$I$6=\"Colegio Americano del Sur\",F242,B242))))","v":1411001}]
["PROF ESP. EN EDUC DE PERSONAS DISCAP. SENSOR Y COM",1420705,null,null,null,null,null,null,{"$f":"IF(IF('1. Autorización'!$I$6=\"Altiplano\",C243,IF('1. Autorización'!$I$6=\"Sur\",E243,IF('1. Autorización'!$I$6=\"Colegio Americano del Sur\",E243,A243)))=0,\"\",IF('1. Autorización'!$I$6=\"Altiplano\",C243,IF('1. Autorización'!$I$6=\"Sur\",E243,IF('1. Autorización'!$I$6=\"Colegio Americano del Sur\",E243,A243))))","v":"PROF ESP. EN EDUC DE PERSONAS DISCAP. SENSOR Y COM"},{"$f":"IF(IF('1. Autorización'!$I$6=\"Altiplano\",D243,IF('1. Autorización'!$I$6=\"Sur\",F243,IF('1. Autorización'!$I$6=\"Colegio Americano del Sur\",F243,B243)))=0,\"\",IF('1. Autorización'!$I$6=\"Altiplano\",D243,IF('1. Autorización'!$I$6=\"Sur\",F243,IF('1. Autorización'!$I$6=\"Colegio Americano del Sur\",F243,B243))))","v":1420705}]
["PROFESORADO EN CC BIOLOGICAS Y QUIM MOD MIXTA",1421604,null,null,null,null,null,null,{"$f":"IF(IF('1. Autorización'!$I$6=\"Altiplano\",C244,IF('1. Autorización'!$I$6=\"Sur\",E244,IF('1. Autorización'!$I$6=\"Colegio Americano del Sur\",E244,A244)))=0,\"\",IF('1. Autorización'!$I$6=\"Altiplano\",C244,IF('1. Autorización'!$I$6=\"Sur\",E244,IF('1. Autorización'!$I$6=\"Colegio Americano del Sur\",E244,A244))))","v":"PROFESORADO EN CC BIOLOGICAS Y QUIM MOD MIXTA"},{"$f":"IF(IF('1. Autorización'!$I$6=\"Altiplano\",D244,IF('1. Autorización'!$I$6=\"Sur\",F244,IF('1. Autorización'!$I$6=\"Colegio Americano del Sur\",F244,B244)))=0,\"\",IF('1. Autorización'!$I$6=\"Altiplano\",D244,IF('1. Autorización'!$I$6=\"Sur\",F244,IF('1. Autorización'!$I$6=\"Colegio Americano del Sur\",F244,B244))))","v":1421604}]
["PROFESORADO EN CIENCIAS BIOLOGICAS Y QUIMICAS",1421601,null,null,null,null,null,null,{"$f":"IF(IF('1. Autorización'!$I$6=\"Altiplano\",C245,IF('1. Autorización'!$I$6=\"Sur\",E245,IF('1. Autorización'!$I$6=\"Colegio Americano del Sur\",E245,A245)))=0,\"\",IF('1. Autorización'!$I$6=\"Altiplano\",C245,IF('1. Autorización'!$I$6=\"Sur\",E245,IF('1. Autorización'!$I$6=\"Colegio Americano del Sur\",E245,A245))))","v":"PROFESORADO EN CIENCIAS BIOLOGICAS Y QUIMICAS"},{"$f":"IF(IF('1. Autorización'!$I$6=\"Altiplano\",D245,IF('1. Autorización'!$I$6=\"Sur\",F245,IF('1. Autorización'!$I$6=\"Colegio Americano del Sur\",F245,B245)))=0,\"\",IF('1. Autorización'!$I$6=\"Altiplano\",D245,IF('1. Autorización'!$I$6=\"Sur\",F245,IF('1. Autorización'!$I$6=\"Colegio Americano del Sur\",F245,B245))))","v":1421601}]
["PROFESORADO EN EDUC DE NIÑOS CON PROB AUDITIVOS",1420702,null,null,null,null,null,null,{"$f":"IF(IF('1. Autorización'!$I$6=\"Altiplano\",C246,IF('1. Autorización'!$I$6=\"Sur\",E246,IF('1. Autorización'!$I$6=\"Colegio Americano del Sur\",E246,A246)))=0,\"\",IF('1. Autorización'!$I$6=\"Altiplano\",C246,IF('1. Autorización'!$I$6=\"Sur\",E246,IF('1. Autorización'!$I$6=\"Colegio Americano del Sur\",E246,A246))))","v":"PROFESORADO EN EDUC DE NIÑOS CON PROB AUDITIVOS"},{"$f":"IF(IF('1. Autorización'!$I$6=\"Altiplano\",D246,IF('1. Autorización'!$I$6=\"Sur\",F246,IF('1. Autorización'!$I$6=\"Colegio Americano del Sur\",F246,B246)))=0,\"\",IF('1. Autorización'!$I$6=\"Altiplano\",D246,IF('1. Autorización'!$I$6=\"Sur\",F246,IF('1. Autorización'!$I$6=\"Colegio Americano del Sur\",F246,B246))))","v":1420702}]
["PROFESORADO EN EDUC DE PERSONAS CON NEC ESPECIALES",1420704,null,null,null,null,null,null,{"$f":"IF(IF('1. Autorización'!$I$6=\"Altiplano\",C247,IF('1. Autorización'!$I$6=\"Sur\",E247,IF('1. Autorización'!$I$6=\"Colegio Americano del Sur\",E247,A247)))=0,\"\",IF('1. Autorización'!$I$6=\"Altiplano\",C247,IF('1. Autorización'!$I$6=\"Sur\",E247,IF('1. Autorización'!$I$6=\"Colegio Americano del Sur\",E247,A247))))","v":"PROFESORADO EN EDUC DE PERSONAS CON NEC ESPECIALES"},{"$f":"IF(IF('1. Autorización'!$I$6=\"Altiplano\",D247,IF('1. Autorización'!$I$6=\"Sur\",F247,IF('1. Autorización'!$I$6=\"Colegio Americano del Sur\",F247,B247)))=0,\"\",IF('1. Autorización'!$I$6=\"Altiplano\",D247,IF('1. Autorización'!$I$6=\"Sur\",F247,IF('1. Autorización'!$I$6=\"Colegio Americano del Sur\",F247,B247))))","v":1420704}]
["PROFESORADO EN EDUCACION PRIMARIA",1421612,null,null,null,null,null,null,{"$f":"IF(IF('1. Autorización'!$I$6=\"Altiplano\",C248,IF('1. Autorización'!$I$6=\"Sur\",E248,IF('1. Autorización'!$I$6=\"Colegio Americano del Sur\",E248,A248)))=0,\"\",IF('1. Autorización'!$I$6=\"Altiplano\",C248,IF('1. Autorización'!$I$6=\"Sur\",E248,IF('1. Autorización'!$I$6=\"Colegio Americano del Sur\",E248,A248))))","v":"PROFESORADO EN EDUCACION PRIMARIA"},{"$f":"IF(IF('1. Autorización'!$I$6=\"Altiplano\",D248,IF('1. Autorización'!$I$6=\"Sur\",F248,IF('1. Autorización'!$I$6=\"Colegio Americano del Sur\",F248,B248)))=0,\"\",IF('1. Autorización'!$I$6=\"Altiplano\",D248,IF('1. Autorización'!$I$6=\"Sur\",F248,IF('1. Autorización'!$I$6=\"Colegio Americano del Sur\",F248,B248))))","v":1421612}]
["PROFESORADO EN HISTORIA Y CC SOCIALES MOD MIX",1421610,null,null,null,null,null,null,{"$f":"IF(IF('1. Autorización'!$I$6=\"Altiplano\",C249,IF('1. Autorización'!$I$6=\"Sur\",E249,IF('1. Autorización'!$I$6=\"Colegio Americano del Sur\",E249,A249)))=0,\"\",IF('1. Autorización'!$I$6=\"Altiplano\",C249,IF('1. Autorización'!$I$6=\"Sur\",E249,IF('1. Autorización'!$I$6=\"Colegio Americano del Sur\",E249,A249))))","v":"PROFESORADO EN HISTORIA Y CC SOCIALES MOD MIX"},{"$f":"IF(IF('1. Autorización'!$I$6=\"Altiplano\",D249,IF('1. Autorización'!$I$6=\"Sur\",F249,IF('1. Autorización'!$I$6=\"Colegio Americano del Sur\",F249,B249)))=0,\"\",IF('1. Autorización'!$I$6=\"Altiplano\",D249,IF('1. Autorización'!$I$6=\"Sur\",F249,IF('1. Autorización'!$I$6=\"Colegio Americano del Sur\",F249,B249))))","v":1421610}]
["PROFESORADO EN HISTORIA Y CIENCIAS SOCIALES",1421608,null,null,null,null,null,null,{"$f":"IF(IF('1. Autorización'!$I$6=\"Altiplano\",C250,IF('1. Autorización'!$I$6=\"Sur\",E250,IF('1. Autorización'!$I$6=\"Colegio Americano del Sur\",E250,A250)))=0,\"\",IF('1. Autorización'!$I$6=\"Altiplano\",C250,IF('1. Autorización'!$I$6=\"Sur\",E250,IF('1. Autorización'!$I$6=\"Colegio Americano del Sur\",E250,A250))))","v":"PROFESORADO EN HISTORIA Y CIENCIAS SOCIALES"},{"$f":"IF(IF('1. Autorización'!$I$6=\"Altiplano\",D250,IF('1. Autorización'!$I$6=\"Sur\",F250,IF('1. Autorización'!$I$6=\"Colegio Americano del Sur\",F250,B250)))=0,\"\",IF('1. Autorización'!$I$6=\"Altiplano\",D250,IF('1. Autorización'!$I$6=\"Sur\",F250,IF('1. Autorización'!$I$6=\"Colegio Americano del Sur\",F250,B250))))","v":1421608}]
["PROFESORADO EN INGLES",1420901,null,null,null,null,null,null,{"$f":"IF(IF('1. Autorización'!$I$6=\"Altiplano\",C251,IF('1. Autorización'!$I$6=\"Sur\",E251,IF('1. Autorización'!$I$6=\"Colegio Americano del Sur\",E251,A251)))=0,\"\",IF('1. Autorización'!$I$6=\"Altiplano\",C251,IF('1. Autorización'!$I$6=\"Sur\",E251,IF('1. Autorización'!$I$6=\"Colegio Americano del Sur\",E251,A251))))","v":"PROFESORADO EN INGLES"},{"$f":"IF(IF('1. Autorización'!$I$6=\"Altiplano\",D251,IF('1. Autorización'!$I$6=\"Sur\",F251,IF('1. Autorización'!$I$6=\"Colegio Americano del Sur\",F251,B251)))=0,\"\",IF('1. Autorización'!$I$6=\"Altiplano\",D251,IF('1. Autorización'!$I$6=\"Sur\",F251,IF('1. Autorización'!$I$6=\"Colegio Americano del Sur\",F251,B251))))","v":1420901}]
["PROFESORADO EN LENGUA Y LITERATURA",1421609,null,null,null,null,null,null,{"$f":"IF(IF('1. Autorización'!$I$6=\"Altiplano\",C252,IF('1. Autorización'!$I$6=\"Sur\",E252,IF('1. Autorización'!$I$6=\"Colegio Americano del Sur\",E252,A252)))=0,\"\",IF('1. Autorización'!$I$6=\"Altiplano\",C252,IF('1. Autorización'!$I$6=\"Sur\",E252,IF('1. Autorización'!$I$6=\"Colegio Americano del Sur\",E252,A252))))","v":"PROFESORADO EN LENGUA Y LITERATURA"},{"$f":"IF(IF('1. Autorización'!$I$6=\"Altiplano\",D252,IF('1. Autorización'!$I$6=\"Sur\",F252,IF('1. Autorización'!$I$6=\"Colegio Americano del Sur\",F252,B252)))=0,\"\",IF('1. Autorización'!$I$6=\"Altiplano\",D252,IF('1. Autorización'!$I$6=\"Sur\",F252,IF('1. Autorización'!$I$6=\"Colegio Americano del Sur\",F252,B252))))","v":1421609}]
["PROFESORADO EN LENGUA Y LITERATURA MOD MIX",1421611,null,null,null,null,null,null,{"$f":"IF(IF('1. Autorización'!$I$6=\"Altiplano\",C253,IF('1. Autorización'!$I$6=\"Sur\",E253,IF('1. Autorización'!$I$6=\"Colegio Americano del Sur\",E253,A253)))=0,\"\",IF('1. Autorización'!$I$6=\"Altiplano\",C253,IF('1. Autorización'!$I$6=\"Sur\",E253,IF('1. Autorización'!$I$6=\"Colegio Americano del Sur\",E253,A253))))","v":"PROFESORADO EN LENGUA Y LITERATURA MOD MIX"},{"$f":"IF(IF('1. Autorización'!$I$6=\"Altiplano\",D253,IF('1. Autorización'!$I$6=\"Sur\",F253,IF('1. Autorización'!$I$6=\"Colegio Americano del Sur\",F253,B253)))=0,\"\",IF('1. Autorización'!$I$6=\"Altiplano\",D253,IF('1. Autorización'!$I$6=\"Sur\",F253,IF('1. Autorización'!$I$6=\"Colegio Americano del Sur\",F253,B253))))","v":1421611}]
["PROFESORADO EN MATEMATICA Y COMPUTACION",1421603,null,null,null,null,null,null,{"$f":"IF(IF('1. Autorización'!$I$6=\"Altiplano\",C254,IF('1. Autorización'!$I$6=\"Sur\",E254,IF('1. Autorización'!$I$6=\"Colegio Americano del Sur\",E254,A254)))=0,\"\",IF('1. Autorización'!$I$6=\"Altiplano\",C254,IF('1. Autorización'!$I$6=\"Sur\",E254,IF('1. Autorización'!$I$6=\"Colegio Americano del Sur\",E254,A254))))","v":"PROFESORADO EN MATEMATICA Y COMPUTACION"},{"$f":"IF(IF('1. Autorización'!$I$6=\"Altiplano\",D254,IF('1. Autorización'!$I$6=\"Sur\",F254,IF('1. Autorización'!$I$6=\"Colegio Americano del Sur\",F254,B254)))=0,\"\",IF('1. Autorización'!$I$6=\"Altiplano\",D254,IF('1. Autorización'!$I$6=\"Sur\",F254,IF('1. Autorización'!$I$6=\"Colegio Americano del Sur\",F254,B254))))","v":1421603}]
["PROFESORADO EN MATEMATICAS Y CC FISI MOD MIX",1421605,null,null,null,null,null,null,{"$f":"IF(IF('1. Autorización'!$I$6=\"Altiplano\",C255,IF('1. Autorización'!$I$6=\"Sur\",E255,IF('1. Autorización'!$I$6=\"Colegio Americano del Sur\",E255,A255)))=0,\"\",IF('1. Autorización'!$I$6=\"Altiplano\",C255,IF('1. Autorización'!$I$6=\"Sur\",E255,IF('1. Autorización'!$I$6=\"Colegio Americano del Sur\",E255,A255))))","v":"PROFESORADO EN MATEMATICAS Y CC FISI MOD MIX"},{"$f":"IF(IF('1. Autorización'!$I$6=\"Altiplano\",D255,IF('1. Autorización'!$I$6=\"Sur\",F255,IF('1. Autorización'!$I$6=\"Colegio Americano del Sur\",F255,B255)))=0,\"\",IF('1. Autorización'!$I$6=\"Altiplano\",D255,IF('1. Autorización'!$I$6=\"Sur\",F255,IF('1. Autorización'!$I$6=\"Colegio Americano del Sur\",F255,B255))))","v":1421605}]
["PROFESORADO EN MATEMATICAS Y CIENCIAS FISICAS",1421602,null,null,null,null,null,null,{"$f":"IF(IF('1. Autorización'!$I$6=\"Altiplano\",C256,IF('1. Autorización'!$I$6=\"Sur\",E256,IF('1. Autorización'!$I$6=\"Colegio Americano del Sur\",E256,A256)))=0,\"\",IF('1. Autorización'!$I$6=\"Altiplano\",C256,IF('1. Autorización'!$I$6=\"Sur\",E256,IF('1. Autorización'!$I$6=\"Colegio Americano del Sur\",E256,A256))))","v":"PROFESORADO EN MATEMATICAS Y CIENCIAS FISICAS"},{"$f":"IF(IF('1. Autorización'!$I$6=\"Altiplano\",D256,IF('1. Autorización'!$I$6=\"Sur\",F256,IF('1. Autorización'!$I$6=\"Colegio Americano del Sur\",F256,B256)))=0,\"\",IF('1. Autorización'!$I$6=\"Altiplano\",D256,IF('1. Autorización'!$I$6=\"Sur\",F256,IF('1. Autorización'!$I$6=\"Colegio Americano del Sur\",F256,B256))))","v":1421602}]
["PROFESORADO EN MUSICA",1420401,null,null,null,null,null,null,{"$f":"IF(IF('1. Autorización'!$I$6=\"Altiplano\",C257,IF('1. Autorización'!$I$6=\"Sur\",E257,IF('1. Autorización'!$I$6=\"Colegio Americano del Sur\",E257,A257)))=0,\"\",IF('1. Autorización'!$I$6=\"Altiplano\",C257,IF('1. Autorización'!$I$6=\"Sur\",E257,IF('1. Autorización'!$I$6=\"Colegio Americano del Sur\",E257,A257))))","v":"PROFESORADO EN MUSICA"},{"$f":"IF(IF('1. Autorización'!$I$6=\"Altiplano\",D257,IF('1. Autorización'!$I$6=\"Sur\",F257,IF('1. Autorización'!$I$6=\"Colegio Americano del Sur\",F257,B257)))=0,\"\",IF('1. Autorización'!$I$6=\"Altiplano\",D257,IF('1. Autorización'!$I$6=\"Sur\",F257,IF('1. Autorización'!$I$6=\"Colegio Americano del Sur\",F257,B257))))","v":1420401}]
["PROFESORADO EN PROBLEMAS DE APRENDIZAJE",1420703,null,null,null,null,null,null,{"$f":"IF(IF('1. Autorización'!$I$6=\"Altiplano\",C258,IF('1. Autorización'!$I$6=\"Sur\",E258,IF('1. Autorización'!$I$6=\"Colegio Americano del Sur\",E258,A258)))=0,\"\",IF('1. Autorización'!$I$6=\"Altiplano\",C258,IF('1. Autorización'!$I$6=\"Sur\",E258,IF('1. Autorización'!$I$6=\"Colegio Americano del Sur\",E258,A258))))","v":"PROFESORADO EN PROBLEMAS DE APRENDIZAJE"},{"$f":"IF(IF('1. Autorización'!$I$6=\"Altiplano\",D258,IF('1. Autorización'!$I$6=\"Sur\",F258,IF('1. Autorización'!$I$6=\"Colegio Americano del Sur\",F258,B258)))=0,\"\",IF('1. Autorización'!$I$6=\"Altiplano\",D258,IF('1. Autorización'!$I$6=\"Sur\",F258,IF('1. Autorización'!$I$6=\"Colegio Americano del Sur\",F258,B258))))","v":1420703}]
["PROGRAMA DE ACTUALIZACION EN NUTRICION",8103807,null,null,null,null,null,null,{"$f":"IF(IF('1. Autorización'!$I$6=\"Altiplano\",C259,IF('1. Autorización'!$I$6=\"Sur\",E259,IF('1. Autorización'!$I$6=\"Colegio Americano del Sur\",E259,A259)))=0,\"\",IF('1. Autorización'!$I$6=\"Altiplano\",C259,IF('1. Autorización'!$I$6=\"Sur\",E259,IF('1. Autorización'!$I$6=\"Colegio Americano del Sur\",E259,A259))))","v":"PROGRAMA DE ACTUALIZACION EN NUTRICION"},{"$f":"IF(IF('1. Autorización'!$I$6=\"Altiplano\",D259,IF('1. Autorización'!$I$6=\"Sur\",F259,IF('1. Autorización'!$I$6=\"Colegio Americano del Sur\",F259,B259)))=0,\"\",IF('1. Autorización'!$I$6=\"Altiplano\",D259,IF('1. Autorización'!$I$6=\"Sur\",F259,IF('1. Autorización'!$I$6=\"Colegio Americano del Sur\",F259,B259))))","v":8103807}]
["PROGRAMA DE FORMACION DE AUDITORES EN BPMF X",8030101,null,null,null,null,null,null,{"$f":"IF(IF('1. Autorización'!$I$6=\"Altiplano\",C260,IF('1. Autorización'!$I$6=\"Sur\",E260,IF('1. Autorización'!$I$6=\"Colegio Americano del Sur\",E260,A260)))=0,\"\",IF('1. Autorización'!$I$6=\"Altiplano\",C260,IF('1. Autorización'!$I$6=\"Sur\",E260,IF('1. Autorización'!$I$6=\"Colegio Americano del Sur\",E260,A260))))","v":"PROGRAMA DE FORMACION DE AUDITORES EN BPMF X"},{"$f":"IF(IF('1. Autorización'!$I$6=\"Altiplano\",D260,IF('1. Autorización'!$I$6=\"Sur\",F260,IF('1. Autorización'!$I$6=\"Colegio Americano del Sur\",F260,B260)))=0,\"\",IF('1. Autorización'!$I$6=\"Altiplano\",D260,IF('1. Autorización'!$I$6=\"Sur\",F260,IF('1. Autorización'!$I$6=\"Colegio Americano del Sur\",F260,B260))))","v":8030101}]
["PSICOLOGIA (EDUCON)",8020200,null,null,null,null,null,null,{"$f":"IF(IF('1. Autorización'!$I$6=\"Altiplano\",C261,IF('1. Autorización'!$I$6=\"Sur\",E261,IF('1. Autorización'!$I$6=\"Colegio Americano del Sur\",E261,A261)))=0,\"\",IF('1. Autorización'!$I$6=\"Altiplano\",C261,IF('1. Autorización'!$I$6=\"Sur\",E261,IF('1. Autorización'!$I$6=\"Colegio Americano del Sur\",E261,A261))))","v":"PSICOLOGIA (EDUCON)"},{"$f":"IF(IF('1. Autorización'!$I$6=\"Altiplano\",D261,IF('1. Autorización'!$I$6=\"Sur\",F261,IF('1. Autorización'!$I$6=\"Colegio Americano del Sur\",F261,B261)))=0,\"\",IF('1. Autorización'!$I$6=\"Altiplano\",D261,IF('1. Autorización'!$I$6=\"Sur\",F261,IF('1. Autorización'!$I$6=\"Colegio Americano del Sur\",F261,B261))))","v":8020200}]
["QUIMICA FARMACEUTICA (EDUCON)",8030100,null,null,null,null,null,null,{"$f":"IF(IF('1. Autorización'!$I$6=\"Altiplano\",C262,IF('1. Autorización'!$I$6=\"Sur\",E262,IF('1. Autorización'!$I$6=\"Colegio Americano del Sur\",E262,A262)))=0,\"\",IF('1. Autorización'!$I$6=\"Altiplano\",C262,IF('1. Autorización'!$I$6=\"Sur\",E262,IF('1. Autorización'!$I$6=\"Colegio Americano del Sur\",E262,A262))))","v":"QUIMICA FARMACEUTICA (EDUCON)"},{"$f":"IF(IF('1. Autorización'!$I$6=\"Altiplano\",D262,IF('1. Autorización'!$I$6=\"Sur\",F262,IF('1. Autorización'!$I$6=\"Colegio Americano del Sur\",F262,B262)))=0,\"\",IF('1. Autorización'!$I$6=\"Altiplano\",D262,IF('1. Autorización'!$I$6=\"Sur\",F262,IF('1. Autorización'!$I$6=\"Colegio Americano del Sur\",F262,B262))))","v":8030100}]
["RECTORIA",1310000,null,null,null,null,null,null,{"$f":"IF(IF('1. Autorización'!$I$6=\"Altiplano\",C263,IF('1. Autorización'!$I$6=\"Sur\",E263,IF('1. Autorización'!$I$6=\"Colegio Americano del Sur\",E263,A263)))=0,\"\",IF('1. Autorización'!$I$6=\"Altiplano\",C263,IF('1. Autorización'!$I$6=\"Sur\",E263,IF('1. Autorización'!$I$6=\"Colegio Americano del Sur\",E263,A263))))","v":"RECTORIA"},{"$f":"IF(IF('1. Autorización'!$I$6=\"Altiplano\",D263,IF('1. Autorización'!$I$6=\"Sur\",F263,IF('1. Autorización'!$I$6=\"Colegio Americano del Sur\",F263,B263)))=0,\"\",IF('1. Autorización'!$I$6=\"Altiplano\",D263,IF('1. Autorización'!$I$6=\"Sur\",F263,IF('1. Autorización'!$I$6=\"Colegio Americano del Sur\",F263,B263))))","v":1310000}]
["RECTORIA (EDUCON)",8070000,null,null,null,null,null,null,{"$f":"IF(IF('1. Autorización'!$I$6=\"Altiplano\",C264,IF('1. Autorización'!$I$6=\"Sur\",E264,IF('1. Autorización'!$I$6=\"Colegio Americano del Sur\",E264,A264)))=0,\"\",IF('1. Autorización'!$I$6=\"Altiplano\",C264,IF('1. Autorización'!$I$6=\"Sur\",E264,IF('1. Autorización'!$I$6=\"Colegio Americano del Sur\",E264,A264))))","v":"RECTORIA (EDUCON)"},{"$f":"IF(IF('1. Autorización'!$I$6=\"Altiplano\",D264,IF('1. Autorización'!$I$6=\"Sur\",F264,IF('1. Autorización'!$I$6=\"Colegio Americano del Sur\",F264,B264)))=0,\"\",IF('1. Autorización'!$I$6=\"Altiplano\",D264,IF('1. Autorización'!$I$6=\"Sur\",F264,IF('1. Autorización'!$I$6=\"Colegio Americano del Sur\",F264,B264))))","v":8070000}]
["RED DE DRENAJES CENTRALES",1360305,null,null,null,null,null,null,{"$f":"IF(IF('1. Autorización'!$I$6=\"Altiplano\",C265,IF('1. Autorización'!$I$6=\"Sur\",E265,IF('1. Autorización'!$I$6=\"Colegio Americano del Sur\",E265,A265)))=0,\"\",IF('1. Autorización'!$I$6=\"Altiplano\",C265,IF('1. Autorización'!$I$6=\"Sur\",E265,IF('1. Autorización'!$I$6=\"Colegio Americano del Sur\",E265,A265))))","v":"RED DE DRENAJES CENTRALES"},{"$f":"IF(IF('1. Autorización'!$I$6=\"Altiplano\",D265,IF('1. Autorización'!$I$6=\"Sur\",F265,IF('1. Autorización'!$I$6=\"Colegio Americano del Sur\",F265,B265)))=0,\"\",IF('1. Autorización'!$I$6=\"Altiplano\",D265,IF('1. Autorización'!$I$6=\"Sur\",F265,IF('1. Autorización'!$I$6=\"Colegio Americano del Sur\",F265,B265))))","v":1360305}]
["RELACIONES PUBLICAS",1372102,null,null,null,null,null,null,{"$f":"IF(IF('1. Autorización'!$I$6=\"Altiplano\",C266,IF('1. Autorización'!$I$6=\"Sur\",E266,IF('1. Autorización'!$I$6=\"Colegio Americano del Sur\",E266,A266)))=0,\"\",IF('1. Autorización'!$I$6=\"Altiplano\",C266,IF('1. Autorización'!$I$6=\"Sur\",E266,IF('1. Autorización'!$I$6=\"Colegio Americano del Sur\",E266,A266))))","v":"RELACIONES PUBLICAS"},{"$f":"IF(IF('1. Autorización'!$I$6=\"Altiplano\",D266,IF('1. Autorización'!$I$6=\"Sur\",F266,IF('1. Autorización'!$I$6=\"Colegio Americano del Sur\",F266,B266)))=0,\"\",IF('1. Autorización'!$I$6=\"Altiplano\",D266,IF('1. Autorización'!$I$6=\"Sur\",F266,IF('1. Autorización'!$I$6=\"Colegio Americano del Sur\",F266,B266))))","v":1372102}]
["REPARACION, MANTENIMIENTO Y REMODELACIONES DE EDIF",1360301,null,null,null,null,null,null,{"$f":"IF(IF('1. Autorización'!$I$6=\"Altiplano\",C267,IF('1. Autorización'!$I$6=\"Sur\",E267,IF('1. Autorización'!$I$6=\"Colegio Americano del Sur\",E267,A267)))=0,\"\",IF('1. Autorización'!$I$6=\"Altiplano\",C267,IF('1. Autorización'!$I$6=\"Sur\",E267,IF('1. Autorización'!$I$6=\"Colegio Americano del Sur\",E267,A267))))","v":"REPARACION, MANTENIMIENTO Y REMODELACIONES DE EDIF"},{"$f":"IF(IF('1. Autorización'!$I$6=\"Altiplano\",D267,IF('1. Autorización'!$I$6=\"Sur\",F267,IF('1. Autorización'!$I$6=\"Colegio Americano del Sur\",F267,B267)))=0,\"\",IF('1. Autorización'!$I$6=\"Altiplano\",D267,IF('1. Autorización'!$I$6=\"Sur\",F267,IF('1. Autorización'!$I$6=\"Colegio Americano del Sur\",F267,B267))))","v":1360301}]
["SAN ANDRES SEMETABAJ",1432300,null,null,null,null,null,null,{"$f":"IF(IF('1. Autorización'!$I$6=\"Altiplano\",C268,IF('1. Autorización'!$I$6=\"Sur\",E268,IF('1. Autorización'!$I$6=\"Colegio Americano del Sur\",E268,A268)))=0,\"\",IF('1. Autorización'!$I$6=\"Altiplano\",C268,IF('1. Autorización'!$I$6=\"Sur\",E268,IF('1. Autorización'!$I$6=\"Colegio Americano del Sur\",E268,A268))))","v":"SAN ANDRES SEMETABAJ"},{"$f":"IF(IF('1. Autorización'!$I$6=\"Altiplano\",D268,IF('1. Autorización'!$I$6=\"Sur\",F268,IF('1. Autorización'!$I$6=\"Colegio Americano del Sur\",F268,B268)))=0,\"\",IF('1. Autorización'!$I$6=\"Altiplano\",D268,IF('1. Autorización'!$I$6=\"Sur\",F268,IF('1. Autorización'!$I$6=\"Colegio Americano del Sur\",F268,B268))))","v":1432300}]
["SEC.  DE ESPACIOS TECNOLOGICOS PARA EL APRENDIZAJE",1371902,null,null,null,null,null,null,{"$f":"IF(IF('1. Autorización'!$I$6=\"Altiplano\",C269,IF('1. Autorización'!$I$6=\"Sur\",E269,IF('1. Autorización'!$I$6=\"Colegio Americano del Sur\",E269,A269)))=0,\"\",IF('1. Autorización'!$I$6=\"Altiplano\",C269,IF('1. Autorización'!$I$6=\"Sur\",E269,IF('1. Autorización'!$I$6=\"Colegio Americano del Sur\",E269,A269))))","v":"SEC.  DE ESPACIOS TECNOLOGICOS PARA EL APRENDIZAJE"},{"$f":"IF(IF('1. Autorización'!$I$6=\"Altiplano\",D269,IF('1. Autorización'!$I$6=\"Sur\",F269,IF('1. Autorización'!$I$6=\"Colegio Americano del Sur\",F269,B269)))=0,\"\",IF('1. Autorización'!$I$6=\"Altiplano\",D269,IF('1. Autorización'!$I$6=\"Sur\",F269,IF('1. Autorización'!$I$6=\"Colegio Americano del Sur\",F269,B269))))","v":1371902}]
["SECCION DE EXTENSION Y EMPRENDIMIENTO ACADEMICO",1570102,null,null,null,null,null,null,{"$f":"IF(IF('1. Autorización'!$I$6=\"Altiplano\",C270,IF('1. Autorización'!$I$6=\"Sur\",E270,IF('1. Autorización'!$I$6=\"Colegio Americano del Sur\",E270,A270)))=0,\"\",IF('1. Autorización'!$I$6=\"Altiplano\",C270,IF('1. Autorización'!$I$6=\"Sur\",E270,IF('1. Autorización'!$I$6=\"Colegio Americano del Sur\",E270,A270))))","v":"SECCION DE EXTENSION Y EMPRENDIMIENTO ACADEMICO"},{"$f":"IF(IF('1. Autorización'!$I$6=\"Altiplano\",D270,IF('1. Autorización'!$I$6=\"Sur\",F270,IF('1. Autorización'!$I$6=\"Colegio Americano del Sur\",F270,B270)))=0,\"\",IF('1. Autorización'!$I$6=\"Altiplano\",D270,IF('1. Autorización'!$I$6=\"Sur\",F270,IF('1. Autorización'!$I$6=\"Colegio Americano del Sur\",F270,B270))))","v":1570102}]
["SECCION DE SERVICIOS ACADEMICOS DIGITALES",1371904,null,null,null,null,null,null,{"$f":"IF(IF('1. Autorización'!$I$6=\"Altiplano\",C271,IF('1. Autorización'!$I$6=\"Sur\",E271,IF('1. Autorización'!$I$6=\"Colegio Americano del Sur\",E271,A271)))=0,\"\",IF('1. Autorización'!$I$6=\"Altiplano\",C271,IF('1. Autorización'!$I$6=\"Sur\",E271,IF('1. Autorización'!$I$6=\"Colegio Americano del Sur\",E271,A271))))","v":"SECCION DE SERVICIOS ACADEMICOS DIGITALES"},{"$f":"IF(IF('1. Autorización'!$I$6=\"Altiplano\",D271,IF('1. Autorización'!$I$6=\"Sur\",F271,IF('1. Autorización'!$I$6=\"Colegio Americano del Sur\",F271,B271)))=0,\"\",IF('1. Autorización'!$I$6=\"Altiplano\",D271,IF('1. Autorización'!$I$6=\"Sur\",F271,IF('1. Autorización'!$I$6=\"Colegio Americano del Sur\",F271,B271))))","v":1371904}]
["SECRETARIA EJECUTIVA FUVG",1560000,null,null,null,null,null,null,{"$f":"IF(IF('1. Autorización'!$I$6=\"Altiplano\",C272,IF('1. Autorización'!$I$6=\"Sur\",E272,IF('1. Autorización'!$I$6=\"Colegio Americano del Sur\",E272,A272)))=0,\"\",IF('1. Autorización'!$I$6=\"Altiplano\",C272,IF('1. Autorización'!$I$6=\"Sur\",E272,IF('1. Autorización'!$I$6=\"Colegio Americano del Sur\",E272,A272))))","v":"SECRETARIA EJECUTIVA FUVG"},{"$f":"IF(IF('1. Autorización'!$I$6=\"Altiplano\",D272,IF('1. Autorización'!$I$6=\"Sur\",F272,IF('1. Autorización'!$I$6=\"Colegio Americano del Sur\",F272,B272)))=0,\"\",IF('1. Autorización'!$I$6=\"Altiplano\",D272,IF('1. Autorización'!$I$6=\"Sur\",F272,IF('1. Autorización'!$I$6=\"Colegio Americano del Sur\",F272,B272))))","v":1560000}]
["SECRETARIA GENERAL",1490000,null,null,null,null,null,null,{"$f":"IF(IF('1. Autorización'!$I$6=\"Altiplano\",C273,IF('1. Autorización'!$I$6=\"Sur\",E273,IF('1. Autorización'!$I$6=\"Colegio Americano del Sur\",E273,A273)))=0,\"\",IF('1. Autorización'!$I$6=\"Altiplano\",C273,IF('1. Autorización'!$I$6=\"Sur\",E273,IF('1. Autorización'!$I$6=\"Colegio Americano del Sur\",E273,A273))))","v":"SECRETARIA GENERAL"},{"$f":"IF(IF('1. Autorización'!$I$6=\"Altiplano\",D273,IF('1. Autorización'!$I$6=\"Sur\",F273,IF('1. Autorización'!$I$6=\"Colegio Americano del Sur\",F273,B273)))=0,\"\",IF('1. Autorización'!$I$6=\"Altiplano\",D273,IF('1. Autorización'!$I$6=\"Sur\",F273,IF('1. Autorización'!$I$6=\"Colegio Americano del Sur\",F273,B273))))","v":1490000}]
["SERVICIOS EDUCATIVOS DE EVALUACION",1430201,null,null,null,null,null,null,{"$f":"IF(IF('1. Autorización'!$I$6=\"Altiplano\",C274,IF('1. Autorización'!$I$6=\"Sur\",E274,IF('1. Autorización'!$I$6=\"Colegio Americano del Sur\",E274,A274)))=0,\"\",IF('1. Autorización'!$I$6=\"Altiplano\",C274,IF('1. Autorización'!$I$6=\"Sur\",E274,IF('1. Autorización'!$I$6=\"Colegio Americano del Sur\",E274,A274))))","v":"SERVICIOS EDUCATIVOS DE EVALUACION"},{"$f":"IF(IF('1. Autorización'!$I$6=\"Altiplano\",D274,IF('1. Autorización'!$I$6=\"Sur\",F274,IF('1. Autorización'!$I$6=\"Colegio Americano del Sur\",F274,B274)))=0,\"\",IF('1. Autorización'!$I$6=\"Altiplano\",D274,IF('1. Autorización'!$I$6=\"Sur\",F274,IF('1. Autorización'!$I$6=\"Colegio Americano del Sur\",F274,B274))))","v":1430201}]
["SOPORTE APLICATIVO",1520003,null,null,null,null,null,null,{"$f":"IF(IF('1. Autorización'!$I$6=\"Altiplano\",C275,IF('1. Autorización'!$I$6=\"Sur\",E275,IF('1. Autorización'!$I$6=\"Colegio Americano del Sur\",E275,A275)))=0,\"\",IF('1. Autorización'!$I$6=\"Altiplano\",C275,IF('1. Autorización'!$I$6=\"Sur\",E275,IF('1. Autorización'!$I$6=\"Colegio Americano del Sur\",E275,A275))))","v":"SOPORTE APLICATIVO"},{"$f":"IF(IF('1. Autorización'!$I$6=\"Altiplano\",D275,IF('1. Autorización'!$I$6=\"Sur\",F275,IF('1. Autorización'!$I$6=\"Colegio Americano del Sur\",F275,B275)))=0,\"\",IF('1. Autorización'!$I$6=\"Altiplano\",D275,IF('1. Autorización'!$I$6=\"Sur\",F275,IF('1. Autorización'!$I$6=\"Colegio Americano del Sur\",F275,B275))))","v":1520003}]
["SQL PARA DATA SCIENCE",8010302,null,null,null,null,null,null,{"$f":"IF(IF('1. Autorización'!$I$6=\"Altiplano\",C276,IF('1. Autorización'!$I$6=\"Sur\",E276,IF('1. Autorización'!$I$6=\"Colegio Americano del Sur\",E276,A276)))=0,\"\",IF('1. Autorización'!$I$6=\"Altiplano\",C276,IF('1. Autorización'!$I$6=\"Sur\",E276,IF('1. Autorización'!$I$6=\"Colegio Americano del Sur\",E276,A276))))","v":"SQL PARA DATA SCIENCE"},{"$f":"IF(IF('1. Autorización'!$I$6=\"Altiplano\",D276,IF('1. Autorización'!$I$6=\"Sur\",F276,IF('1. Autorización'!$I$6=\"Colegio Americano del Sur\",F276,B276)))=0,\"\",IF('1. Autorización'!$I$6=\"Altiplano\",D276,IF('1. Autorización'!$I$6=\"Sur\",F276,IF('1. Autorización'!$I$6=\"Colegio Americano del Sur\",F276,B276))))","v":8010302}]
["TURISMO SOSTENIBLE (EDUCON)",8030300,null,null,null,null,null,null,{"$f":"IF(IF('1. Autorización'!$I$6=\"Altiplano\",C277,IF('1. Autorización'!$I$6=\"Sur\",E277,IF('1. Autorización'!$I$6=\"Colegio Americano del Sur\",E277,A277)))=0,\"\",IF('1. Autorización'!$I$6=\"Altiplano\",C277,IF('1. Autorización'!$I$6=\"Sur\",E277,IF('1. Autorización'!$I$6=\"Colegio Americano del Sur\",E277,A277))))","v":"TURISMO SOSTENIBLE (EDUCON)"},{"$f":"IF(IF('1. Autorización'!$I$6=\"Altiplano\",D277,IF('1. Autorización'!$I$6=\"Sur\",F277,IF('1. Autorización'!$I$6=\"Colegio Americano del Sur\",F277,B277)))=0,\"\",IF('1. Autorización'!$I$6=\"Altiplano\",D277,IF('1. Autorización'!$I$6=\"Sur\",F277,IF('1. Autorización'!$I$6=\"Colegio Americano del Sur\",F277,B277))))","v":8030300}]
["UNIDAD DE ADMISIONES",1570101,null,null,null,null,null,null,{"$f":"IF(IF('1. Autorización'!$I$6=\"Altiplano\",C278,IF('1. Autorización'!$I$6=\"Sur\",E278,IF('1. Autorización'!$I$6=\"Colegio Americano del Sur\",E278,A278)))=0,\"\",IF('1. Autorización'!$I$6=\"Altiplano\",C278,IF('1. Autorización'!$I$6=\"Sur\",E278,IF('1. Autorización'!$I$6=\"Colegio Americano del Sur\",E278,A278))))","v":"UNIDAD DE ADMISIONES"},{"$f":"IF(IF('1. Autorización'!$I$6=\"Altiplano\",D278,IF('1. Autorización'!$I$6=\"Sur\",F278,IF('1. Autorización'!$I$6=\"Colegio Americano del Sur\",F278,B278)))=0,\"\",IF('1. Autorización'!$I$6=\"Altiplano\",D278,IF('1. Autorización'!$I$6=\"Sur\",F278,IF('1. Autorización'!$I$6=\"Colegio Americano del Sur\",F278,B278))))","v":1570101}]
["UNIDAD DE APOYO ESTUDIANTIL",1500200,null,null,null,null,null,null,{"$f":"IF(IF('1. Autorización'!$I$6=\"Altiplano\",C279,IF('1. Autorización'!$I$6=\"Sur\",E279,IF('1. Autorización'!$I$6=\"Colegio Americano del Sur\",E279,A279)))=0,\"\",IF('1. Autorización'!$I$6=\"Altiplano\",C279,IF('1. Autorización'!$I$6=\"Sur\",E279,IF('1. Autorización'!$I$6=\"Colegio Americano del Sur\",E279,A279))))","v":"UNIDAD DE APOYO ESTUDIANTIL"},{"$f":"IF(IF('1. Autorización'!$I$6=\"Altiplano\",D279,IF('1. Autorización'!$I$6=\"Sur\",F279,IF('1. Autorización'!$I$6=\"Colegio Americano del Sur\",F279,B279)))=0,\"\",IF('1. Autorización'!$I$6=\"Altiplano\",D279,IF('1. Autorización'!$I$6=\"Sur\",F279,IF('1. Autorización'!$I$6=\"Colegio Americano del Sur\",F279,B279))))","v":1500200}]
["UNIDAD DE AYUDAS FINANCIERAS",1570103,null,null,null,null,null,null,{"$f":"IF(IF('1. Autorización'!$I$6=\"Altiplano\",C280,IF('1. Autorización'!$I$6=\"Sur\",E280,IF('1. Autorización'!$I$6=\"Colegio Americano del Sur\",E280,A280)))=0,\"\",IF('1. Autorización'!$I$6=\"Altiplano\",C280,IF('1. Autorización'!$I$6=\"Sur\",E280,IF('1. Autorización'!$I$6=\"Colegio Americano del Sur\",E280,A280))))","v":"UNIDAD DE AYUDAS FINANCIERAS"},{"$f":"IF(IF('1. Autorización'!$I$6=\"Altiplano\",D280,IF('1. Autorización'!$I$6=\"Sur\",F280,IF('1. Autorización'!$I$6=\"Colegio Americano del Sur\",F280,B280)))=0,\"\",IF('1. Autorización'!$I$6=\"Altiplano\",D280,IF('1. Autorización'!$I$6=\"Sur\",F280,IF('1. Autorización'!$I$6=\"Colegio Americano del Sur\",F280,B280))))","v":1570103}]
["UNIDAD DE BIENESTAR ESTUDIANTIL",1500100,null,null,null,null,null,null,{"$f":"IF(IF('1. Autorización'!$I$6=\"Altiplano\",C281,IF('1. Autorización'!$I$6=\"Sur\",E281,IF('1. Autorización'!$I$6=\"Colegio Americano del Sur\",E281,A281)))=0,\"\",IF('1. Autorización'!$I$6=\"Altiplano\",C281,IF('1. Autorización'!$I$6=\"Sur\",E281,IF('1. Autorización'!$I$6=\"Colegio Americano del Sur\",E281,A281))))","v":"UNIDAD DE BIENESTAR ESTUDIANTIL"},{"$f":"IF(IF('1. Autorización'!$I$6=\"Altiplano\",D281,IF('1. Autorización'!$I$6=\"Sur\",F281,IF('1. Autorización'!$I$6=\"Colegio Americano del Sur\",F281,B281)))=0,\"\",IF('1. Autorización'!$I$6=\"Altiplano\",D281,IF('1. Autorización'!$I$6=\"Sur\",F281,IF('1. Autorización'!$I$6=\"Colegio Americano del Sur\",F281,B281))))","v":1500100}]
["UNIDAD DE EGRESADOS",1570202,null,null,null,null,null,null,{"$f":"IF(IF('1. Autorización'!$I$6=\"Altiplano\",C282,IF('1. Autorización'!$I$6=\"Sur\",E282,IF('1. Autorización'!$I$6=\"Colegio Americano del Sur\",E282,A282)))=0,\"\",IF('1. Autorización'!$I$6=\"Altiplano\",C282,IF('1. Autorización'!$I$6=\"Sur\",E282,IF('1. Autorización'!$I$6=\"Colegio Americano del Sur\",E282,A282))))","v":"UNIDAD DE EGRESADOS"},{"$f":"IF(IF('1. Autorización'!$I$6=\"Altiplano\",D282,IF('1. Autorización'!$I$6=\"Sur\",F282,IF('1. Autorización'!$I$6=\"Colegio Americano del Sur\",F282,B282)))=0,\"\",IF('1. Autorización'!$I$6=\"Altiplano\",D282,IF('1. Autorización'!$I$6=\"Sur\",F282,IF('1. Autorización'!$I$6=\"Colegio Americano del Sur\",F282,B282))))","v":1570202}]
["UNIDAD DE RELACIONES INTERNACIONALES",1570201,null,null,null,null,null,null,{"$f":"IF(IF('1. Autorización'!$I$6=\"Altiplano\",C283,IF('1. Autorización'!$I$6=\"Sur\",E283,IF('1. Autorización'!$I$6=\"Colegio Americano del Sur\",E283,A283)))=0,\"\",IF('1. Autorización'!$I$6=\"Altiplano\",C283,IF('1. Autorización'!$I$6=\"Sur\",E283,IF('1. Autorización'!$I$6=\"Colegio Americano del Sur\",E283,A283))))","v":"UNIDAD DE RELACIONES INTERNACIONALES"},{"$f":"IF(IF('1. Autorización'!$I$6=\"Altiplano\",D283,IF('1. Autorización'!$I$6=\"Sur\",F283,IF('1. Autorización'!$I$6=\"Colegio Americano del Sur\",F283,B283)))=0,\"\",IF('1. Autorización'!$I$6=\"Altiplano\",D283,IF('1. Autorización'!$I$6=\"Sur\",F283,IF('1. Autorización'!$I$6=\"Colegio Americano del Sur\",F283,B283))))","v":1570201}]
["VICERRECTORIA ACADEMICA",1380001,null,null,null,null,null,null,{"$f":"IF(IF('1. Autorización'!$I$6=\"Altiplano\",C284,IF('1. Autorización'!$I$6=\"Sur\",E284,IF('1. Autorización'!$I$6=\"Colegio Americano del Sur\",E284,A284)))=0,\"\",IF('1. Autorización'!$I$6=\"Altiplano\",C284,IF('1. Autorización'!$I$6=\"Sur\",E284,IF('1. Autorización'!$I$6=\"Colegio Americano del Sur\",E284,A284))))","v":"VICERRECTORIA ACADEMICA"},{"$f":"IF(IF('1. Autorización'!$I$6=\"Altiplano\",D284,IF('1. Autorización'!$I$6=\"Sur\",F284,IF('1. Autorización'!$I$6=\"Colegio Americano del Sur\",F284,B284)))=0,\"\",IF('1. Autorización'!$I$6=\"Altiplano\",D284,IF('1. Autorización'!$I$6=\"Sur\",F284,IF('1. Autorización'!$I$6=\"Colegio Americano del Sur\",F284,B284))))","v":1380001}]
["VICERRECTORIA ACADEMICA (EDUCON)",8080000,null,null,null,null,null,null,{"$f":"IF(IF('1. Autorización'!$I$6=\"Altiplano\",C285,IF('1. Autorización'!$I$6=\"Sur\",E285,IF('1. Autorización'!$I$6=\"Colegio Americano del Sur\",E285,A285)))=0,\"\",IF('1. Autorización'!$I$6=\"Altiplano\",C285,IF('1. Autorización'!$I$6=\"Sur\",E285,IF('1. Autorización'!$I$6=\"Colegio Americano del Sur\",E285,A285))))","v":"VICERRECTORIA ACADEMICA (EDUCON)"},{"$f":"IF(IF('1. Autorización'!$I$6=\"Altiplano\",D285,IF('1. Autorización'!$I$6=\"Sur\",F285,IF('1. Autorización'!$I$6=\"Colegio Americano del Sur\",F285,B285)))=0,\"\",IF('1. Autorización'!$I$6=\"Altiplano\",D285,IF('1. Autorización'!$I$6=\"Sur\",F285,IF('1. Autorización'!$I$6=\"Colegio Americano del Sur\",F285,B285))))","v":8080000}]
["VICERRECTORIA ADMINISTRATIVA",1310400,null,null,null,null,null,null,{"$f":"IF(IF('1. Autorización'!$I$6=\"Altiplano\",C286,IF('1. Autorización'!$I$6=\"Sur\",E286,IF('1. Autorización'!$I$6=\"Colegio Americano del Sur\",E286,A286)))=0,\"\",IF('1. Autorización'!$I$6=\"Altiplano\",C286,IF('1. Autorización'!$I$6=\"Sur\",E286,IF('1. Autorización'!$I$6=\"Colegio Americano del Sur\",E286,A286))))","v":"VICERRECTORIA ADMINISTRATIVA"},{"$f":"IF(IF('1. Autorización'!$I$6=\"Altiplano\",D286,IF('1. Autorización'!$I$6=\"Sur\",F286,IF('1. Autorización'!$I$6=\"Colegio Americano del Sur\",F286,B286)))=0,\"\",IF('1. Autorización'!$I$6=\"Altiplano\",D286,IF('1. Autorización'!$I$6=\"Sur\",F286,IF('1. Autorización'!$I$6=\"Colegio Americano del Sur\",F286,B286))))","v":1310400}]
["VICERRECTORIA DE INVESTIGACION Y VINCULACION",1380200,null,null,null,null,null,null,{"$f":"IF(IF('1. Autorización'!$I$6=\"Altiplano\",C287,IF('1. Autorización'!$I$6=\"Sur\",E287,IF('1. Autorización'!$I$6=\"Colegio Americano del Sur\",E287,A287)))=0,\"\",IF('1. Autorización'!$I$6=\"Altiplano\",C287,IF('1. Autorización'!$I$6=\"Sur\",E287,IF('1. Autorización'!$I$6=\"Colegio Americano del Sur\",E287,A287))))","v":"VICERRECTORIA DE INVESTIGACION Y VINCULACION"},{"$f":"IF(IF('1. Autorización'!$I$6=\"Altiplano\",D287,IF('1. Autorización'!$I$6=\"Sur\",F287,IF('1. Autorización'!$I$6=\"Colegio Americano del Sur\",F287,B287)))=0,\"\",IF('1. Autorización'!$I$6=\"Altiplano\",D287,IF('1. Autorización'!$I$6=\"Sur\",F287,IF('1. Autorización'!$I$6=\"Colegio Americano del Sur\",F287,B287))))","v":1380200}]
["VIDA ESTUDIANTIL",1500202,null,null,null,null,null,null,{"$f":"IF(IF('1. Autorización'!$I$6=\"Altiplano\",C288,IF('1. Autorización'!$I$6=\"Sur\",E288,IF('1. Autorización'!$I$6=\"Colegio Americano del Sur\",E288,A288)))=0,\"\",IF('1. Autorización'!$I$6=\"Altiplano\",C288,IF('1. Autorización'!$I$6=\"Sur\",E288,IF('1. Autorización'!$I$6=\"Colegio Americano del Sur\",E288,A288))))","v":"VIDA ESTUDIANTIL"},{"$f":"IF(IF('1. Autorización'!$I$6=\"Altiplano\",D288,IF('1. Autorización'!$I$6=\"Sur\",F288,IF('1. Autorización'!$I$6=\"Colegio Americano del Sur\",F288,B288)))=0,\"\",IF('1. Autorización'!$I$6=\"Altiplano\",D288,IF('1. Autorización'!$I$6=\"Sur\",F288,IF('1. Autorización'!$I$6=\"Colegio Americano del Sur\",F288,B288))))","v":1500202}]
[null,null,null,null,null,null,null,null,{"$f":"IF(IF('1. Autorización'!$I$6=\"Altiplano\",C289,IF('1. Autorización'!$I$6=\"Sur\",E289,IF('1. Autorización'!$I$6=\"Colegio Americano del Sur\",E289,A289)))=0,\"\",IF('1. Autorización'!$I$6=\"Altiplano\",C289,IF('1. Autorización'!$I$6=\"Sur\",E289,IF('1. Autorización'!$I$6=\"Colegio Americano del Sur\",E289,A289))))","v":""},{"$f":"IF(IF('1. Autorización'!$I$6=\"Altiplano\",D289,IF('1. Autorización'!$I$6=\"Sur\",F289,IF('1. Autorización'!$I$6=\"Colegio Americano del Sur\",F289,B289)))=0,\"\",IF('1. Autorización'!$I$6=\"Altiplano\",D289,IF('1. Autorización'!$I$6=\"Sur\",F289,IF('1. Autorización'!$I$6=\"Colegio Americano del Sur\",F289,B289))))","v":""}]
[null,null,null,null,null,null,null,null,{"$f":"IF(IF('1. Autorización'!$I$6=\"Altiplano\",C290,IF('1. Autorización'!$I$6=\"Sur\",E290,IF('1. Autorización'!$I$6=\"Colegio Americano del Sur\",E290,A290)))=0,\"\",IF('1. Autorización'!$I$6=\"Altiplano\",C290,IF('1. Autorización'!$I$6=\"Sur\",E290,IF('1. Autorización'!$I$6=\"Colegio Americano del Sur\",E290,A290))))","v":""},{"$f":"IF(IF('1. Autorización'!$I$6=\"Altiplano\",D290,IF('1. Autorización'!$I$6=\"Sur\",F290,IF('1. Autorización'!$I$6=\"Colegio Americano del Sur\",F290,B290)))=0,\"\",IF('1. Autorización'!$I$6=\"Altiplano\",D290,IF('1. Autorización'!$I$6=\"Sur\",F290,IF('1. Autorización'!$I$6=\"Colegio Americano del Sur\",F290,B290))))","v":""}]
[null,null,null,null,null,null,null,null,{"$f":"IF(IF('1. Autorización'!$I$6=\"Altiplano\",C291,IF('1. Autorización'!$I$6=\"Sur\",E291,IF('1. Autorización'!$I$6=\"Colegio Americano del Sur\",E291,A291)))=0,\"\",IF('1. Autorización'!$I$6=\"Altiplano\",C291,IF('1. Autorización'!$I$6=\"Sur\",E291,IF('1. Autorización'!$I$6=\"Colegio Americano del Sur\",E291,A291))))","v":""},{"$f":"IF(IF('1. Autorización'!$I$6=\"Altiplano\",D291,IF('1. Autorización'!$I$6=\"Sur\",F291,IF('1. Autorización'!$I$6=\"Colegio Americano del Sur\",F291,B291)))=0,\"\",IF('1. Autorización'!$I$6=\"Altiplano\",D291,IF('1. Autorización'!$I$6=\"Sur\",F291,IF('1. Autorización'!$I$6=\"Colegio Americano del Sur\",F291,B291))))","v":""}]
[null,null,null,null,null,null,null,null,{"$f":"IF(IF('1. Autorización'!$I$6=\"Altiplano\",C292,IF('1. Autorización'!$I$6=\"Sur\",E292,IF('1. Autorización'!$I$6=\"Colegio Americano del Sur\",E292,A292)))=0,\"\",IF('1. Autorización'!$I$6=\"Altiplano\",C292,IF('1. Autorización'!$I$6=\"Sur\",E292,IF('1. Autorización'!$I$6=\"Colegio Americano del Sur\",E292,A292))))","v":""},{"$f":"IF(IF('1. Autorización'!$I$6=\"Altiplano\",D292,IF('1. Autorización'!$I$6=\"Sur\",F292,IF('1. Autorización'!$I$6=\"Colegio Americano del Sur\",F292,B292)))=0,\"\",IF('1. Autorización'!$I$6=\"Altiplano\",D292,IF('1. Autorización'!$I$6=\"Sur\",F292,IF('1. Autorización'!$I$6=\"Colegio Americano del Sur\",F292,B292))))","v":""}]
[null,null,null,null,null,null,null,null,{"$f":"IF(IF('1. Autorización'!$I$6=\"Altiplano\",C293,IF('1. Autorización'!$I$6=\"Sur\",E293,IF('1. Autorización'!$I$6=\"Colegio Americano del Sur\",E293,A293)))=0,\"\",IF('1. Autorización'!$I$6=\"Altiplano\",C293,IF('1. Autorización'!$I$6=\"Sur\",E293,IF('1. Autorización'!$I$6=\"Colegio Americano del Sur\",E293,A293))))","v":""},{"$f":"IF(IF('1. Autorización'!$I$6=\"Altiplano\",D293,IF('1. Autorización'!$I$6=\"Sur\",F293,IF('1. Autorización'!$I$6=\"Colegio Americano del Sur\",F293,B293)))=0,\"\",IF('1. Autorización'!$I$6=\"Altiplano\",D293,IF('1. Autorización'!$I$6=\"Sur\",F293,IF('1. Autorización'!$I$6=\"Colegio Americano del Sur\",F293,B293))))","v":""}]
[null,null,null,null,null,null,null,null,{"$f":"IF(IF('1. Autorización'!$I$6=\"Altiplano\",C294,IF('1. Autorización'!$I$6=\"Sur\",E294,IF('1. Autorización'!$I$6=\"Colegio Americano del Sur\",E294,A294)))=0,\"\",IF('1. Autorización'!$I$6=\"Altiplano\",C294,IF('1. Autorización'!$I$6=\"Sur\",E294,IF('1. Autorización'!$I$6=\"Colegio Americano del Sur\",E294,A294))))","v":""},{"$f":"IF(IF('1. Autorización'!$I$6=\"Altiplano\",D294,IF('1. Autorización'!$I$6=\"Sur\",F294,IF('1. Autorización'!$I$6=\"Colegio Americano del Sur\",F294,B294)))=0,\"\",IF('1. Autorización'!$I$6=\"Altiplano\",D294,IF('1. Autorización'!$I$6=\"Sur\",F294,IF('1. Autorización'!$I$6=\"Colegio Americano del Sur\",F294,B294))))","v":""}]
[null,null,null,null,null,null,null,null,{"$f":"IF(IF('1. Autorización'!$I$6=\"Altiplano\",C295,IF('1. Autorización'!$I$6=\"Sur\",E295,IF('1. Autorización'!$I$6=\"Colegio Americano del Sur\",E295,A295)))=0,\"\",IF('1. Autorización'!$I$6=\"Altiplano\",C295,IF('1. Autorización'!$I$6=\"Sur\",E295,IF('1. Autorización'!$I$6=\"Colegio Americano del Sur\",E295,A295))))","v":""},{"$f":"IF(IF('1. Autorización'!$I$6=\"Altiplano\",D295,IF('1. Autorización'!$I$6=\"Sur\",F295,IF('1. Autorización'!$I$6=\"Colegio Americano del Sur\",F295,B295)))=0,\"\",IF('1. Autorización'!$I$6=\"Altiplano\",D295,IF('1. Autorización'!$I$6=\"Sur\",F295,IF('1. Autorización'!$I$6=\"Colegio Americano del Sur\",F295,B295))))","v":""}]
[null,null,null,null,null,null,null,null,{"$f":"IF(IF('1. Autorización'!$I$6=\"Altiplano\",C296,IF('1. Autorización'!$I$6=\"Sur\",E296,IF('1. Autorización'!$I$6=\"Colegio Americano del Sur\",E296,A296)))=0,\"\",IF('1. Autorización'!$I$6=\"Altiplano\",C296,IF('1. Autorización'!$I$6=\"Sur\",E296,IF('1. Autorización'!$I$6=\"Colegio Americano del Sur\",E296,A296))))","v":""},{"$f":"IF(IF('1. Autorización'!$I$6=\"Altiplano\",D296,IF('1. Autorización'!$I$6=\"Sur\",F296,IF('1. Autorización'!$I$6=\"Colegio Americano del Sur\",F296,B296)))=0,\"\",IF('1. Autorización'!$I$6=\"Altiplano\",D296,IF('1. Autorización'!$I$6=\"Sur\",F296,IF('1. Autorización'!$I$6=\"Colegio Americano del Sur\",F296,B296))))","v":""}]
[null,null,null,null,null,null,null,null,{"$f":"IF(IF('1. Autorización'!$I$6=\"Altiplano\",C297,IF('1. Autorización'!$I$6=\"Sur\",E297,IF('1. Autorización'!$I$6=\"Colegio Americano del Sur\",E297,A297)))=0,\"\",IF('1. Autorización'!$I$6=\"Altiplano\",C297,IF('1. Autorización'!$I$6=\"Sur\",E297,IF('1. Autorización'!$I$6=\"Colegio Americano del Sur\",E297,A297))))","v":""},{"$f":"IF(IF('1. Autorización'!$I$6=\"Altiplano\",D297,IF('1. Autorización'!$I$6=\"Sur\",F297,IF('1. Autorización'!$I$6=\"Colegio Americano del Sur\",F297,B297)))=0,\"\",IF('1. Autorización'!$I$6=\"Altiplano\",D297,IF('1. Autorización'!$I$6=\"Sur\",F297,IF('1. Autorización'!$I$6=\"Colegio Americano del Sur\",F297,B297))))","v":""}]
[null,null,null,null,null,null,null,null,{"$f":"IF(IF('1. Autorización'!$I$6=\"Altiplano\",C298,IF('1. Autorización'!$I$6=\"Sur\",E298,IF('1. Autorización'!$I$6=\"Colegio Americano del Sur\",E298,A298)))=0,\"\",IF('1. Autorización'!$I$6=\"Altiplano\",C298,IF('1. Autorización'!$I$6=\"Sur\",E298,IF('1. Autorización'!$I$6=\"Colegio Americano del Sur\",E298,A298))))","v":""},{"$f":"IF(IF('1. Autorización'!$I$6=\"Altiplano\",D298,IF('1. Autorización'!$I$6=\"Sur\",F298,IF('1. Autorización'!$I$6=\"Colegio Americano del Sur\",F298,B298)))=0,\"\",IF('1. Autorización'!$I$6=\"Altiplano\",D298,IF('1. Autorización'!$I$6=\"Sur\",F298,IF('1. Autorización'!$I$6=\"Colegio Americano del Sur\",F298,B298))))","v":""}]
[null,null,null,null,null,null,null,null,{"$f":"IF(IF('1. Autorización'!$I$6=\"Altiplano\",C299,IF('1. Autorización'!$I$6=\"Sur\",E299,IF('1. Autorización'!$I$6=\"Colegio Americano del Sur\",E299,A299)))=0,\"\",IF('1. Autorización'!$I$6=\"Altiplano\",C299,IF('1. Autorización'!$I$6=\"Sur\",E299,IF('1. Autorización'!$I$6=\"Colegio Americano del Sur\",E299,A299))))","v":""},{"$f":"IF(IF('1. Autorización'!$I$6=\"Altiplano\",D299,IF('1. Autorización'!$I$6=\"Sur\",F299,IF('1. Autorización'!$I$6=\"Colegio Americano del Sur\",F299,B299)))=0,\"\",IF('1. Autorización'!$I$6=\"Altiplano\",D299,IF('1. Autorización'!$I$6=\"Sur\",F299,IF('1. Autorización'!$I$6=\"Colegio Americano del Sur\",F299,B299))))","v":""}]
[null,null,null,null,null,null,null,null,{"$f":"IF(IF('1. Autorización'!$I$6=\"Altiplano\",C300,IF('1. Autorización'!$I$6=\"Sur\",E300,IF('1. Autorización'!$I$6=\"Colegio Americano del Sur\",E300,A300)))=0,\"\",IF('1. Autorización'!$I$6=\"Altiplano\",C300,IF('1. Autorización'!$I$6=\"Sur\",E300,IF('1. Autorización'!$I$6=\"Colegio Americano del Sur\",E300,A300))))","v":""},{"$f":"IF(IF('1. Autorización'!$I$6=\"Altiplano\",D300,IF('1. Autorización'!$I$6=\"Sur\",F300,IF('1. Autorización'!$I$6=\"Colegio Americano del Sur\",F300,B300)))=0,\"\",IF('1. Autorización'!$I$6=\"Altiplano\",D300,IF('1. Autorización'!$I$6=\"Sur\",F300,IF('1. Autorización'!$I$6=\"Colegio Americano del Sur\",F300,B300))))","v":""}]
[null,null,null,null,null,null,null,null,{"$f":"IF(IF('1. Autorización'!$I$6=\"Altiplano\",C301,IF('1. Autorización'!$I$6=\"Sur\",E301,IF('1. Autorización'!$I$6=\"Colegio Americano del Sur\",E301,A301)))=0,\"\",IF('1. Autorización'!$I$6=\"Altiplano\",C301,IF('1. Autorización'!$I$6=\"Sur\",E301,IF('1. Autorización'!$I$6=\"Colegio Americano del Sur\",E301,A301))))","v":""},{"$f":"IF(IF('1. Autorización'!$I$6=\"Altiplano\",D301,IF('1. Autorización'!$I$6=\"Sur\",F301,IF('1. Autorización'!$I$6=\"Colegio Americano del Sur\",F301,B301)))=0,\"\",IF('1. Autorización'!$I$6=\"Altiplano\",D301,IF('1. Autorización'!$I$6=\"Sur\",F301,IF('1. Autorización'!$I$6=\"Colegio Americano del Sur\",F301,B301))))","v":""}]
[null,null,null,null,null,null,null,null,{"$f":"IF(IF('1. Autorización'!$I$6=\"Altiplano\",C302,IF('1. Autorización'!$I$6=\"Sur\",E302,IF('1. Autorización'!$I$6=\"Colegio Americano del Sur\",E302,A302)))=0,\"\",IF('1. Autorización'!$I$6=\"Altiplano\",C302,IF('1. Autorización'!$I$6=\"Sur\",E302,IF('1. Autorización'!$I$6=\"Colegio Americano del Sur\",E302,A302))))","v":""},{"$f":"IF(IF('1. Autorización'!$I$6=\"Altiplano\",D302,IF('1. Autorización'!$I$6=\"Sur\",F302,IF('1. Autorización'!$I$6=\"Colegio Americano del Sur\",F302,B302)))=0,\"\",IF('1. Autorización'!$I$6=\"Altiplano\",D302,IF('1. Autorización'!$I$6=\"Sur\",F302,IF('1. Autorización'!$I$6=\"Colegio Americano del Sur\",F302,B302))))","v":""}]
[null,null,null,null,null,null,null,null,{"$f":"IF(IF('1. Autorización'!$I$6=\"Altiplano\",C303,IF('1. Autorización'!$I$6=\"Sur\",E303,IF('1. Autorización'!$I$6=\"Colegio Americano del Sur\",E303,A303)))=0,\"\",IF('1. Autorización'!$I$6=\"Altiplano\",C303,IF('1. Autorización'!$I$6=\"Sur\",E303,IF('1. Autorización'!$I$6=\"Colegio Americano del Sur\",E303,A303))))","v":""},{"$f":"IF(IF('1. Autorización'!$I$6=\"Altiplano\",D303,IF('1. Autorización'!$I$6=\"Sur\",F303,IF('1. Autorización'!$I$6=\"Colegio Americano del Sur\",F303,B303)))=0,\"\",IF('1. Autorización'!$I$6=\"Altiplano\",D303,IF('1. Autorización'!$I$6=\"Sur\",F303,IF('1. Autorización'!$I$6=\"Colegio Americano del Sur\",F303,B303))))","v":""}]
[null,null,null,null,null,null,null,null,{"$f":"IF(IF('1. Autorización'!$I$6=\"Altiplano\",C304,IF('1. Autorización'!$I$6=\"Sur\",E304,IF('1. Autorización'!$I$6=\"Colegio Americano del Sur\",E304,A304)))=0,\"\",IF('1. Autorización'!$I$6=\"Altiplano\",C304,IF('1. Autorización'!$I$6=\"Sur\",E304,IF('1. Autorización'!$I$6=\"Colegio Americano del Sur\",E304,A304))))","v":""},{"$f":"IF(IF('1. Autorización'!$I$6=\"Altiplano\",D304,IF('1. Autorización'!$I$6=\"Sur\",F304,IF('1. Autorización'!$I$6=\"Colegio Americano del Sur\",F304,B304)))=0,\"\",IF('1. Autorización'!$I$6=\"Altiplano\",D304,IF('1. Autorización'!$I$6=\"Sur\",F304,IF('1. Autorización'!$I$6=\"Colegio Americano del Sur\",F304,B304))))","v":""}]
[null,null,null,null,null,null,null,null,{"$f":"IF(IF('1. Autorización'!$I$6=\"Altiplano\",C305,IF('1. Autorización'!$I$6=\"Sur\",E305,IF('1. Autorización'!$I$6=\"Colegio Americano del Sur\",E305,A305)))=0,\"\",IF('1. Autorización'!$I$6=\"Altiplano\",C305,IF('1. Autorización'!$I$6=\"Sur\",E305,IF('1. Autorización'!$I$6=\"Colegio Americano del Sur\",E305,A305))))","v":""},{"$f":"IF(IF('1. Autorización'!$I$6=\"Altiplano\",D305,IF('1. Autorización'!$I$6=\"Sur\",F305,IF('1. Autorización'!$I$6=\"Colegio Americano del Sur\",F305,B305)))=0,\"\",IF('1. Autorización'!$I$6=\"Altiplano\",D305,IF('1. Autorización'!$I$6=\"Sur\",F305,IF('1. Autorización'!$I$6=\"Colegio Americano del Sur\",F305,B305))))","v":""}]
[null,null,null,null,null,null,null,null,{"$f":"IF(IF('1. Autorización'!$I$6=\"Altiplano\",C306,IF('1. Autorización'!$I$6=\"Sur\",E306,IF('1. Autorización'!$I$6=\"Colegio Americano del Sur\",E306,A306)))=0,\"\",IF('1. Autorización'!$I$6=\"Altiplano\",C306,IF('1. Autorización'!$I$6=\"Sur\",E306,IF('1. Autorización'!$I$6=\"Colegio Americano del Sur\",E306,A306))))","v":""},{"$f":"IF(IF('1. Autorización'!$I$6=\"Altiplano\",D306,IF('1. Autorización'!$I$6=\"Sur\",F306,IF('1. Autorización'!$I$6=\"Colegio Americano del Sur\",F306,B306)))=0,\"\",IF('1. Autorización'!$I$6=\"Altiplano\",D306,IF('1. Autorización'!$I$6=\"Sur\",F306,IF('1. Autorización'!$I$6=\"Colegio Americano del Sur\",F306,B306))))","v":""}]
[null,null,null,null,null,null,null,null,{"$f":"IF(IF('1. Autorización'!$I$6=\"Altiplano\",C307,IF('1. Autorización'!$I$6=\"Sur\",E307,IF('1. Autorización'!$I$6=\"Colegio Americano del Sur\",E307,A307)))=0,\"\",IF('1. Autorización'!$I$6=\"Altiplano\",C307,IF('1. Autorización'!$I$6=\"Sur\",E307,IF('1. Autorización'!$I$6=\"Colegio Americano del Sur\",E307,A307))))","v":""},{"$f":"IF(IF('1. Autorización'!$I$6=\"Altiplano\",D307,IF('1. Autorización'!$I$6=\"Sur\",F307,IF('1. Autorización'!$I$6=\"Colegio Americano del Sur\",F307,B307)))=0,\"\",IF('1. Autorización'!$I$6=\"Altiplano\",D307,IF('1. Autorización'!$I$6=\"Sur\",F307,IF('1. Autorización'!$I$6=\"Colegio Americano del Sur\",F307,B307))))","v":""}]
[null,null,null,null,null,null,null,null,{"$f":"IF(IF('1. Autorización'!$I$6=\"Altiplano\",C308,IF('1. Autorización'!$I$6=\"Sur\",E308,IF('1. Autorización'!$I$6=\"Colegio Americano del Sur\",E308,A308)))=0,\"\",IF('1. Autorización'!$I$6=\"Altiplano\",C308,IF('1. Autorización'!$I$6=\"Sur\",E308,IF('1. Autorización'!$I$6=\"Colegio Americano del Sur\",E308,A308))))","v":""},{"$f":"IF(IF('1. Autorización'!$I$6=\"Altiplano\",D308,IF('1. Autorización'!$I$6=\"Sur\",F308,IF('1. Autorización'!$I$6=\"Colegio Americano del Sur\",F308,B308)))=0,\"\",IF('1. Autorización'!$I$6=\"Altiplano\",D308,IF('1. Autorización'!$I$6=\"Sur\",F308,IF('1. Autorización'!$I$6=\"Colegio Americano del Sur\",F308,B308))))","v":""}]
[null,null,null,null,null,null,null,null,{"$f":"IF(IF('1. Autorización'!$I$6=\"Altiplano\",C309,IF('1. Autorización'!$I$6=\"Sur\",E309,IF('1. Autorización'!$I$6=\"Colegio Americano del Sur\",E309,A309)))=0,\"\",IF('1. Autorización'!$I$6=\"Altiplano\",C309,IF('1. Autorización'!$I$6=\"Sur\",E309,IF('1. Autorización'!$I$6=\"Colegio Americano del Sur\",E309,A309))))","v":""},{"$f":"IF(IF('1. Autorización'!$I$6=\"Altiplano\",D309,IF('1. Autorización'!$I$6=\"Sur\",F309,IF('1. Autorización'!$I$6=\"Colegio Americano del Sur\",F309,B309)))=0,\"\",IF('1. Autorización'!$I$6=\"Altiplano\",D309,IF('1. Autorización'!$I$6=\"Sur\",F309,IF('1. Autorización'!$I$6=\"Colegio Americano del Sur\",F309,B309))))","v":""}]
[null,null,null,null,null,null,null,null,{"$f":"IF(IF('1. Autorización'!$I$6=\"Altiplano\",C310,IF('1. Autorización'!$I$6=\"Sur\",E310,IF('1. Autorización'!$I$6=\"Colegio Americano del Sur\",E310,A310)))=0,\"\",IF('1. Autorización'!$I$6=\"Altiplano\",C310,IF('1. Autorización'!$I$6=\"Sur\",E310,IF('1. Autorización'!$I$6=\"Colegio Americano del Sur\",E310,A310))))","v":""},{"$f":"IF(IF('1. Autorización'!$I$6=\"Altiplano\",D310,IF('1. Autorización'!$I$6=\"Sur\",F310,IF('1. Autorización'!$I$6=\"Colegio Americano del Sur\",F310,B310)))=0,\"\",IF('1. Autorización'!$I$6=\"Altiplano\",D310,IF('1. Autorización'!$I$6=\"Sur\",F310,IF('1. Autorización'!$I$6=\"Colegio Americano del Sur\",F310,B310))))","v":""}]
[null,null,null,null,null,null,null,null,{"$f":"IF(IF('1. Autorización'!$I$6=\"Altiplano\",C311,IF('1. Autorización'!$I$6=\"Sur\",E311,IF('1. Autorización'!$I$6=\"Colegio Americano del Sur\",E311,A311)))=0,\"\",IF('1. Autorización'!$I$6=\"Altiplano\",C311,IF('1. Autorización'!$I$6=\"Sur\",E311,IF('1. Autorización'!$I$6=\"Colegio Americano del Sur\",E311,A311))))","v":""},{"$f":"IF(IF('1. Autorización'!$I$6=\"Altiplano\",D311,IF('1. Autorización'!$I$6=\"Sur\",F311,IF('1. Autorización'!$I$6=\"Colegio Americano del Sur\",F311,B311)))=0,\"\",IF('1. Autorización'!$I$6=\"Altiplano\",D311,IF('1. Autorización'!$I$6=\"Sur\",F311,IF('1. Autorización'!$I$6=\"Colegio Americano del Sur\",F311,B311))))","v":""}]
[null,null,null,null,null,null,null,null,{"$f":"IF(IF('1. Autorización'!$I$6=\"Altiplano\",C312,IF('1. Autorización'!$I$6=\"Sur\",E312,IF('1. Autorización'!$I$6=\"Colegio Americano del Sur\",E312,A312)))=0,\"\",IF('1. Autorización'!$I$6=\"Altiplano\",C312,IF('1. Autorización'!$I$6=\"Sur\",E312,IF('1. Autorización'!$I$6=\"Colegio Americano del Sur\",E312,A312))))","v":""},{"$f":"IF(IF('1. Autorización'!$I$6=\"Altiplano\",D312,IF('1. Autorización'!$I$6=\"Sur\",F312,IF('1. Autorización'!$I$6=\"Colegio Americano del Sur\",F312,B312)))=0,\"\",IF('1. Autorización'!$I$6=\"Altiplano\",D312,IF('1. Autorización'!$I$6=\"Sur\",F312,IF('1. Autorización'!$I$6=\"Colegio Americano del Sur\",F312,B312))))","v":""}]
[null,null,null,null,null,null,null,null,{"$f":"IF(IF('1. Autorización'!$I$6=\"Altiplano\",C313,IF('1. Autorización'!$I$6=\"Sur\",E313,IF('1. Autorización'!$I$6=\"Colegio Americano del Sur\",E313,A313)))=0,\"\",IF('1. Autorización'!$I$6=\"Altiplano\",C313,IF('1. Autorización'!$I$6=\"Sur\",E313,IF('1. Autorización'!$I$6=\"Colegio Americano del Sur\",E313,A313))))","v":""},{"$f":"IF(IF('1. Autorización'!$I$6=\"Altiplano\",D313,IF('1. Autorización'!$I$6=\"Sur\",F313,IF('1. Autorización'!$I$6=\"Colegio Americano del Sur\",F313,B313)))=0,\"\",IF('1. Autorización'!$I$6=\"Altiplano\",D313,IF('1. Autorización'!$I$6=\"Sur\",F313,IF('1. Autorización'!$I$6=\"Colegio Americano del Sur\",F313,B313))))","v":""}]
[null,null,null,null,null,null,null,null,{"$f":"IF(IF('1. Autorización'!$I$6=\"Altiplano\",C314,IF('1. Autorización'!$I$6=\"Sur\",E314,IF('1. Autorización'!$I$6=\"Colegio Americano del Sur\",E314,A314)))=0,\"\",IF('1. Autorización'!$I$6=\"Altiplano\",C314,IF('1. Autorización'!$I$6=\"Sur\",E314,IF('1. Autorización'!$I$6=\"Colegio Americano del Sur\",E314,A314))))","v":""},{"$f":"IF(IF('1. Autorización'!$I$6=\"Altiplano\",D314,IF('1. Autorización'!$I$6=\"Sur\",F314,IF('1. Autorización'!$I$6=\"Colegio Americano del Sur\",F314,B314)))=0,\"\",IF('1. Autorización'!$I$6=\"Altiplano\",D314,IF('1. Autorización'!$I$6=\"Sur\",F314,IF('1. Autorización'!$I$6=\"Colegio Americano del Sur\",F314,B314))))","v":""}]
[null,null,null,null,null,null,null,null,{"$f":"IF(IF('1. Autorización'!$I$6=\"Altiplano\",C315,IF('1. Autorización'!$I$6=\"Sur\",E315,IF('1. Autorización'!$I$6=\"Colegio Americano del Sur\",E315,A315)))=0,\"\",IF('1. Autorización'!$I$6=\"Altiplano\",C315,IF('1. Autorización'!$I$6=\"Sur\",E315,IF('1. Autorización'!$I$6=\"Colegio Americano del Sur\",E315,A315))))","v":""},{"$f":"IF(IF('1. Autorización'!$I$6=\"Altiplano\",D315,IF('1. Autorización'!$I$6=\"Sur\",F315,IF('1. Autorización'!$I$6=\"Colegio Americano del Sur\",F315,B315)))=0,\"\",IF('1. Autorización'!$I$6=\"Altiplano\",D315,IF('1. Autorización'!$I$6=\"Sur\",F315,IF('1. Autorización'!$I$6=\"Colegio Americano del Sur\",F315,B315))))","v":""}]
[null,null,null,null,null,null,null,null,{"$f":"IF(IF('1. Autorización'!$I$6=\"Altiplano\",C316,IF('1. Autorización'!$I$6=\"Sur\",E316,IF('1. Autorización'!$I$6=\"Colegio Americano del Sur\",E316,A316)))=0,\"\",IF('1. Autorización'!$I$6=\"Altiplano\",C316,IF('1. Autorización'!$I$6=\"Sur\",E316,IF('1. Autorización'!$I$6=\"Colegio Americano del Sur\",E316,A316))))","v":""},{"$f":"IF(IF('1. Autorización'!$I$6=\"Altiplano\",D316,IF('1. Autorización'!$I$6=\"Sur\",F316,IF('1. Autorización'!$I$6=\"Colegio Americano del Sur\",F316,B316)))=0,\"\",IF('1. Autorización'!$I$6=\"Altiplano\",D316,IF('1. Autorización'!$I$6=\"Sur\",F316,IF('1. Autorización'!$I$6=\"Colegio Americano del Sur\",F316,B316))))","v":""}]
[null,null,null,null,null,null,null,null,{"$f":"IF(IF('1. Autorización'!$I$6=\"Altiplano\",C317,IF('1. Autorización'!$I$6=\"Sur\",E317,IF('1. Autorización'!$I$6=\"Colegio Americano del Sur\",E317,A317)))=0,\"\",IF('1. Autorización'!$I$6=\"Altiplano\",C317,IF('1. Autorización'!$I$6=\"Sur\",E317,IF('1. Autorización'!$I$6=\"Colegio Americano del Sur\",E317,A317))))","v":""},{"$f":"IF(IF('1. Autorización'!$I$6=\"Altiplano\",D317,IF('1. Autorización'!$I$6=\"Sur\",F317,IF('1. Autorización'!$I$6=\"Colegio Americano del Sur\",F317,B317)))=0,\"\",IF('1. Autorización'!$I$6=\"Altiplano\",D317,IF('1. Autorización'!$I$6=\"Sur\",F317,IF('1. Autorización'!$I$6=\"Colegio Americano del Sur\",F317,B317))))","v":""}]
[null,null,null,null,null,null,null,null,{"$f":"IF(IF('1. Autorización'!$I$6=\"Altiplano\",C318,IF('1. Autorización'!$I$6=\"Sur\",E318,IF('1. Autorización'!$I$6=\"Colegio Americano del Sur\",E318,A318)))=0,\"\",IF('1. Autorización'!$I$6=\"Altiplano\",C318,IF('1. Autorización'!$I$6=\"Sur\",E318,IF('1. Autorización'!$I$6=\"Colegio Americano del Sur\",E318,A318))))","v":""},{"$f":"IF(IF('1. Autorización'!$I$6=\"Altiplano\",D318,IF('1. Autorización'!$I$6=\"Sur\",F318,IF('1. Autorización'!$I$6=\"Colegio Americano del Sur\",F318,B318)))=0,\"\",IF('1. Autorización'!$I$6=\"Altiplano\",D318,IF('1. Autorización'!$I$6=\"Sur\",F318,IF('1. Autorización'!$I$6=\"Colegio Americano del Sur\",F318,B318))))","v":""}]
[null,null,null,null,null,null,null,null,{"$f":"IF(IF('1. Autorización'!$I$6=\"Altiplano\",C319,IF('1. Autorización'!$I$6=\"Sur\",E319,IF('1. Autorización'!$I$6=\"Colegio Americano del Sur\",E319,A319)))=0,\"\",IF('1. Autorización'!$I$6=\"Altiplano\",C319,IF('1. Autorización'!$I$6=\"Sur\",E319,IF('1. Autorización'!$I$6=\"Colegio Americano del Sur\",E319,A319))))","v":""},{"$f":"IF(IF('1. Autorización'!$I$6=\"Altiplano\",D319,IF('1. Autorización'!$I$6=\"Sur\",F319,IF('1. Autorización'!$I$6=\"Colegio Americano del Sur\",F319,B319)))=0,\"\",IF('1. Autorización'!$I$6=\"Altiplano\",D319,IF('1. Autorización'!$I$6=\"Sur\",F319,IF('1. Autorización'!$I$6=\"Colegio Americano del Sur\",F319,B319))))","v":""}]
[null,null,null,null,null,null,null,null,{"$f":"IF(IF('1. Autorización'!$I$6=\"Altiplano\",C320,IF('1. Autorización'!$I$6=\"Sur\",E320,IF('1. Autorización'!$I$6=\"Colegio Americano del Sur\",E320,A320)))=0,\"\",IF('1. Autorización'!$I$6=\"Altiplano\",C320,IF('1. Autorización'!$I$6=\"Sur\",E320,IF('1. Autorización'!$I$6=\"Colegio Americano del Sur\",E320,A320))))","v":""},{"$f":"IF(IF('1. Autorización'!$I$6=\"Altiplano\",D320,IF('1. Autorización'!$I$6=\"Sur\",F320,IF('1. Autorización'!$I$6=\"Colegio Americano del Sur\",F320,B320)))=0,\"\",IF('1. Autorización'!$I$6=\"Altiplano\",D320,IF('1. Autorización'!$I$6=\"Sur\",F320,IF('1. Autorización'!$I$6=\"Colegio Americano del Sur\",F320,B320))))","v":""}]
[null,null,null,null,null,null,null,null,{"$f":"IF(IF('1. Autorización'!$I$6=\"Altiplano\",C321,IF('1. Autorización'!$I$6=\"Sur\",E321,IF('1. Autorización'!$I$6=\"Colegio Americano del Sur\",E321,A321)))=0,\"\",IF('1. Autorización'!$I$6=\"Altiplano\",C321,IF('1. Autorización'!$I$6=\"Sur\",E321,IF('1. Autorización'!$I$6=\"Colegio Americano del Sur\",E321,A321))))","v":""},{"$f":"IF(IF('1. Autorización'!$I$6=\"Altiplano\",D321,IF('1. Autorización'!$I$6=\"Sur\",F321,IF('1. Autorización'!$I$6=\"Colegio Americano del Sur\",F321,B321)))=0,\"\",IF('1. Autorización'!$I$6=\"Altiplano\",D321,IF('1. Autorización'!$I$6=\"Sur\",F321,IF('1. Autorización'!$I$6=\"Colegio Americano del Sur\",F321,B321))))","v":""}]
[null,null,null,null,null,null,null,null,{"$f":"IF(IF('1. Autorización'!$I$6=\"Altiplano\",C322,IF('1. Autorización'!$I$6=\"Sur\",E322,IF('1. Autorización'!$I$6=\"Colegio Americano del Sur\",E322,A322)))=0,\"\",IF('1. Autorización'!$I$6=\"Altiplano\",C322,IF('1. Autorización'!$I$6=\"Sur\",E322,IF('1. Autorización'!$I$6=\"Colegio Americano del Sur\",E322,A322))))","v":""},{"$f":"IF(IF('1. Autorización'!$I$6=\"Altiplano\",D322,IF('1. Autorización'!$I$6=\"Sur\",F322,IF('1. Autorización'!$I$6=\"Colegio Americano del Sur\",F322,B322)))=0,\"\",IF('1. Autorización'!$I$6=\"Altiplano\",D322,IF('1. Autorización'!$I$6=\"Sur\",F322,IF('1. Autorización'!$I$6=\"Colegio Americano del Sur\",F322,B322))))","v":""}]
[null,null,null,null,null,null,null,null,{"$f":"IF(IF('1. Autorización'!$I$6=\"Altiplano\",C323,IF('1. Autorización'!$I$6=\"Sur\",E323,IF('1. Autorización'!$I$6=\"Colegio Americano del Sur\",E323,A323)))=0,\"\",IF('1. Autorización'!$I$6=\"Altiplano\",C323,IF('1. Autorización'!$I$6=\"Sur\",E323,IF('1. Autorización'!$I$6=\"Colegio Americano del Sur\",E323,A323))))","v":""},{"$f":"IF(IF('1. Autorización'!$I$6=\"Altiplano\",D323,IF('1. Autorización'!$I$6=\"Sur\",F323,IF('1. Autorización'!$I$6=\"Colegio Americano del Sur\",F323,B323)))=0,\"\",IF('1. Autorización'!$I$6=\"Altiplano\",D323,IF('1. Autorización'!$I$6=\"Sur\",F323,IF('1. Autorización'!$I$6=\"Colegio Americano del Sur\",F323,B323))))","v":""}]
[null,null,null,null,null,null,null,null,{"$f":"IF(IF('1. Autorización'!$I$6=\"Altiplano\",C324,IF('1. Autorización'!$I$6=\"Sur\",E324,IF('1. Autorización'!$I$6=\"Colegio Americano del Sur\",E324,A324)))=0,\"\",IF('1. Autorización'!$I$6=\"Altiplano\",C324,IF('1. Autorización'!$I$6=\"Sur\",E324,IF('1. Autorización'!$I$6=\"Colegio Americano del Sur\",E324,A324))))","v":""},{"$f":"IF(IF('1. Autorización'!$I$6=\"Altiplano\",D324,IF('1. Autorización'!$I$6=\"Sur\",F324,IF('1. Autorización'!$I$6=\"Colegio Americano del Sur\",F324,B324)))=0,\"\",IF('1. Autorización'!$I$6=\"Altiplano\",D324,IF('1. Autorización'!$I$6=\"Sur\",F324,IF('1. Autorización'!$I$6=\"Colegio Americano del Sur\",F324,B324))))","v":""}]
[null,null,null,null,null,null,null,null,{"$f":"IF(IF('1. Autorización'!$I$6=\"Altiplano\",C325,IF('1. Autorización'!$I$6=\"Sur\",E325,IF('1. Autorización'!$I$6=\"Colegio Americano del Sur\",E325,A325)))=0,\"\",IF('1. Autorización'!$I$6=\"Altiplano\",C325,IF('1. Autorización'!$I$6=\"Sur\",E325,IF('1. Autorización'!$I$6=\"Colegio Americano del Sur\",E325,A325))))","v":""},{"$f":"IF(IF('1. Autorización'!$I$6=\"Altiplano\",D325,IF('1. Autorización'!$I$6=\"Sur\",F325,IF('1. Autorización'!$I$6=\"Colegio Americano del Sur\",F325,B325)))=0,\"\",IF('1. Autorización'!$I$6=\"Altiplano\",D325,IF('1. Autorización'!$I$6=\"Sur\",F325,IF('1. Autorización'!$I$6=\"Colegio Americano del Sur\",F325,B325))))","v":""}]
[null,null,null,null,null,null,null,null,{"$f":"IF(IF('1. Autorización'!$I$6=\"Altiplano\",C326,IF('1. Autorización'!$I$6=\"Sur\",E326,IF('1. Autorización'!$I$6=\"Colegio Americano del Sur\",E326,A326)))=0,\"\",IF('1. Autorización'!$I$6=\"Altiplano\",C326,IF('1. Autorización'!$I$6=\"Sur\",E326,IF('1. Autorización'!$I$6=\"Colegio Americano del Sur\",E326,A326))))","v":""},{"$f":"IF(IF('1. Autorización'!$I$6=\"Altiplano\",D326,IF('1. Autorización'!$I$6=\"Sur\",F326,IF('1. Autorización'!$I$6=\"Colegio Americano del Sur\",F326,B326)))=0,\"\",IF('1. Autorización'!$I$6=\"Altiplano\",D326,IF('1. Autorización'!$I$6=\"Sur\",F326,IF('1. Autorización'!$I$6=\"Colegio Americano del Sur\",F326,B326))))","v":""}]
[null,null,null,null,null,null,null,null,{"$f":"IF(IF('1. Autorización'!$I$6=\"Altiplano\",C327,IF('1. Autorización'!$I$6=\"Sur\",E327,IF('1. Autorización'!$I$6=\"Colegio Americano del Sur\",E327,A327)))=0,\"\",IF('1. Autorización'!$I$6=\"Altiplano\",C327,IF('1. Autorización'!$I$6=\"Sur\",E327,IF('1. Autorización'!$I$6=\"Colegio Americano del Sur\",E327,A327))))","v":""}]
[null,null,null,null,null,null,null,null,{"$f":"IF(IF('1. Autorización'!$I$6=\"Altiplano\",C328,IF('1. Autorización'!$I$6=\"Sur\",E328,IF('1. Autorización'!$I$6=\"Colegio Americano del Sur\",E328,A328)))=0,\"\",IF('1. Autorización'!$I$6=\"Altiplano\",C328,IF('1. Autorización'!$I$6=\"Sur\",E328,IF('1. Autorización'!$I$6=\"Colegio Americano del Sur\",E328,A328))))","v":""}]
[null,null,null,null,null,null,null,null,{"$f":"IF(IF('1. Autorización'!$I$6=\"Altiplano\",C329,IF('1. Autorización'!$I$6=\"Sur\",E329,IF('1. Autorización'!$I$6=\"Colegio Americano del Sur\",E329,A329)))=0,\"\",IF('1. Autorización'!$I$6=\"Altiplano\",C329,IF('1. Autorización'!$I$6=\"Sur\",E329,IF('1. Autorización'!$I$6=\"Colegio Americano del Sur\",E329,A329))))","v":""}]
[null,null,null,null,null,null,null,null,{"$f":"IF(IF('1. Autorización'!$I$6=\"Altiplano\",C330,IF('1. Autorización'!$I$6=\"Sur\",E330,IF('1. Autorización'!$I$6=\"Colegio Americano del Sur\",E330,A330)))=0,\"\",IF('1. Autorización'!$I$6=\"Altiplano\",C330,IF('1. Autorización'!$I$6=\"Sur\",E330,IF('1. Autorización'!$I$6=\"Colegio Americano del Sur\",E330,A330))))","v":""}]
[null,null,null,null,null,null,null,null,{"$f":"IF(IF('1. Autorización'!$I$6=\"Altiplano\",C331,IF('1. Autorización'!$I$6=\"Sur\",E331,IF('1. Autorización'!$I$6=\"Colegio Americano del Sur\",E331,A331)))=0,\"\",IF('1. Autorización'!$I$6=\"Altiplano\",C331,IF('1. Autorización'!$I$6=\"Sur\",E331,IF('1. Autorización'!$I$6=\"Colegio Americano del Sur\",E331,A331))))","v":""}]
[null,null,null,null,null,null,null,null,{"$f":"IF(IF('1. Autorización'!$I$6=\"Altiplano\",C332,IF('1. Autorización'!$I$6=\"Sur\",E332,IF('1. Autorización'!$I$6=\"Colegio Americano del Sur\",E332,A332)))=0,\"\",IF('1. Autorización'!$I$6=\"Altiplano\",C332,IF('1. Autorización'!$I$6=\"Sur\",E332,IF('1. Autorización'!$I$6=\"Colegio Americano del Sur\",E332,A332))))","v":""}]
[null,null,null,null,null,null,null,null,{"$f":"IF(IF('1. Autorización'!$I$6=\"Altiplano\",C333,IF('1. Autorización'!$I$6=\"Sur\",E333,IF('1. Autorización'!$I$6=\"Colegio Americano del Sur\",E333,A333)))=0,\"\",IF('1. Autorización'!$I$6=\"Altiplano\",C333,IF('1. Autorización'!$I$6=\"Sur\",E333,IF('1. Autorización'!$I$6=\"Colegio Americano del Sur\",E333,A333))))","v":""}]
[null,null,null,null,null,null,null,null,{"$f":"IF(IF('1. Autorización'!$I$6=\"Altiplano\",C334,IF('1. Autorización'!$I$6=\"Sur\",E334,IF('1. Autorización'!$I$6=\"Colegio Americano del Sur\",E334,A334)))=0,\"\",IF('1. Autorización'!$I$6=\"Altiplano\",C334,IF('1. Autorización'!$I$6=\"Sur\",E334,IF('1. Autorización'!$I$6=\"Colegio Americano del Sur\",E334,A334))))","v":""}]
[null,null,null,null,null,null,null,null,{"$f":"IF(IF('1. Autorización'!$I$6=\"Altiplano\",C335,IF('1. Autorización'!$I$6=\"Sur\",E335,IF('1. Autorización'!$I$6=\"Colegio Americano del Sur\",E335,A335)))=0,\"\",IF('1. Autorización'!$I$6=\"Altiplano\",C335,IF('1. Autorización'!$I$6=\"Sur\",E335,IF('1. Autorización'!$I$6=\"Colegio Americano del Sur\",E335,A335))))","v":""}]
[null,null,null,null,null,null,null,null,{"$f":"IF(IF('1. Autorización'!$I$6=\"Altiplano\",C336,IF('1. Autorización'!$I$6=\"Sur\",E336,IF('1. Autorización'!$I$6=\"Colegio Americano del Sur\",E336,A336)))=0,\"\",IF('1. Autorización'!$I$6=\"Altiplano\",C336,IF('1. Autorización'!$I$6=\"Sur\",E336,IF('1. Autorización'!$I$6=\"Colegio Americano del Sur\",E336,A336))))","v":""}]
[null,null,null,null,null,null,null,null,{"$f":"IF(IF('1. Autorización'!$I$6=\"Altiplano\",C337,IF('1. Autorización'!$I$6=\"Sur\",E337,IF('1. Autorización'!$I$6=\"Colegio Americano del Sur\",E337,A337)))=0,\"\",IF('1. Autorización'!$I$6=\"Altiplano\",C337,IF('1. Autorización'!$I$6=\"Sur\",E337,IF('1. Autorización'!$I$6=\"Colegio Americano del Sur\",E337,A337))))","v":""}]
[null,null,null,null,null,null,null,null,{"$f":"IF(IF('1. Autorización'!$I$6=\"Altiplano\",C338,IF('1. Autorización'!$I$6=\"Sur\",E338,IF('1. Autorización'!$I$6=\"Colegio Americano del Sur\",E338,A338)))=0,\"\",IF('1. Autorización'!$I$6=\"Altiplano\",C338,IF('1. Autorización'!$I$6=\"Sur\",E338,IF('1. Autorización'!$I$6=\"Colegio Americano del Sur\",E338,A338))))","v":""}]
[null,null,null,null,null,null,null,null,{"$f":"IF(IF('1. Autorización'!$I$6=\"Altiplano\",C339,IF('1. Autorización'!$I$6=\"Sur\",E339,IF('1. Autorización'!$I$6=\"Colegio Americano del Sur\",E339,A339)))=0,\"\",IF('1. Autorización'!$I$6=\"Altiplano\",C339,IF('1. Autorización'!$I$6=\"Sur\",E339,IF('1. Autorización'!$I$6=\"Colegio Americano del Sur\",E339,A339))))","v":""}]
[null,null,null,null,null,null,null,null,{"$f":"IF(IF('1. Autorización'!$I$6=\"Altiplano\",C340,IF('1. Autorización'!$I$6=\"Sur\",E340,IF('1. Autorización'!$I$6=\"Colegio Americano del Sur\",E340,A340)))=0,\"\",IF('1. Autorización'!$I$6=\"Altiplano\",C340,IF('1. Autorización'!$I$6=\"Sur\",E340,IF('1. Autorización'!$I$6=\"Colegio Americano del Sur\",E340,A340))))","v":""}]
[null,null,null,null,null,null,null,null,{"$f":"IF(IF('1. Autorización'!$I$6=\"Altiplano\",C341,IF('1. Autorización'!$I$6=\"Sur\",E341,IF('1. Autorización'!$I$6=\"Colegio Americano del Sur\",E341,A341)))=0,\"\",IF('1. Autorización'!$I$6=\"Altiplano\",C341,IF('1. Autorización'!$I$6=\"Sur\",E341,IF('1. Autorización'!$I$6=\"Colegio Americano del Sur\",E341,A341))))","v":""}]
[null,null,null,null,null,null,null,null,{"$f":"IF(IF('1. Autorización'!$I$6=\"Altiplano\",C342,IF('1. Autorización'!$I$6=\"Sur\",E342,IF('1. Autorización'!$I$6=\"Colegio Americano del Sur\",E342,A342)))=0,\"\",IF('1. Autorización'!$I$6=\"Altiplano\",C342,IF('1. Autorización'!$I$6=\"Sur\",E342,IF('1. Autorización'!$I$6=\"Colegio Americano del Sur\",E342,A342))))","v":""}]
[null,null,null,null,null,null,null,null,{"$f":"IF(IF('1. Autorización'!$I$6=\"Altiplano\",C343,IF('1. Autorización'!$I$6=\"Sur\",E343,IF('1. Autorización'!$I$6=\"Colegio Americano del Sur\",E343,A343)))=0,\"\",IF('1. Autorización'!$I$6=\"Altiplano\",C343,IF('1. Autorización'!$I$6=\"Sur\",E343,IF('1. Autorización'!$I$6=\"Colegio Americano del Sur\",E343,A343))))","v":""}]
[null,null,null,null,null,null,null,null,{"$f":"IF(IF('1. Autorización'!$I$6=\"Altiplano\",C344,IF('1. Autorización'!$I$6=\"Sur\",E344,IF('1. Autorización'!$I$6=\"Colegio Americano del Sur\",E344,A344)))=0,\"\",IF('1. Autorización'!$I$6=\"Altiplano\",C344,IF('1. Autorización'!$I$6=\"Sur\",E344,IF('1. Autorización'!$I$6=\"Colegio Americano del Sur\",E344,A344))))","v":""}]
[null,null,null,null,null,null,null,null,{"$f":"IF(IF('1. Autorización'!$I$6=\"Altiplano\",C345,IF('1. Autorización'!$I$6=\"Sur\",E345,IF('1. Autorización'!$I$6=\"Colegio Americano del Sur\",E345,A345)))=0,\"\",IF('1. Autorización'!$I$6=\"Altiplano\",C345,IF('1. Autorización'!$I$6=\"Sur\",E345,IF('1. Autorización'!$I$6=\"Colegio Americano del Sur\",E345,A345))))","v":""}]
[null,null,null,null,null,null,null,null,{"$f":"IF(IF('1. Autorización'!$I$6=\"Altiplano\",C346,IF('1. Autorización'!$I$6=\"Sur\",E346,IF('1. Autorización'!$I$6=\"Colegio Americano del Sur\",E346,A346)))=0,\"\",IF('1. Autorización'!$I$6=\"Altiplano\",C346,IF('1. Autorización'!$I$6=\"Sur\",E346,IF('1. Autorización'!$I$6=\"Colegio Americano del Sur\",E346,A346))))","v":""}]
[null,null,null,null,null,null,null,null,{"$f":"IF(IF('1. Autorización'!$I$6=\"Altiplano\",C347,IF('1. Autorización'!$I$6=\"Sur\",E347,IF('1. Autorización'!$I$6=\"Colegio Americano del Sur\",E347,A347)))=0,\"\",IF('1. Autorización'!$I$6=\"Altiplano\",C347,IF('1. Autorización'!$I$6=\"Sur\",E347,IF('1. Autorización'!$I$6=\"Colegio Americano del Sur\",E347,A347))))","v":""}]
[null,null,null,null,null,null,null,null,{"$f":"IF(IF('1. Autorización'!$I$6=\"Altiplano\",C348,IF('1. Autorización'!$I$6=\"Sur\",E348,IF('1. Autorización'!$I$6=\"Colegio Americano del Sur\",E348,A348)))=0,\"\",IF('1. Autorización'!$I$6=\"Altiplano\",C348,IF('1. Autorización'!$I$6=\"Sur\",E348,IF('1. Autorización'!$I$6=\"Colegio Americano del Sur\",E348,A348))))","v":""}]
[null,null,null,null,null,null,null,null,{"$f":"IF(IF('1. Autorización'!$I$6=\"Altiplano\",C349,IF('1. Autorización'!$I$6=\"Sur\",E349,IF('1. Autorización'!$I$6=\"Colegio Americano del Sur\",E349,A349)))=0,\"\",IF('1. Autorización'!$I$6=\"Altiplano\",C349,IF('1. Autorización'!$I$6=\"Sur\",E349,IF('1. Autorización'!$I$6=\"Colegio Americano del Sur\",E349,A349))))","v":""}]
[null,null,null,null,null,null,null,null,{"$f":"IF(IF('1. Autorización'!$I$6=\"Altiplano\",C350,IF('1. Autorización'!$I$6=\"Sur\",E350,IF('1. Autorización'!$I$6=\"Colegio Americano del Sur\",E350,A350)))=0,\"\",IF('1. Autorización'!$I$6=\"Altiplano\",C350,IF('1. Autorización'!$I$6=\"Sur\",E350,IF('1. Autorización'!$I$6=\"Colegio Americano del Sur\",E350,A350))))","v":""}]
[null,null,null,null,null,null,null,null,{"$f":"IF(IF('1. Autorización'!$I$6=\"Altiplano\",C351,IF('1. Autorización'!$I$6=\"Sur\",E351,IF('1. Autorización'!$I$6=\"Colegio Americano del Sur\",E351,A351)))=0,\"\",IF('1. Autorización'!$I$6=\"Altiplano\",C351,IF('1. Autorización'!$I$6=\"Sur\",E351,IF('1. Autorización'!$I$6=\"Colegio Americano del Sur\",E351,A351))))","v":""}]
[null,null,null,null,null,null,null,null,{"$f":"IF(IF('1. Autorización'!$I$6=\"Altiplano\",C352,IF('1. Autorización'!$I$6=\"Sur\",E352,IF('1. Autorización'!$I$6=\"Colegio Americano del Sur\",E352,A352)))=0,\"\",IF('1. Autorización'!$I$6=\"Altiplano\",C352,IF('1. Autorización'!$I$6=\"Sur\",E352,IF('1. Autorización'!$I$6=\"Colegio Americano del Sur\",E352,A352))))","v":""}]
[null,null,null,null,null,null,null,null,{"$f":"IF(IF('1. Autorización'!$I$6=\"Altiplano\",C353,IF('1. Autorización'!$I$6=\"Sur\",E353,IF('1. Autorización'!$I$6=\"Colegio Americano del Sur\",E353,A353)))=0,\"\",IF('1. Autorización'!$I$6=\"Altiplano\",C353,IF('1. Autorización'!$I$6=\"Sur\",E353,IF('1. Autorización'!$I$6=\"Colegio Americano del Sur\",E353,A353))))","v":""}]
[null,null,null,null,null,null,null,null,{"$f":"IF(IF('1. Autorización'!$I$6=\"Altiplano\",C354,IF('1. Autorización'!$I$6=\"Sur\",E354,IF('1. Autorización'!$I$6=\"Colegio Americano del Sur\",E354,A354)))=0,\"\",IF('1. Autorización'!$I$6=\"Altiplano\",C354,IF('1. Autorización'!$I$6=\"Sur\",E354,IF('1. Autorización'!$I$6=\"Colegio Americano del Sur\",E354,A354))))","v":""}]
[null,null,null,null,null,null,null,null,{"$f":"IF(IF('1. Autorización'!$I$6=\"Altiplano\",C355,IF('1. Autorización'!$I$6=\"Sur\",E355,IF('1. Autorización'!$I$6=\"Colegio Americano del Sur\",E355,A355)))=0,\"\",IF('1. Autorización'!$I$6=\"Altiplano\",C355,IF('1. Autorización'!$I$6=\"Sur\",E355,IF('1. Autorización'!$I$6=\"Colegio Americano del Sur\",E355,A355))))","v":""}]
[null,null,null,null,null,null,null,null,{"$f":"IF(IF('1. Autorización'!$I$6=\"Altiplano\",C356,IF('1. Autorización'!$I$6=\"Sur\",E356,IF('1. Autorización'!$I$6=\"Colegio Americano del Sur\",E356,A356)))=0,\"\",IF('1. Autorización'!$I$6=\"Altiplano\",C356,IF('1. Autorización'!$I$6=\"Sur\",E356,IF('1. Autorización'!$I$6=\"Colegio Americano del Sur\",E356,A356))))","v":""}]
[null,null,null,null,null,null,null,null,{"$f":"IF(IF('1. Autorización'!$I$6=\"Altiplano\",C357,IF('1. Autorización'!$I$6=\"Sur\",E357,IF('1. Autorización'!$I$6=\"Colegio Americano del Sur\",E357,A357)))=0,\"\",IF('1. Autorización'!$I$6=\"Altiplano\",C357,IF('1. Autorización'!$I$6=\"Sur\",E357,IF('1. Autorización'!$I$6=\"Colegio Americano del Sur\",E357,A357))))","v":""}]
[null,null,null,null,null,null,null,null,{"$f":"IF(IF('1. Autorización'!$I$6=\"Altiplano\",C358,IF('1. Autorización'!$I$6=\"Sur\",E358,IF('1. Autorización'!$I$6=\"Colegio Americano del Sur\",E358,A358)))=0,\"\",IF('1. Autorización'!$I$6=\"Altiplano\",C358,IF('1. Autorización'!$I$6=\"Sur\",E358,IF('1. Autorización'!$I$6=\"Colegio Americano del Sur\",E358,A358))))","v":""}]
[null,null,null,null,null,null,null,null,{"$f":"IF(IF('1. Autorización'!$I$6=\"Altiplano\",C359,IF('1. Autorización'!$I$6=\"Sur\",E359,IF('1. Autorización'!$I$6=\"Colegio Americano del Sur\",E359,A359)))=0,\"\",IF('1. Autorización'!$I$6=\"Altiplano\",C359,IF('1. Autorización'!$I$6=\"Sur\",E359,IF('1. Autorización'!$I$6=\"Colegio Americano del Sur\",E359,A359))))","v":""}]
[null,null,null,null,null,null,null,null,{"$f":"IF(IF('1. Autorización'!$I$6=\"Altiplano\",C360,IF('1. Autorización'!$I$6=\"Sur\",E360,IF('1. Autorización'!$I$6=\"Colegio Americano del Sur\",E360,A360)))=0,\"\",IF('1. Autorización'!$I$6=\"Altiplano\",C360,IF('1. Autorización'!$I$6=\"Sur\",E360,IF('1. Autorización'!$I$6=\"Colegio Americano del Sur\",E360,A360))))","v":""}]
[null,null,null,null,null,null,null,null,{"$f":"IF(IF('1. Autorización'!$I$6=\"Altiplano\",C361,IF('1. Autorización'!$I$6=\"Sur\",E361,IF('1. Autorización'!$I$6=\"Colegio Americano del Sur\",E361,A361)))=0,\"\",IF('1. Autorización'!$I$6=\"Altiplano\",C361,IF('1. Autorización'!$I$6=\"Sur\",E361,IF('1. Autorización'!$I$6=\"Colegio Americano del Sur\",E361,A361))))","v":""}]
[null,null,null,null,null,null,null,null,{"$f":"IF(IF('1. Autorización'!$I$6=\"Altiplano\",C362,IF('1. Autorización'!$I$6=\"Sur\",E362,IF('1. Autorización'!$I$6=\"Colegio Americano del Sur\",E362,A362)))=0,\"\",IF('1. Autorización'!$I$6=\"Altiplano\",C362,IF('1. Autorización'!$I$6=\"Sur\",E362,IF('1. Autorización'!$I$6=\"Colegio Americano del Sur\",E362,A362))))","v":""}]
[null,null,null,null,null,null,null,null,{"$f":"IF(IF('1. Autorización'!$I$6=\"Altiplano\",C363,IF('1. Autorización'!$I$6=\"Sur\",E363,IF('1. Autorización'!$I$6=\"Colegio Americano del Sur\",E363,A363)))=0,\"\",IF('1. Autorización'!$I$6=\"Altiplano\",C363,IF('1. Autorización'!$I$6=\"Sur\",E363,IF('1. Autorización'!$I$6=\"Colegio Americano del Sur\",E363,A363))))","v":""}]
[null,null,null,null,null,null,null,null,{"$f":"IF(IF('1. Autorización'!$I$6=\"Altiplano\",C364,IF('1. Autorización'!$I$6=\"Sur\",E364,IF('1. Autorización'!$I$6=\"Colegio Americano del Sur\",E364,A364)))=0,\"\",IF('1. Autorización'!$I$6=\"Altiplano\",C364,IF('1. Autorización'!$I$6=\"Sur\",E364,IF('1. Autorización'!$I$6=\"Colegio Americano del Sur\",E364,A364))))","v":""}]
[null,null,null,null,null,null,null,null,{"$f":"IF(IF('1. Autorización'!$I$6=\"Altiplano\",C365,IF('1. Autorización'!$I$6=\"Sur\",E365,IF('1. Autorización'!$I$6=\"Colegio Americano del Sur\",E365,A365)))=0,\"\",IF('1. Autorización'!$I$6=\"Altiplano\",C365,IF('1. Autorización'!$I$6=\"Sur\",E365,IF('1. Autorización'!$I$6=\"Colegio Americano del Sur\",E365,A365))))","v":""}]
[null,null,null,null,null,null,null,null,{"$f":"IF(IF('1. Autorización'!$I$6=\"Altiplano\",C366,IF('1. Autorización'!$I$6=\"Sur\",E366,IF('1. Autorización'!$I$6=\"Colegio Americano del Sur\",E366,A366)))=0,\"\",IF('1. Autorización'!$I$6=\"Altiplano\",C366,IF('1. Autorización'!$I$6=\"Sur\",E366,IF('1. Autorización'!$I$6=\"Colegio Americano del Sur\",E366,A366))))","v":""}]
[null,null,null,null,null,null,null,null,{"$f":"IF(IF('1. Autorización'!$I$6=\"Altiplano\",C367,IF('1. Autorización'!$I$6=\"Sur\",E367,IF('1. Autorización'!$I$6=\"Colegio Americano del Sur\",E367,A367)))=0,\"\",IF('1. Autorización'!$I$6=\"Altiplano\",C367,IF('1. Autorización'!$I$6=\"Sur\",E367,IF('1. Autorización'!$I$6=\"Colegio Americano del Sur\",E367,A367))))","v":""}]
[null,null,null,null,null,null,null,null,{"$f":"IF(IF('1. Autorización'!$I$6=\"Altiplano\",C368,IF('1. Autorización'!$I$6=\"Sur\",E368,IF('1. Autorización'!$I$6=\"Colegio Americano del Sur\",E368,A368)))=0,\"\",IF('1. Autorización'!$I$6=\"Altiplano\",C368,IF('1. Autorización'!$I$6=\"Sur\",E368,IF('1. Autorización'!$I$6=\"Colegio Americano del Sur\",E368,A368))))","v":""}]
[null,null,null,null,null,null,null,null,{"$f":"IF(IF('1. Autorización'!$I$6=\"Altiplano\",C369,IF('1. Autorización'!$I$6=\"Sur\",E369,IF('1. Autorización'!$I$6=\"Colegio Americano del Sur\",E369,A369)))=0,\"\",IF('1. Autorización'!$I$6=\"Altiplano\",C369,IF('1. Autorización'!$I$6=\"Sur\",E369,IF('1. Autorización'!$I$6=\"Colegio Americano del Sur\",E369,A369))))","v":""}]
[null,null,null,null,null,null,null,null,{"$f":"IF(IF('1. Autorización'!$I$6=\"Altiplano\",C370,IF('1. Autorización'!$I$6=\"Sur\",E370,IF('1. Autorización'!$I$6=\"Colegio Americano del Sur\",E370,A370)))=0,\"\",IF('1. Autorización'!$I$6=\"Altiplano\",C370,IF('1. Autorización'!$I$6=\"Sur\",E370,IF('1. Autorización'!$I$6=\"Colegio Americano del Sur\",E370,A370))))","v":""}]
[null,null,null,null,null,null,null,null,{"$f":"IF(IF('1. Autorización'!$I$6=\"Altiplano\",C371,IF('1. Autorización'!$I$6=\"Sur\",E371,IF('1. Autorización'!$I$6=\"Colegio Americano del Sur\",E371,A371)))=0,\"\",IF('1. Autorización'!$I$6=\"Altiplano\",C371,IF('1. Autorización'!$I$6=\"Sur\",E371,IF('1. Autorización'!$I$6=\"Colegio Americano del Sur\",E371,A371))))","v":""}]
[null,null,null,null,null,null,null,null,{"$f":"IF(IF('1. Autorización'!$I$6=\"Altiplano\",C372,IF('1. Autorización'!$I$6=\"Sur\",E372,IF('1. Autorización'!$I$6=\"Colegio Americano del Sur\",E372,A372)))=0,\"\",IF('1. Autorización'!$I$6=\"Altiplano\",C372,IF('1. Autorización'!$I$6=\"Sur\",E372,IF('1. Autorización'!$I$6=\"Colegio Americano del Sur\",E372,A372))))","v":""}]
[null,null,null,null,null,null,null,null,{"$f":"IF(IF('1. Autorización'!$I$6=\"Altiplano\",C373,IF('1. Autorización'!$I$6=\"Sur\",E373,IF('1. Autorización'!$I$6=\"Colegio Americano del Sur\",E373,A373)))=0,\"\",IF('1. Autorización'!$I$6=\"Altiplano\",C373,IF('1. Autorización'!$I$6=\"Sur\",E373,IF('1. Autorización'!$I$6=\"Colegio Americano del Sur\",E373,A373))))","v":""}]
[null,null,null,null,null,null,null,null,{"$f":"IF(IF('1. Autorización'!$I$6=\"Altiplano\",C374,IF('1. Autorización'!$I$6=\"Sur\",E374,IF('1. Autorización'!$I$6=\"Colegio Americano del Sur\",E374,A374)))=0,\"\",IF('1. Autorización'!$I$6=\"Altiplano\",C374,IF('1. Autorización'!$I$6=\"Sur\",E374,IF('1. Autorización'!$I$6=\"Colegio Americano del Sur\",E374,A374))))","v":""}]
[null,null,null,null,null,null,null,null,{"$f":"IF(IF('1. Autorización'!$I$6=\"Altiplano\",C375,IF('1. Autorización'!$I$6=\"Sur\",E375,IF('1. Autorización'!$I$6=\"Colegio Americano del Sur\",E375,A375)))=0,\"\",IF('1. Autorización'!$I$6=\"Altiplano\",C375,IF('1. Autorización'!$I$6=\"Sur\",E375,IF('1. Autorización'!$I$6=\"Colegio Americano del Sur\",E375,A375))))","v":""}]
[null,null,null,null,null,null,null,null,{"$f":"IF(IF('1. Autorización'!$I$6=\"Altiplano\",C376,IF('1. Autorización'!$I$6=\"Sur\",E376,IF('1. Autorización'!$I$6=\"Colegio Americano del Sur\",E376,A376)))=0,\"\",IF('1. Autorización'!$I$6=\"Altiplano\",C376,IF('1. Autorización'!$I$6=\"Sur\",E376,IF('1. Autorización'!$I$6=\"Colegio Americano del Sur\",E376,A376))))","v":""}]
[null,null,null,null,null,null,null,null,{"$f":"IF(IF('1. Autorización'!$I$6=\"Altiplano\",C377,IF('1. Autorización'!$I$6=\"Sur\",E377,IF('1. Autorización'!$I$6=\"Colegio Americano del Sur\",E377,A377)))=0,\"\",IF('1. Autorización'!$I$6=\"Altiplano\",C377,IF('1. Autorización'!$I$6=\"Sur\",E377,IF('1. Autorización'!$I$6=\"Colegio Americano del Sur\",E377,A377))))","v":""}]
[null,null,null,null,null,null,null,null,{"$f":"IF(IF('1. Autorización'!$I$6=\"Altiplano\",C378,IF('1. Autorización'!$I$6=\"Sur\",E378,IF('1. Autorización'!$I$6=\"Colegio Americano del Sur\",E378,A378)))=0,\"\",IF('1. Autorización'!$I$6=\"Altiplano\",C378,IF('1. Autorización'!$I$6=\"Sur\",E378,IF('1. Autorización'!$I$6=\"Colegio Americano del Sur\",E378,A378))))","v":""}]
[null,null,null,null,null,null,null,null,{"$f":"IF(IF('1. Autorización'!$I$6=\"Altiplano\",C379,IF('1. Autorización'!$I$6=\"Sur\",E379,IF('1. Autorización'!$I$6=\"Colegio Americano del Sur\",E379,A379)))=0,\"\",IF('1. Autorización'!$I$6=\"Altiplano\",C379,IF('1. Autorización'!$I$6=\"Sur\",E379,IF('1. Autorización'!$I$6=\"Colegio Americano del Sur\",E379,A379))))","v":""}]
[null,null,null,null,null,null,null,null,{"$f":"IF(IF('1. Autorización'!$I$6=\"Altiplano\",C380,IF('1. Autorización'!$I$6=\"Sur\",E380,IF('1. Autorización'!$I$6=\"Colegio Americano del Sur\",E380,A380)))=0,\"\",IF('1. Autorización'!$I$6=\"Altiplano\",C380,IF('1. Autorización'!$I$6=\"Sur\",E380,IF('1. Autorización'!$I$6=\"Colegio Americano del Sur\",E380,A380))))","v":""}]
[null,null,null,null,null,null,null,null,{"$f":"IF(IF('1. Autorización'!$I$6=\"Altiplano\",C381,IF('1. Autorización'!$I$6=\"Sur\",E381,IF('1. Autorización'!$I$6=\"Colegio Americano del Sur\",E381,A381)))=0,\"\",IF('1. Autorización'!$I$6=\"Altiplano\",C381,IF('1. Autorización'!$I$6=\"Sur\",E381,IF('1. Autorización'!$I$6=\"Colegio Americano del Sur\",E381,A381))))","v":""}]
[null,null,null,null,null,null,null,null,{"$f":"IF(IF('1. Autorización'!$I$6=\"Altiplano\",C382,IF('1. Autorización'!$I$6=\"Sur\",E382,IF('1. Autorización'!$I$6=\"Colegio Americano del Sur\",E382,A382)))=0,\"\",IF('1. Autorización'!$I$6=\"Altiplano\",C382,IF('1. Autorización'!$I$6=\"Sur\",E382,IF('1. Autorización'!$I$6=\"Colegio Americano del Sur\",E382,A382))))","v":""}]
[null,null,null,null,null,null,null,null,{"$f":"IF(IF('1. Autorización'!$I$6=\"Altiplano\",C383,IF('1. Autorización'!$I$6=\"Sur\",E383,IF('1. Autorización'!$I$6=\"Colegio Americano del Sur\",E383,A383)))=0,\"\",IF('1. Autorización'!$I$6=\"Altiplano\",C383,IF('1. Autorización'!$I$6=\"Sur\",E383,IF('1. Autorización'!$I$6=\"Colegio Americano del Sur\",E383,A383))))","v":""}]
[null,null,null,null,null,null,null,null,{"$f":"IF(IF('1. Autorización'!$I$6=\"Altiplano\",C384,IF('1. Autorización'!$I$6=\"Sur\",E384,IF('1. Autorización'!$I$6=\"Colegio Americano del Sur\",E384,A384)))=0,\"\",IF('1. Autorización'!$I$6=\"Altiplano\",C384,IF('1. Autorización'!$I$6=\"Sur\",E384,IF('1. Autorización'!$I$6=\"Colegio Americano del Sur\",E384,A384))))","v":""}]
[null,null,null,null,null,null,null,null,{"$f":"IF(IF('1. Autorización'!$I$6=\"Altiplano\",C385,IF('1. Autorización'!$I$6=\"Sur\",E385,IF('1. Autorización'!$I$6=\"Colegio Americano del Sur\",E385,A385)))=0,\"\",IF('1. Autorización'!$I$6=\"Altiplano\",C385,IF('1. Autorización'!$I$6=\"Sur\",E385,IF('1. Autorización'!$I$6=\"Colegio Americano del Sur\",E385,A385))))","v":""}]
[null,null,null,null,null,null,null,null,{"$f":"IF(IF('1. Autorización'!$I$6=\"Altiplano\",C386,IF('1. Autorización'!$I$6=\"Sur\",E386,IF('1. Autorización'!$I$6=\"Colegio Americano del Sur\",E386,A386)))=0,\"\",IF('1. Autorización'!$I$6=\"Altiplano\",C386,IF('1. Autorización'!$I$6=\"Sur\",E386,IF('1. Autorización'!$I$6=\"Colegio Americano del Sur\",E386,A386))))","v":""}]
[null,null,null,null,null,null,null,null,{"$f":"IF(IF('1. Autorización'!$I$6=\"Altiplano\",C387,IF('1. Autorización'!$I$6=\"Sur\",E387,IF('1. Autorización'!$I$6=\"Colegio Americano del Sur\",E387,A387)))=0,\"\",IF('1. Autorización'!$I$6=\"Altiplano\",C387,IF('1. Autorización'!$I$6=\"Sur\",E387,IF('1. Autorización'!$I$6=\"Colegio Americano del Sur\",E387,A387))))","v":""}]
[null,null,null,null,null,null,null,null,{"$f":"IF(IF('1. Autorización'!$I$6=\"Altiplano\",C388,IF('1. Autorización'!$I$6=\"Sur\",E388,IF('1. Autorización'!$I$6=\"Colegio Americano del Sur\",E388,A388)))=0,\"\",IF('1. Autorización'!$I$6=\"Altiplano\",C388,IF('1. Autorización'!$I$6=\"Sur\",E388,IF('1. Autorización'!$I$6=\"Colegio Americano del Sur\",E388,A388))))","v":""}]
[null,null,null,null,null,null,null,null,{"$f":"IF(IF('1. Autorización'!$I$6=\"Altiplano\",C389,IF('1. Autorización'!$I$6=\"Sur\",E389,IF('1. Autorización'!$I$6=\"Colegio Americano del Sur\",E389,A389)))=0,\"\",IF('1. Autorización'!$I$6=\"Altiplano\",C389,IF('1. Autorización'!$I$6=\"Sur\",E389,IF('1. Autorización'!$I$6=\"Colegio Americano del Sur\",E389,A389))))","v":""}]
[null,null,null,null,null,null,null,null,{"$f":"IF(IF('1. Autorización'!$I$6=\"Altiplano\",C390,IF('1. Autorización'!$I$6=\"Sur\",E390,IF('1. Autorización'!$I$6=\"Colegio Americano del Sur\",E390,A390)))=0,\"\",IF('1. Autorización'!$I$6=\"Altiplano\",C390,IF('1. Autorización'!$I$6=\"Sur\",E390,IF('1. Autorización'!$I$6=\"Colegio Americano del Sur\",E390,A390))))","v":""}]
[null,null,null,null,null,null,null,null,{"$f":"IF(IF('1. Autorización'!$I$6=\"Altiplano\",C391,IF('1. Autorización'!$I$6=\"Sur\",E391,IF('1. Autorización'!$I$6=\"Colegio Americano del Sur\",E391,A391)))=0,\"\",IF('1. Autorización'!$I$6=\"Altiplano\",C391,IF('1. Autorización'!$I$6=\"Sur\",E391,IF('1. Autorización'!$I$6=\"Colegio Americano del Sur\",E391,A391))))","v":""}]
[null,null,null,null,null,null,null,null,{"$f":"IF(IF('1. Autorización'!$I$6=\"Altiplano\",C392,IF('1. Autorización'!$I$6=\"Sur\",E392,IF('1. Autorización'!$I$6=\"Colegio Americano del Sur\",E392,A392)))=0,\"\",IF('1. Autorización'!$I$6=\"Altiplano\",C392,IF('1. Autorización'!$I$6=\"Sur\",E392,IF('1. Autorización'!$I$6=\"Colegio Americano del Sur\",E392,A392))))","v":""}]
[null,null,null,null,null,null,null,null,{"$f":"IF(IF('1. Autorización'!$I$6=\"Altiplano\",C393,IF('1. Autorización'!$I$6=\"Sur\",E393,IF('1. Autorización'!$I$6=\"Colegio Americano del Sur\",E393,A393)))=0,\"\",IF('1. Autorización'!$I$6=\"Altiplano\",C393,IF('1. Autorización'!$I$6=\"Sur\",E393,IF('1. Autorización'!$I$6=\"Colegio Americano del Sur\",E393,A393))))","v":""}]
[null,null,null,null,null,null,null,null,{"$f":"IF(IF('1. Autorización'!$I$6=\"Altiplano\",C394,IF('1. Autorización'!$I$6=\"Sur\",E394,IF('1. Autorización'!$I$6=\"Colegio Americano del Sur\",E394,A394)))=0,\"\",IF('1. Autorización'!$I$6=\"Altiplano\",C394,IF('1. Autorización'!$I$6=\"Sur\",E394,IF('1. Autorización'!$I$6=\"Colegio Americano del Sur\",E394,A394))))","v":""}]
[null,null,null,null,null,null,null,null,{"$f":"IF(IF('1. Autorización'!$I$6=\"Altiplano\",C395,IF('1. Autorización'!$I$6=\"Sur\",E395,IF('1. Autorización'!$I$6=\"Colegio Americano del Sur\",E395,A395)))=0,\"\",IF('1. Autorización'!$I$6=\"Altiplano\",C395,IF('1. Autorización'!$I$6=\"Sur\",E395,IF('1. Autorización'!$I$6=\"Colegio Americano del Sur\",E395,A395))))","v":""}]
[null,null,null,null,null,null,null,null,{"$f":"IF(IF('1. Autorización'!$I$6=\"Altiplano\",C396,IF('1. Autorización'!$I$6=\"Sur\",E396,IF('1. Autorización'!$I$6=\"Colegio Americano del Sur\",E396,A396)))=0,\"\",IF('1. Autorización'!$I$6=\"Altiplano\",C396,IF('1. Autorización'!$I$6=\"Sur\",E396,IF('1. Autorización'!$I$6=\"Colegio Americano del Sur\",E396,A396))))","v":""}]
[null,null,null,null,null,null,null,null,{"$f":"IF(IF('1. Autorización'!$I$6=\"Altiplano\",C397,IF('1. Autorización'!$I$6=\"Sur\",E397,IF('1. Autorización'!$I$6=\"Colegio Americano del Sur\",E397,A397)))=0,\"\",IF('1. Autorización'!$I$6=\"Altiplano\",C397,IF('1. Autorización'!$I$6=\"Sur\",E397,IF('1. Autorización'!$I$6=\"Colegio Americano del Sur\",E397,A397))))","v":""}]
[null,null,null,null,null,null,null,null,{"$f":"IF(IF('1. Autorización'!$I$6=\"Altiplano\",C398,IF('1. Autorización'!$I$6=\"Sur\",E398,IF('1. Autorización'!$I$6=\"Colegio Americano del Sur\",E398,A398)))=0,\"\",IF('1. Autorización'!$I$6=\"Altiplano\",C398,IF('1. Autorización'!$I$6=\"Sur\",E398,IF('1. Autorización'!$I$6=\"Colegio Americano del Sur\",E398,A398))))","v":""}]
[null,null,null,null,null,null,null,null,{"$f":"IF(IF('1. Autorización'!$I$6=\"Altiplano\",C399,IF('1. Autorización'!$I$6=\"Sur\",E399,IF('1. Autorización'!$I$6=\"Colegio Americano del Sur\",E399,A399)))=0,\"\",IF('1. Autorización'!$I$6=\"Altiplano\",C399,IF('1. Autorización'!$I$6=\"Sur\",E399,IF('1. Autorización'!$I$6=\"Colegio Americano del Sur\",E399,A399))))","v":""}]
[null,null,null,null,null,null,null,null,{"$f":"IF(IF('1. Autorización'!$I$6=\"Altiplano\",C400,IF('1. Autorización'!$I$6=\"Sur\",E400,IF('1. Autorización'!$I$6=\"Colegio Americano del Sur\",E400,A400)))=0,\"\",IF('1. Autorización'!$I$6=\"Altiplano\",C400,IF('1. Autorización'!$I$6=\"Sur\",E400,IF('1. Autorización'!$I$6=\"Colegio Americano del Sur\",E400,A400))))","v":""}]
[null,null,null,null,null,null,null,null,{"$f":"IF(IF('1. Autorización'!$I$6=\"Altiplano\",C401,IF('1. Autorización'!$I$6=\"Sur\",E401,IF('1. Autorización'!$I$6=\"Colegio Americano del Sur\",E401,A401)))=0,\"\",IF('1. Autorización'!$I$6=\"Altiplano\",C401,IF('1. Autorización'!$I$6=\"Sur\",E401,IF('1. Autorización'!$I$6=\"Colegio Americano del Sur\",E401,A401))))","v":""}]
[null,null,null,null,null,null,null,null,{"$f":"IF(IF('1. Autorización'!$I$6=\"Altiplano\",C402,IF('1. Autorización'!$I$6=\"Sur\",E402,IF('1. Autorización'!$I$6=\"Colegio Americano del Sur\",E402,A402)))=0,\"\",IF('1. Autorización'!$I$6=\"Altiplano\",C402,IF('1. Autorización'!$I$6=\"Sur\",E402,IF('1. Autorización'!$I$6=\"Colegio Americano del Sur\",E402,A402))))","v":""}]
[null,null,null,null,null,null,null,null,{"$f":"IF(IF('1. Autorización'!$I$6=\"Altiplano\",C403,IF('1. Autorización'!$I$6=\"Sur\",E403,IF('1. Autorización'!$I$6=\"Colegio Americano del Sur\",E403,A403)))=0,\"\",IF('1. Autorización'!$I$6=\"Altiplano\",C403,IF('1. Autorización'!$I$6=\"Sur\",E403,IF('1. Autorización'!$I$6=\"Colegio Americano del Sur\",E403,A403))))","v":""}]
[null,null,null,null,null,null,null,null,{"$f":"IF(IF('1. Autorización'!$I$6=\"Altiplano\",C404,IF('1. Autorización'!$I$6=\"Sur\",E404,IF('1. Autorización'!$I$6=\"Colegio Americano del Sur\",E404,A404)))=0,\"\",IF('1. Autorización'!$I$6=\"Altiplano\",C404,IF('1. Autorización'!$I$6=\"Sur\",E404,IF('1. Autorización'!$I$6=\"Colegio Americano del Sur\",E404,A404))))","v":""}]
[null,null,null,null,null,null,null,null,{"$f":"IF(IF('1. Autorización'!$I$6=\"Altiplano\",C405,IF('1. Autorización'!$I$6=\"Sur\",E405,IF('1. Autorización'!$I$6=\"Colegio Americano del Sur\",E405,A405)))=0,\"\",IF('1. Autorización'!$I$6=\"Altiplano\",C405,IF('1. Autorización'!$I$6=\"Sur\",E405,IF('1. Autorización'!$I$6=\"Colegio Americano del Sur\",E405,A405))))","v":""}]
[null,null,null,null,null,null,null,null,{"$f":"IF(IF('1. Autorización'!$I$6=\"Altiplano\",C406,IF('1. Autorización'!$I$6=\"Sur\",E406,IF('1. Autorización'!$I$6=\"Colegio Americano del Sur\",E406,A406)))=0,\"\",IF('1. Autorización'!$I$6=\"Altiplano\",C406,IF('1. Autorización'!$I$6=\"Sur\",E406,IF('1. Autorización'!$I$6=\"Colegio Americano del Sur\",E406,A406))))","v":""}]
[null,null,null,null,null,null,null,null,{"$f":"IF(IF('1. Autorización'!$I$6=\"Altiplano\",C407,IF('1. Autorización'!$I$6=\"Sur\",E407,IF('1. Autorización'!$I$6=\"Colegio Americano del Sur\",E407,A407)))=0,\"\",IF('1. Autorización'!$I$6=\"Altiplano\",C407,IF('1. Autorización'!$I$6=\"Sur\",E407,IF('1. Autorización'!$I$6=\"Colegio Americano del Sur\",E407,A407))))","v":""}]
[null,null,null,null,null,null,null,null,{"$f":"IF(IF('1. Autorización'!$I$6=\"Altiplano\",C408,IF('1. Autorización'!$I$6=\"Sur\",E408,IF('1. Autorización'!$I$6=\"Colegio Americano del Sur\",E408,A408)))=0,\"\",IF('1. Autorización'!$I$6=\"Altiplano\",C408,IF('1. Autorización'!$I$6=\"Sur\",E408,IF('1. Autorización'!$I$6=\"Colegio Americano del Sur\",E408,A408))))","v":""}]
[null,null,null,null,null,null,null,null,{"$f":"IF(IF('1. Autorización'!$I$6=\"Altiplano\",C409,IF('1. Autorización'!$I$6=\"Sur\",E409,IF('1. Autorización'!$I$6=\"Colegio Americano del Sur\",E409,A409)))=0,\"\",IF('1. Autorización'!$I$6=\"Altiplano\",C409,IF('1. Autorización'!$I$6=\"Sur\",E409,IF('1. Autorización'!$I$6=\"Colegio Americano del Sur\",E409,A409))))","v":""}]
[null,null,null,null,null,null,null,null,{"$f":"IF(IF('1. Autorización'!$I$6=\"Altiplano\",C410,IF('1. Autorización'!$I$6=\"Sur\",E410,IF('1. Autorización'!$I$6=\"Colegio Americano del Sur\",E410,A410)))=0,\"\",IF('1. Autorización'!$I$6=\"Altiplano\",C410,IF('1. Autorización'!$I$6=\"Sur\",E410,IF('1. Autorización'!$I$6=\"Colegio Americano del Sur\",E410,A410))))","v":""}]
[null,null,null,null,null,null,null,null,{"$f":"IF(IF('1. Autorización'!$I$6=\"Altiplano\",C411,IF('1. Autorización'!$I$6=\"Sur\",E411,IF('1. Autorización'!$I$6=\"Colegio Americano del Sur\",E411,A411)))=0,\"\",IF('1. Autorización'!$I$6=\"Altiplano\",C411,IF('1. Autorización'!$I$6=\"Sur\",E411,IF('1. Autorización'!$I$6=\"Colegio Americano del Sur\",E411,A411))))","v":""}]
[null,null,null,null,null,null,null,null,{"$f":"IF(IF('1. Autorización'!$I$6=\"Altiplano\",C412,IF('1. Autorización'!$I$6=\"Sur\",E412,IF('1. Autorización'!$I$6=\"Colegio Americano del Sur\",E412,A412)))=0,\"\",IF('1. Autorización'!$I$6=\"Altiplano\",C412,IF('1. Autorización'!$I$6=\"Sur\",E412,IF('1. Autorización'!$I$6=\"Colegio Americano del Sur\",E412,A412))))","v":""}]
[null,null,null,null,null,null,null,null,{"$f":"IF(IF('1. Autorización'!$I$6=\"Altiplano\",C413,IF('1. Autorización'!$I$6=\"Sur\",E413,IF('1. Autorización'!$I$6=\"Colegio Americano del Sur\",E413,A413)))=0,\"\",IF('1. Autorización'!$I$6=\"Altiplano\",C413,IF('1. Autorización'!$I$6=\"Sur\",E413,IF('1. Autorización'!$I$6=\"Colegio Americano del Sur\",E413,A413))))","v":""}]
[null,null,null,null,null,null,null,null,{"$f":"IF(IF('1. Autorización'!$I$6=\"Altiplano\",C414,IF('1. Autorización'!$I$6=\"Sur\",E414,IF('1. Autorización'!$I$6=\"Colegio Americano del Sur\",E414,A414)))=0,\"\",IF('1. Autorización'!$I$6=\"Altiplano\",C414,IF('1. Autorización'!$I$6=\"Sur\",E414,IF('1. Autorización'!$I$6=\"Colegio Americano del Sur\",E414,A414))))","v":""}]
[null,null,null,null,null,null,null,null,{"$f":"IF(IF('1. Autorización'!$I$6=\"Altiplano\",C415,IF('1. Autorización'!$I$6=\"Sur\",E415,IF('1. Autorización'!$I$6=\"Colegio Americano del Sur\",E415,A415)))=0,\"\",IF('1. Autorización'!$I$6=\"Altiplano\",C415,IF('1. Autorización'!$I$6=\"Sur\",E415,IF('1. Autorización'!$I$6=\"Colegio Americano del Sur\",E415,A415))))","v":""}]
[null,null,null,null,null,null,null,null,{"$f":"IF(IF('1. Autorización'!$I$6=\"Altiplano\",C416,IF('1. Autorización'!$I$6=\"Sur\",E416,IF('1. Autorización'!$I$6=\"Colegio Americano del Sur\",E416,A416)))=0,\"\",IF('1. Autorización'!$I$6=\"Altiplano\",C416,IF('1. Autorización'!$I$6=\"Sur\",E416,IF('1. Autorización'!$I$6=\"Colegio Americano del Sur\",E416,A416))))","v":""}]
[null,null,null,null,null,null,null,null,{"$f":"IF(IF('1. Autorización'!$I$6=\"Altiplano\",C417,IF('1. Autorización'!$I$6=\"Sur\",E417,IF('1. Autorización'!$I$6=\"Colegio Americano del Sur\",E417,A417)))=0,\"\",IF('1. Autorización'!$I$6=\"Altiplano\",C417,IF('1. Autorización'!$I$6=\"Sur\",E417,IF('1. Autorización'!$I$6=\"Colegio Americano del Sur\",E417,A417))))","v":""}]
[null,null,null,null,null,null,null,null,{"$f":"IF(IF('1. Autorización'!$I$6=\"Altiplano\",C418,IF('1. Autorización'!$I$6=\"Sur\",E418,IF('1. Autorización'!$I$6=\"Colegio Americano del Sur\",E418,A418)))=0,\"\",IF('1. Autorización'!$I$6=\"Altiplano\",C418,IF('1. Autorización'!$I$6=\"Sur\",E418,IF('1. Autorización'!$I$6=\"Colegio Americano del Sur\",E418,A418))))","v":""}]
[null,null,null,null,null,null,null,null,{"$f":"IF(IF('1. Autorización'!$I$6=\"Altiplano\",C419,IF('1. Autorización'!$I$6=\"Sur\",E419,IF('1. Autorización'!$I$6=\"Colegio Americano del Sur\",E419,A419)))=0,\"\",IF('1. Autorización'!$I$6=\"Altiplano\",C419,IF('1. Autorización'!$I$6=\"Sur\",E419,IF('1. Autorización'!$I$6=\"Colegio Americano del Sur\",E419,A419))))","v":""}]
[null,null,null,null,null,null,null,null,{"$f":"IF(IF('1. Autorización'!$I$6=\"Altiplano\",C420,IF('1. Autorización'!$I$6=\"Sur\",E420,IF('1. Autorización'!$I$6=\"Colegio Americano del Sur\",E420,A420)))=0,\"\",IF('1. Autorización'!$I$6=\"Altiplano\",C420,IF('1. Autorización'!$I$6=\"Sur\",E420,IF('1. Autorización'!$I$6=\"Colegio Americano del Sur\",E420,A420))))","v":""}]
[null,null,null,null,null,null,null,null,{"$f":"IF(IF('1. Autorización'!$I$6=\"Altiplano\",C421,IF('1. Autorización'!$I$6=\"Sur\",E421,IF('1. Autorización'!$I$6=\"Colegio Americano del Sur\",E421,A421)))=0,\"\",IF('1. Autorización'!$I$6=\"Altiplano\",C421,IF('1. Autorización'!$I$6=\"Sur\",E421,IF('1. Autorización'!$I$6=\"Colegio Americano del Sur\",E421,A421))))","v":""}]
[null,null,null,null,null,null,null,null,{"$f":"IF(IF('1. Autorización'!$I$6=\"Altiplano\",C422,IF('1. Autorización'!$I$6=\"Sur\",E422,IF('1. Autorización'!$I$6=\"Colegio Americano del Sur\",E422,A422)))=0,\"\",IF('1. Autorización'!$I$6=\"Altiplano\",C422,IF('1. Autorización'!$I$6=\"Sur\",E422,IF('1. Autorización'!$I$6=\"Colegio Americano del Sur\",E422,A422))))","v":""}]
[null,null,null,null,null,null,null,null,{"$f":"IF(IF('1. Autorización'!$I$6=\"Altiplano\",C423,IF('1. Autorización'!$I$6=\"Sur\",E423,IF('1. Autorización'!$I$6=\"Colegio Americano del Sur\",E423,A423)))=0,\"\",IF('1. Autorización'!$I$6=\"Altiplano\",C423,IF('1. Autorización'!$I$6=\"Sur\",E423,IF('1. Autorización'!$I$6=\"Colegio Americano del Sur\",E423,A423))))","v":""}]
[null,null,null,null,null,null,null,null,{"$f":"IF(IF('1. Autorización'!$I$6=\"Altiplano\",C424,IF('1. Autorización'!$I$6=\"Sur\",E424,IF('1. Autorización'!$I$6=\"Colegio Americano del Sur\",E424,A424)))=0,\"\",IF('1. Autorización'!$I$6=\"Altiplano\",C424,IF('1. Autorización'!$I$6=\"Sur\",E424,IF('1. Autorización'!$I$6=\"Colegio Americano del Sur\",E424,A424))))","v":""}]
[null,null,null,null,null,null,null,null,{"$f":"IF(IF('1. Autorización'!$I$6=\"Altiplano\",C425,IF('1. Autorización'!$I$6=\"Sur\",E425,IF('1. Autorización'!$I$6=\"Colegio Americano del Sur\",E425,A425)))=0,\"\",IF('1. Autorización'!$I$6=\"Altiplano\",C425,IF('1. Autorización'!$I$6=\"Sur\",E425,IF('1. Autorización'!$I$6=\"Colegio Americano del Sur\",E425,A425))))","v":""}]
[null,null,null,null,null,null,null,null,{"$f":"IF(IF('1. Autorización'!$I$6=\"Altiplano\",C426,IF('1. Autorización'!$I$6=\"Sur\",E426,IF('1. Autorización'!$I$6=\"Colegio Americano del Sur\",E426,A426)))=0,\"\",IF('1. Autorización'!$I$6=\"Altiplano\",C426,IF('1. Autorización'!$I$6=\"Sur\",E426,IF('1. Autorización'!$I$6=\"Colegio Americano del Sur\",E426,A426))))","v":""}]
[null,null,null,null,null,null,null,null,{"$f":"IF(IF('1. Autorización'!$I$6=\"Altiplano\",C427,IF('1. Autorización'!$I$6=\"Sur\",E427,IF('1. Autorización'!$I$6=\"Colegio Americano del Sur\",E427,A427)))=0,\"\",IF('1. Autorización'!$I$6=\"Altiplano\",C427,IF('1. Autorización'!$I$6=\"Sur\",E427,IF('1. Autorización'!$I$6=\"Colegio Americano del Sur\",E427,A427))))","v":""}]
[null,null,null,null,null,null,null,null,{"$f":"IF(IF('1. Autorización'!$I$6=\"Altiplano\",C428,IF('1. Autorización'!$I$6=\"Sur\",E428,IF('1. Autorización'!$I$6=\"Colegio Americano del Sur\",E428,A428)))=0,\"\",IF('1. Autorización'!$I$6=\"Altiplano\",C428,IF('1. Autorización'!$I$6=\"Sur\",E428,IF('1. Autorización'!$I$6=\"Colegio Americano del Sur\",E428,A428))))","v":""}]
[null,null,null,null,null,null,null,null,{"$f":"IF(IF('1. Autorización'!$I$6=\"Altiplano\",C429,IF('1. Autorización'!$I$6=\"Sur\",E429,IF('1. Autorización'!$I$6=\"Colegio Americano del Sur\",E429,A429)))=0,\"\",IF('1. Autorización'!$I$6=\"Altiplano\",C429,IF('1. Autorización'!$I$6=\"Sur\",E429,IF('1. Autorización'!$I$6=\"Colegio Americano del Sur\",E429,A429))))","v":""}]
[null,null,null,null,null,null,null,null,{"$f":"IF(IF('1. Autorización'!$I$6=\"Altiplano\",C430,IF('1. Autorización'!$I$6=\"Sur\",E430,IF('1. Autorización'!$I$6=\"Colegio Americano del Sur\",E430,A430)))=0,\"\",IF('1. Autorización'!$I$6=\"Altiplano\",C430,IF('1. Autorización'!$I$6=\"Sur\",E430,IF('1. Autorización'!$I$6=\"Colegio Americano del Sur\",E430,A430))))","v":""}]
[null,null,null,null,null,null,null,null,{"$f":"IF(IF('1. Autorización'!$I$6=\"Altiplano\",C431,IF('1. Autorización'!$I$6=\"Sur\",E431,IF('1. Autorización'!$I$6=\"Colegio Americano del Sur\",E431,A431)))=0,\"\",IF('1. Autorización'!$I$6=\"Altiplano\",C431,IF('1. Autorización'!$I$6=\"Sur\",E431,IF('1. Autorización'!$I$6=\"Colegio Americano del Sur\",E431,A431))))","v":""}]
[null,null,null,null,null,null,null,null,{"$f":"IF(IF('1. Autorización'!$I$6=\"Altiplano\",C432,IF('1. Autorización'!$I$6=\"Sur\",E432,IF('1. Autorización'!$I$6=\"Colegio Americano del Sur\",E432,A432)))=0,\"\",IF('1. Autorización'!$I$6=\"Altiplano\",C432,IF('1. Autorización'!$I$6=\"Sur\",E432,IF('1. Autorización'!$I$6=\"Colegio Americano del Sur\",E432,A432))))","v":""}]
[null,null,null,null,null,null,null,null,{"$f":"IF(IF('1. Autorización'!$I$6=\"Altiplano\",C433,IF('1. Autorización'!$I$6=\"Sur\",E433,IF('1. Autorización'!$I$6=\"Colegio Americano del Sur\",E433,A433)))=0,\"\",IF('1. Autorización'!$I$6=\"Altiplano\",C433,IF('1. Autorización'!$I$6=\"Sur\",E433,IF('1. Autorización'!$I$6=\"Colegio Americano del Sur\",E433,A433))))","v":""}]
[null,null,null,null,null,null,null,null,{"$f":"IF(IF('1. Autorización'!$I$6=\"Altiplano\",C434,IF('1. Autorización'!$I$6=\"Sur\",E434,IF('1. Autorización'!$I$6=\"Colegio Americano del Sur\",E434,A434)))=0,\"\",IF('1. Autorización'!$I$6=\"Altiplano\",C434,IF('1. Autorización'!$I$6=\"Sur\",E434,IF('1. Autorización'!$I$6=\"Colegio Americano del Sur\",E434,A434))))","v":""}]
[null,null,null,null,null,null,null,null,{"$f":"IF(IF('1. Autorización'!$I$6=\"Altiplano\",C435,IF('1. Autorización'!$I$6=\"Sur\",E435,IF('1. Autorización'!$I$6=\"Colegio Americano del Sur\",E435,A435)))=0,\"\",IF('1. Autorización'!$I$6=\"Altiplano\",C435,IF('1. Autorización'!$I$6=\"Sur\",E435,IF('1. Autorización'!$I$6=\"Colegio Americano del Sur\",E435,A435))))","v":""}]
[null,null,null,null,null,null,null,null,{"$f":"IF(IF('1. Autorización'!$I$6=\"Altiplano\",C436,IF('1. Autorización'!$I$6=\"Sur\",E436,IF('1. Autorización'!$I$6=\"Colegio Americano del Sur\",E436,A436)))=0,\"\",IF('1. Autorización'!$I$6=\"Altiplano\",C436,IF('1. Autorización'!$I$6=\"Sur\",E436,IF('1. Autorización'!$I$6=\"Colegio Americano del Sur\",E436,A436))))","v":""}]

{"sheet":"Instrucciones","index":2,"n_rows":69,"n_cols":28,"rows_kept":69,"cut":false,"hidden":false,"merged":[[62,27,67,37],[68,27,75,37],[47,27,52,37],[19,1,24,11],[19,14,21,24],[19,27,25,37],[22,14,24,24],[25,14,27,24],[28,14,32,24],[33,14,36,24],[53,27,60,37],[25,1,29,11],[35,1,40,11],[41,1,47,11],[26,27,30,37],[31,27,37,37],[38,27,45,37],[18,1,18,11],[18,14,18,24],[18,27,18,37],[0,1,0,37],[2,0,6,37],[11,1,16,11],[11,14,16,24],[11,27,16,37],[30,1,34,11]]}
[null,"VIAJES AL EXTRANJERO"]
[]
["Instrucciones: En este archivo se encuentran todos los formularios que se requieren para solicitar y liquidar un anticipo de \"Viáticos para Viajes al Extranjero\".  El solicitante debe seguir los 3 grandes pasos indicados en el diagrama del proceso que se describe a continuación.  El orden en que el solicitante debe llenar los formularios se encuentra indicado en las pestañas(hojas de excel) de abajo, las cuales están numeradas y coloreadas (en morado, verde y naranja).  Cada pestaña (hoja de excel) contiene un formulario que debe ser llenado por el solicitante en el orden descrito.  Es obligatorio que el solicitante llene todos y cada uno de los campos que aparecen en blanco.  Existen campos que solicitan la misma información en todos los formularios.  Por ello, el archivo está diseñado para que el solicitante solo llene una vez la información contenida en estos campos; es decir que cuando un campo se repite en el resto de formularios, basta con que el solicitante lo llene una vez y para el resto de formularios este campo se llenará de manera automática por medio de una fórmula.  A continuación las instrucciones para cada formulario que se requiere llenar en cada etapa del proceso."]
[]
[]
[]
[]
[]
[]
[]
[]
[null,"1. Solicitud y Autorización - Viajes Locales y Extranjeros",null,null,null,null,null,null,null,null,null,null,null,null,"2. Solicitud de Cheque o Efectivo",null,null,null,null,null,null,null,null,null,null,null,null,"3. Liquidación de Viáticos Viajes Locales y Extranjeros"]
[]
[]
[]
[]
[]
[]
[null,"INSTRUCCIONES",null,null,null,null,null,null,null,null,null,null,null,null,"INSTRUCCIONES",null,null,null,null,null,null,null,null,null,null,null,null,"INSTRUCCIONES"]
[null,"1) Se da por hecho que al firmar este formulario la persona ha leído y entendido el Reglamento de Viáticos y Gastos Conexos de la UVG y está cumpliendo las políticas, a través de los procedimientos autorizados en dicho Reglamento. ",null,null,null,null,null,null,null,null,null,null,null,null,"1) Revisar antes de entregar a Cuentas por Pagar que esta solicitud cuente con partida Presupuestaria.",null,null,null,null,null,null,null,null,null,null,null,null,"1) Se da por hecho que al firmar este formulario la persona ha leído y entendido el Reglamento de Viáticos y Gastos Conexos de la UVG y está cumpliendo las políticas, a través de los procedimientos autorizados en dicho Reglamento. "]
[]
[]
[null,null,null,null,null,null,null,null,null,null,null,null,null,null,"2) Enviar para su trámite ocho (8) días calendario antes de la comisión de trabajo. "]
[]
[]
[null,"2) La información requerida en este formulario debe estar completa, clara y legible y cumplir con lo previsto en el Reglamento Viáticos y Gastos Conexos de la UVG.",null,null,null,null,null,null,null,null,null,null,null,null,"3) Liquidar dentro de los cinco (5) días siguientes a la finalización de la comisión de trabajo. "]
[null,null,null,null,null,null,null,null,null,null,null,null,null,null,null,null,null,null,null,null,null,null,null,null,null,null,null,"2) La información requerida en este formulario debe estar completa, clara y legible y cumplir con lo previsto en el Reglamento Viáticos y Gastos Conexos de la UVG."]
[]
[null,null,null,null,null,null,null,null,null,null,null,null,null,null,"4) Si el monto requerido es menor a Q. 500.00 la solicitud se manejará con fondos de caja general (Siempre que no sea anticipo) y si es mayor se tramitará cheque. No aplica para Proyectos."]
[]
[null,"3) Independientemente del régimen tributario al que el colaborador esté inscrito en la SAT, debe utilizar en el formulario los montos de alimentación y compensación por uso de vehículo propio autorizados en el reglamento correspondiente, como referencia se adjuntó la hoja \"TABLAS DE VIATICOS AUTORIZADOS\". El cálculo de las retenciones se hará al momento de la liquidación."]
[null,null,null,null,null,null,null,null,null,null,null,null,null,null,null,null,null,null,null,null,null,null,null,null,null,null,null,"3)  Este formulario lo debe llenar la persona autorizada para la comisión, responsable de la ejecución de los fondos anticipados entregados; quien debe presentar la liquidación a más tardar cinco (5) días hábiles después de haber concluido el viaje."]
[]
[null,null,null,null,null,null,null,null,null,null,null,null,null,null,"5) Presentar solicitud (original y copia) a Cuentas por Pagar quien sellará de recibido y colocará el No. Correlativo."]
[]
[null,"4) Llenar un formulario por persona, con información de la persona nombrada para la comisión y adjuntar original a la Solicitud de Cheque o Efectivo para el anticipo de viáticos y gastos conexos."]
[]
[]
[null,null,null,null,null,null,null,null,null,null,null,null,null,null,null,null,null,null,null,null,null,null,null,null,null,null,null,"4) En el caso de proyectos todos los trámites, sin excepción, se deben realizar a través de la Dirección Administrativa de Proyectos, unidad responsable de revisar, dar visto bueno, trasladar y dar seguimiento a los trámites. Para los demás, los trámites se deben trasladar directamente a Cuentas por Pagar."]
[]
[]
[null,"5) En el caso de proyectos todos los trámites, sin excepción, se deben realizar a través de la Dirección Administrativa de Proyectos, unidad responsable de revisar, dar visto bueno, trasladar y dar seguimiento a los trámites. Para los demás, los trámites se deben trasladar directamente a Cuentas por Pagar."]
[]
[]
[]
[]
[]
[null,null,null,null,null,null,null,null,null,null,null,null,null,null,null,null,null,null,null,null,null,null,null,null,null,null,null,"3.1 Liquidación Recibo Compensación por uso de Vehículo Propio"]
[]
[]
[]
[]
[]
[null,null,null,null,null,null,null,null,null,null,null,null,null,null,null,null,null,null,null,null,null,null,null,null,null,null,null,"Este recibo se llena cuando se incurrió en gastos por compensación por uso de vehículo propio y es parte de los documentos que tienen que ser presentados por el solicitante junto con el formulario de \"Liquidación de Viáticos-Viajes Locales y Extranjeros\".  Si el solicitante no incurrió en este tipo de gastos, NO debe ni llenar el Recibo de Alimentación, ni presentarlo. "]
[]
[]
[]
[]
[]
[]
[]
[]
[null,null,null,null,null,null,null,null,null,null,null,null,null,null,null,null,null,null,null,null,null,null,null,null,null,null,null,"3.2 Liquidación Recibo Gastos de Alimentación Viajes al Extranjero"]
[]
[]
[]
[]
[]
[null,null,null,null,null,null,null,null,null,null,null,null,null,null,null,null,null,null,null,null,null,null,null,null,null,null,null,"Este recibo se llena cuando se incurrió en gastos de alimentación en la comisión de trabajo y es parte de los documentos que tienen que ser presentados por el solicitante junto con el formulario de \"Liquidación de Viáticos- Viajes Locales y Extranjeros\".  Si el solicitante no incurrió en este tipo de gastos, NO debe ni llenar el Recibo de Alimentación, ni presentarlo. "]

{"sheet":"1. Autorización","index":3,"n_rows":139,"n_cols":14,"rows_kept":139,"cut":false,"hidden":false,"merged":[[65,0,66,2],[65,3,66,6],[65,7,66,9],[65,10,65,11],[66,10,66,11],[0,13,18,13],[62,0,63,2],[62,3,63,6],[62,7,63,9],[62,10,62,11],[63,10,63,11],[56,0,57,2],[56,3,57,6],[56,7,57,9],[56,10,56,11],[57,10,57,11],[59,0,60,2],[59,3,60,6],[59,7,60,9],[59,10,59,11],[60,10,60,11],[51,5,51,11],[52,5,52,11],[53,5,53,11],[54,0,54,3],[54,5,54,11],[55,0,55,11],[46,5,46,6],[46,8,46,9],[48,0,48,11],[49,0,49,1],[49,5,49,11],[50,5,50,11],[39,0,39,11],[40,5,40,9],[41,5,41,9],[42,5,42,9],[43,5,43,9],[44,0,44,3],[44,5,45,9],[44,10,46,11],[45,0,45,3],[46,0,46,3],[33,0,33,11],[34,5,34,9],[35,5,35,9],[36,5,36,9],[37,5,37,9],[38,0,38,1],[38,5,38,10],[27,0,27,11],[28,5,28,9],[29,5,29,9],[30,5,30,9],[31,5,31,9],[32,0,32,1],[32,5,32,10],[25,0,26,1],[25,2,26,2],[25,3,26,3],[25,4,26,4],[25,10,25,11],[26,5,26,9],[20,0,20,4],[22,0,22,1],[22,2,22,11],[23,0,23,11],[24,0,24,11],[19,1,19,2],[19,3,19,4],[19,8,19,11],[17,1,17,2],[17,3,17,4],[17,8,17,11],[18,1,18,2],[18,3,18,4],[18,8,18,11],[15,0,15,2],[15,3,15,4],[15,5,15,6],[15,7,15,11],[16,1,16,2],[16,3,16,4],[16,8,16,11],[11,0,11,1],[11,2,11,5],[11,6,11,7],[11,8,11,11],[13,0,13,1],[13,2,13,5],[13,6,13,7],[13,8,13,11],[7,0,7,1],[7,2,7,5],[7,6,7,7],[7,8,7,11],[9,0,9,1],[9,2,9,5],[9,6,9,7],[9,8,9,11],[0,0,0,11],[1,0,1,11],[2,0,2,11],[4,0,4,11],[5,0,5,1],[5,6,5,7],[5,8,5,11],[5,2,5,3],[5,4,5,5]]}
["UNIVERSIDAD DEL VALLE DE GUATEMALA",null,null,null,null,null,null,null,null,null,null,null,null,"AUTORIZACIÓN"]
["Solicitud de Autorización"]
["Viajes Locales & Extranjeros"]
[]
["A.  INFORMACIÓN DEL SOLICITANTE"]
["Lugar y Fecha",null,null,null,{"$f":"TODAY()","v":"2019-02-25"},null,"Campus"]
[]
["Nombre Completo",null," ",null,null,null,"Cargo",null," "]
[]
["Unidad ó Proyecto (Incluir Código)",null," ",null,null,null,"Sub-Proyecto",null," "]
[]
["Régimen Tributario",null," ",null,null,null,"Correo Electrónico",null," "]
[]
["Teléfono",null,null,null,null,null,"Extensión",null," "]
[]
["B.  INFORMACIÓN DEL VIAJE",null,null,"ESPECIFICAR: "]
["No. ","Origen",null,"Destino",null,"Número \nDías/Horas","Fecha/Hora \nSalida","Fecha/Hora \nRegreso","Objetivo General del Viaje"]
[1]
[2]
[3]
["Duración Total Días/Horas",null,null,null,null,{"$f":"SUM(F18:F20)","v":0}]
[]
["Observaciones Generales (OPCIONAL)"]
[]
["C.  ESTIMACIÓN DE VIATICOS Y GASTOS CONEXOS"]
["Concepto",null,"No. Días/ \nCantidad","Valor\nUnitario","Valor\nTotal",null,null,null,null,null,"SOLO PARA\nPROYECTOS"]
[null,null,null,null,null,"Observaciones/Justificación",null,null,null,null,"Solicitud de Fondos","Folio No."]
["Hospedaje (SEGÚN REGLAMENTO)"]
[1,null,null,null,{"$f":"C29*D29","v":0}]
[2,null,null,null,{"$f":"C30*D30","v":0}]
[3,null,null,null,0]
[4,null,null,null,0]
["Sub-total Hospedaje",null,{"$f":"SUM(C29:C32)","v":0},null,{"$f":"SUM(E29:E32)","v":0}]
["Alimentación (SEGÚN REGLAMENTO)"]
[1,null,null,null,{"$f":"C35*D35","v":0}]
[2,null,null,null,{"$f":"C36*D36","v":0}]
[3,null,null,null,0]
[4,null,null,null,0]
["Sub-total Alimentación",null,{"$f":"SUM(C35:C38)","v":0},null,{"$f":"SUM(E35:E38)","v":0}]
["Gastos Conexos (DETALLAR)"]
[1,null,null,null,{"$f":"C41*D41","v":0}]
[2,null,null,null,{"$f":"C42*D42","v":0}]
[3,null,null,null,0]
[4,null,null,null,0]
["Sub-total Gastos Conexos",null,null,null,{"$f":"SUM(E41:E44)","v":0},"Tipo de Moneda \n(PARA PROYECTOS EL CHEQUE SE EMITIRÁ EN LA MONEDA \nEN QUE ESTAN LAS CUENTAS MONETARIAS DEL PROYECTO)"]
["Total Viáticos & Gastos Conexos",null,null,null,{"$f":"+E33+E39+E45","v":0}]
[null,null,null,null,null,null,null,"Especificar:",null,null,null,null,3]
[]
["D.  ESTIMACIÓN DEL VALOR DE BOLETOS AÉREOS"]
["Destino","Destino","Cantidad","Valor\nUnitario","Valor\nTotal","Observaciones/Justificación (SI PROCEDE)"]
[1,null,null,null,{"$f":"C51*D51","v":0}]
[2,null,null,null,{"$f":"C52*D52","v":0}]
[3,null,null,null,0]
[4,null,null,null,0]
["Total Boletos (Estimado)",null,null,null,{"$f":"SUM(E51:E54)","v":0}]
["E.  FIRMAS Y AUTORIZACIONES"]
["Nombre completo del Solicitante",null,null,{"$f":"IF(C8=0,\" \",C8)","v":" "},null,null,null,"Firma:",null,null,"Fecha:  (DIA/MES/AÑO)  "]
[]
[]
["Jefe Inmediato \nViajes locales & al extranjeros",null,null,null,null,null,null,"Firma:",null,null,"Fecha:  (DIA/MES/AÑO)  "]
[]
[]
["Autoridad Superior (Unidad ó Proyecto)\nViajes locales & extranjeros",null,null,null,null,null,null,"Firma:",null,null,"Fecha:  (DIA/MES/AÑO)  "]
[]
[]
["Vicerrectoría Académica o\nAdministrativa  Si Aplica",null,null,null,null,null,null,"Firma:",null,null,"Fecha:  (DIA/MES/AÑO)  "]
[]
[]
[]
[]
[]
[]
[]
[]
[]
[]
[]
[]
[]
[]
[]
[]
[]
[]
[]
[]
[]
[]
[]
[]
[]
[]
[]
[]
[]
[]
[]
[]
[]
[]
[]
[]
[]
[]
[]
[]
[]
[]
[]
[]
[]
[]
[]
[]
[]
[]
[]
[]
[]
[]
[]
[]
[]
[]
[]
[]
[]
[]
[]
[]
[]
[]
[]
[]
[null," ",null,"Central"]
[null,"RETENCION DEFINITIVA",null,"Altiplano"]
[null,"TRIMESTRAL",null,"Sur"]
[null,"PEQUEÑO CONTRIBUYENTE",null,"Colegio Americano del Sur"]
[null,"RELACION DE DEPENDENCIA",null," "]

{"sheet":"TABLAS DE VIATICOS AUTORIZADOS ","index":4,"n_rows":15,"n_cols":8,"rows_kept":15,"cut":false,"hidden":false,"merged":[[13,1,13,2],[14,1,14,2],[0,0,0,7],[1,0,1,7],[4,1,4,7],[9,1,9,7],[11,1,11,3],[12,1,12,2]]}
["UNIVERSIDAD DEL VALLE DE GUATEMALA"]
["TABLAS DE VIÁTICOS AUTORIZADOS"]
[]
[]
[null,"VIAJEX AL EXTRANJERO"]
[null,"GRUPO GEOGRÁFICO","HOSPEDAJE","DESAYUNO","ALMUERZO","CENA","TOTAL ALIMENTOS","GRAN TOTAL"]
[null,"A) Europa,  Asia,  África y Oceanía. ",325,25,40,40,{"$f":"SUM(D7:F7)","v":105},{"$f":"+G7+C7","v":430}]
[null,"B) Estados Unidos de América,  Canadá,  México, Panamá, Venezuela, Argentina, Chile, Perú, Ecuador y Brasil. ",250,25,30,30,{"$f":"SUM(D8:F8)","v":85},{"$f":"+G8+C8","v":335}]
[null,"C) Islas del Caribe, Centroamérica, Belice y demás países de América del Sur. ",200,20,30,30,{"$f":"SUM(D9:F9)","v":80},280]
[null,"En el caso de proyectos, aplican los montos máximos autorizados para viáticos estipulados en los contratos o convenios con los donantes. En el caso que existan montos o tablas con valores mayores a los autorizados por el reglamento de viáticos y gastos conexos de la UVG; prevalecen los montos del presente reglamento. "]
[]
[null,"COMPENSACIÓN USO DE VEHIÍCULO PROPIO"]
[null,"CONCEPTO",null,"TARIFA AUTORIZADA"]
[null,"Compensación por Uso de Vehículo Propio - Automóvil",null,2.13]
[null,"Compensación por Uso de Vehículo Propio - Motocicleta",null,0.87]

{"sheet":"2. Solicitud Cheque","index":5,"n_rows":111,"n_cols":14,"rows_kept":111,"cut":false,"hidden":false,"merged":[[55,0,55,10],[0,1,0,11],[0,13,17,13],[1,1,1,11],[2,9,3,9],[2,10,3,11],[6,0,6,2],[6,3,6,4],[6,6,6,8],[6,9,6,11],[23,3,23,11],[8,0,8,2],[8,3,8,11],[10,0,10,2],[10,3,10,4],[12,0,12,11],[18,0,18,2],[18,3,18,11],[20,0,20,2],[20,3,20,11],[22,0,22,2],[22,6,22,7],[22,10,22,11],[24,0,24,2],[24,3,24,11],[26,0,26,2],[26,3,26,6],[26,8,26,9],[26,10,26,11],[28,0,28,2],[28,3,28,6],[28,8,28,9],[28,10,28,11],[32,0,32,2],[32,3,32,5],[32,6,32,8],[32,9,32,11],[34,0,34,2],[34,3,34,5],[34,6,34,8],[34,9,34,11],[36,0,36,2],[36,3,36,5],[36,6,36,8],[36,9,36,11],[38,0,38,2],[38,3,38,5],[38,6,38,8],[38,9,38,11],[40,0,40,2],[40,3,40,5],[40,6,40,8],[40,9,40,11],[42,0,42,2],[42,3,42,5],[42,6,42,8],[42,9,42,11],[44,0,44,2],[44,3,44,5],[44,6,44,8],[44,9,44,11],[46,0,46,11],[47,0,48,2],[47,3,48,5],[47,6,48,9],[47,10,47,11],[48,10,48,11],[49,0,49,10],[50,0,51,2],[50,3,51,5],[50,6,51,9],[50,10,50,11],[51,10,51,11],[59,13,59,16],[60,10,60,11],[60,13,60,16],[56,0,57,2],[56,3,57,5],[56,6,57,9],[56,10,56,11],[56,13,56,16],[57,10,57,11],[57,13,57,16],[4,0,4,2],[4,6,4,8],[4,9,4,11],[4,3,4,4],[62,0,62,11],[58,0,58,10],[59,0,60,2],[59,3,60,5],[59,6,60,9],[59,10,59,11],[52,0,52,10],[53,0,54,2],[53,3,54,5],[53,6,54,9],[53,10,53,11],[54,10,54,11]]}
[null,"UNIVERSIDAD DEL VALLE DE GUATEMALA",null,null,null,null,null,null,null,null,null,null,null,"SOLICITUD CHEQUE"]
[null,"Solicitud de Cheque o Efectivo"]
[]
[]
["Campus",null,null,{"$f":"IF('1. Autorización'!I6=0,\"\",'1. Autorización'!I6)","v":""},null,null,"No."]
[]
["Fecha",null,null,{"$f":"TODAY()","v":"2019-02-25"},null,null,"Teléfono/Extensión",null,null,{"$f":"CONCATENATE('1. Autorización'!C14,\"  /  \",'1. Autorización'!I14)","v":"  /   "}]
[]
["Beneficiario",null,null,{"$f":"IF('1. Autorización'!C8:C8=0,\"\",'1. Autorización'!C8:C8)","v":" "}]
[]
["Valor",null,null,{"$f":"'1. Autorización'!E46","v":0}]
[]
["Concepto del Gasto"]
[]
[]
[]
[]
[]
["Descripción del Gasto",null,null,{"$f":"CONCATENATE('1. Autorización'!I18,\" - \",'1. Autorización'!I19,\" - \",'1. Autorización'!I20,\" - \",'1. Autorización'!C23)","v":" -  -  - "}]
[]
["Destino \n(Viajes)",null,null,{"$f":"IF('1. Autorización'!B18=0,\"\",CONCATENATE('1. Autorización'!B18,\" - \",'1. Autorización'!D18, \", \",'1. Autorización'!B19,\" - \",'1. Autorización'!D19,\", \",'1. Autorización'!B20,\" - \",'1. Autorización'!D19))","v":""}]
[]
["Fecha (Duración) días (Viajes)",null,null,{"$f":"IF('1. Autorización'!F21=0,\"\",'1. Autorización'!F21)","v":""},null,"del",null,null,null,"al"]
[]
["Nombre Participantes (Viajes)"]
[]
["Emitir cheque de \ncuenta bancaria #",null,null,null,null,null,null,null,"Tipo de Fondo"]
[]
["Depositar en \ncuenta bancaria # (Si Aplica)",null,null,null,null,null,null,null,"Tipo de Fondo"]
[]
[null,null,null,null,null,null,null,null,null,null,null,null,2]
[]
["Tipo de Presupuesto ",null,null," ",null,null,"Centro"]
[]
["Partida Presupuestaria No. ",null,null,{"$f":"IF(IFERROR(VLOOKUP(D37,PROGRAMAS!I:J,2,0),\"\")=0,\"\",IFERROR(VLOOKUP(D37,PROGRAMAS!I:J,2,0),\"\"))","v":""},null,null,"Proyecto (Incluir Código)",null,null,{"$f":"IF(M31=3,IF('1. Autorización'!C10=0,\"\",'1. Autorización'!C10),\"\")","v":""}]
[]
["Nombre Partida Presupuestaria",null,null,null,null,null,"Subproyecto",null,null,{"$f":"IF(M31=3,IF('1. Autorización'!I10=0,\"\",'1. Autorización'!I10),\"\")","v":""}]
[]
["Cuenta Contable No.",null,null,{"$f":"IF(IFERROR(VLOOKUP(D41,'CUENTAS CONTABLES'!A:F,6,0),\"\")=0,\"\",IFERROR(VLOOKUP(D41,'CUENTAS CONTABLES'!A:F,6,0),\"\"))","v":""},null,null,"Subproyecto II"]
[]
["Nombre de la Cuenta Contable",null,null,null,null,null,"Rubro"]
[]
["Código del Fondo",null,null,null,null,null,"Subrubro"]
[]
["Nombre del Fondo",null,null,null,null,null,"Subrubro II"]
[]
["AUTORIZACIONES "]
["Nombre completo del Solicitante",null,null,{"$f":"IF(D9=0,\"\",D9)","v":" "},null,null,"Firma:",null,null,null,"Fecha:  (DIA/MES/AÑO)  "]
[]
[]
["Jefe Inmediato",null,null,{"$f":"IF('1. Autorización'!D60:D60=0,\"\",'1. Autorización'!D60:D60)","v":""},null,null,"Firma:",null,null,null,"Fecha:  (DIA/MES/AÑO)  "]
[]
[]
["Autoridad Superior \n(Unidad ó  Proyecto) Si Aplica",null,null,{"$f":"IF('1. Autorización'!D63:D63=0,\"\",'1. Autorización'!D63:D63)","v":""},null,null,"Firma:",null,null,"Fecha:  (DIA/MES/AÑO)  ","Fecha:  (DIA/MES/AÑO)  "]
[]
[]
["Dirección Administrativa de Proyectos Sólo para Proyectos ",null,null,null,null,null,"Firma:",null,null,"Fecha:  (DIA/MES/AÑO)  ","Fecha:  (DIA/MES/AÑO)  "]
[]
[]
["Vicerrectoría Academica ó\nAdministrativa Si Aplica",null,null,{"$f":"IF('1. Autorización'!D66=0,\"\",'1. Autorización'!D66)","v":""},null,null,"Firma:",null,null,"Fecha:  (DIA/MES/AÑO)  ","Fecha:  (DIA/MES/AÑO)  "]
[]
[]
["Revisar antes de entregar a Cuentas por Pagar que esta solicitud cuente con partida Presupuestaria. \nEnviar para su trámite ocho (8) días calendario antes de la comisión de trabajo. \nLiquidar dentro de los cinco (5) días siguientes a la finalización de la comisión de trabajo. \nSi el monto requerido es menor a Q. 500.00 la solicitud se manejará con fondos de caja general (Siempre que no sea anticipo) y si es mayor se tramitará cheque. \nPresentar solicitud (original y copia) a Cuentas por Pagar quien sellará de recibido y colocará el No. Correlativo.\n*** PARA EL CASO DE ANTICIPOS, SE RECUERDA AL BENEFICIARIO QUE DEBE SACAR COPIA AL CHEQUE INMEDIATAMENTE DESPUÉS DE HABERLO RECIBIDO."]
[]
[]
[]
[]
[]
[]
[]
[]
[]
[]
[]
[]
[]
[]
[]
[]
[]
[]
[]
[]
[]
[]
[]
[]
[]
[]
[]
[]
[]
[]
[]
[]
[]
[]
[]
[]
[]
[]
[]
[null,null,"Sedes:",null,null,null,"Tipos de Presupuesto:",null,null,null,"Tipos de Fondo:"]
[null,null,"Central",null,null,null,"ASHA 14-00016",null,null,null,"FNR"]
[null,null,"Sur",null,null,null,"EDUCON",null,null,null,"FTR"]
[null,null,"Altiplano",null,null,null,"ESTRATÉGICO",null,null,null,"FPR"]
[null,null,"Colegio Americano del Sur",null,null,null,"IPF"]
[null,null,null,null,null,null,"OPERACIONAL"]
[null,null,null,null,null,null,"CIT"]
[null,null,null,null,null,null,"SERVICIOS"]
[null,null,null,null,null,null," "]

{"sheet":"3. Liquidación","index":6,"n_rows":114,"n_cols":13,"rows_kept":114,"cut":false,"hidden":false,"merged":[[112,0,112,3],[112,7,113,10],[113,0,113,3],[109,1,109,2],[109,7,109,9],[110,1,110,2],[110,7,110,9],[111,1,111,2],[111,7,111,9],[106,1,106,2],[106,7,106,9],[107,1,107,2],[107,7,107,9],[108,1,108,2],[108,7,108,9],[102,0,102,2],[102,7,102,9],[103,0,103,2],[103,7,103,9],[104,0,104,10],[105,1,105,2],[105,7,105,9],[99,0,100,2],[99,3,100,3],[99,4,99,6],[99,7,100,9],[99,10,100,10],[101,0,101,2],[101,7,101,9],[95,0,95,3],[95,7,96,10],[96,0,96,3],[98,0,98,1],[98,2,98,5],[98,6,98,7],[98,9,98,10],[92,1,92,2],[92,7,92,9],[93,1,93,2],[93,7,93,9],[94,1,94,2],[94,7,94,9],[89,1,89,2],[89,7,89,9],[90,1,90,2],[90,7,90,9],[91,1,91,2],[91,7,91,9],[85,0,85,2],[85,7,85,9],[86,0,86,2],[86,7,86,9],[87,0,87,10],[88,1,88,2],[88,7,88,9],[82,0,83,2],[82,3,83,3],[82,4,82,6],[82,7,83,9],[82,10,83,10],[84,0,84,2],[84,7,84,9],[77,1,77,2],[77,7,77,9],[78,0,78,3],[78,7,79,10],[79,0,79,3],[81,0,81,1],[81,2,81,5],[81,6,81,7],[81,9,81,10],[74,1,74,2],[74,7,74,9],[75,1,75,2],[75,7,75,9],[76,1,76,2],[76,7,76,9],[70,0,70,10],[71,1,71,2],[71,7,71,9],[72,1,72,2],[72,7,72,9],[73,1,73,2],[73,7,73,9],[67,0,67,2],[67,7,67,9],[68,0,68,2],[68,7,68,9],[69,0,69,2],[69,7,69,9],[64,0,64,1],[64,2,64,5],[64,6,64,7],[64,9,64,10],[65,0,66,2],[65,3,66,3],[65,4,65,6],[65,7,66,9],[65,10,66,10],[60,0,61,2],[60,3,61,5],[60,6,61,8],[60,9,60,10],[61,9,61,10],[63,0,63,10],[54,0,55,2],[54,3,55,5],[54,6,55,8],[54,9,54,10],[55,9,55,10],[57,0,58,2],[57,3,58,5],[57,6,58,8],[57,9,57,10],[58,9,58,10],[48,0,48,2],[48,6,48,8],[48,9,48,10],[50,0,50,10],[51,0,52,2],[51,3,52,5],[51,6,52,8],[51,9,51,10],[52,9,52,10],[43,0,43,2],[43,9,47,10],[44,0,44,2],[44,6,44,8],[45,0,45,2],[45,6,45,8],[46,0,46,2],[46,6,46,8],[47,0,47,2],[47,6,47,8],[42,0,42,2],[35,0,35,2],[35,6,35,8],[36,0,36,2],[36,6,36,8],[37,0,38,1],[37,6,37,8],[38,6,38,8],[42,9,42,10],[30,0,30,10],[31,0,32,2],[31,3,31,5],[31,6,32,8],[31,9,41,10],[33,0,33,2],[33,6,33,8],[34,0,34,2],[39,0,39,2],[39,6,39,8],[40,0,40,2],[40,6,41,8],[41,0,41,2],[24,0,24,10],[25,0,25,1],[25,2,25,3],[25,4,28,4],[25,5,28,6],[25,9,25,10],[26,9,26,10],[27,7,28,7],[27,8,28,8],[27,9,28,10],[28,0,28,1],[28,2,28,3],[20,0,20,4],[20,6,20,10],[22,0,22,1],[22,2,22,10],[17,1,17,2],[17,3,17,4],[17,8,17,10],[18,1,18,2],[18,3,18,4],[18,8,18,10],[11,0,11,1],[11,2,11,5],[11,6,11,7],[11,8,11,10],[13,0,13,1],[13,2,13,5],[13,6,13,7],[13,8,13,10],[19,1,19,2],[19,3,19,4],[19,8,19,10],[0,12,18,12],[1,0,1,10],[2,0,2,10],[4,0,4,10],[5,0,5,1],[5,2,5,3],[5,4,5,5],[5,6,5,7],[5,8,5,10],[7,0,7,1],[7,2,7,5],[7,6,7,7],[7,8,7,10],[9,0,9,1],[9,2,9,5],[9,6,9,7],[9,8,9,10],[0,0,0,10],[15,0,15,3],[15,5,15,6],[15,7,15,8],[16,1,16,2],[16,3,16,4],[16,8,16,10]]}
["UNIVERSIDAD DEL VALLE DE GUATEMALA",null,null,null,null,null,null,null,null,null,null,null,"LIQUIDACIÓN"]
["Liquidación de Viáticos "]
["Viajes Locales y Extranjeros"]
[]
["A.  INFORMACIÓN DEL SOLICITANTE"]
["Lugar y Fecha",null,{"$f":"IF('1. Autorización'!C6:C6=0,\"\",'1. Autorización'!C6:C6)","v":""},null,{"$f":"TODAY()","v":"2019-02-25"},null,"Campus",null,{"$f":"IF('1. Autorización'!I6:I6=0,\"\",'1. Autorización'!I6:I6)","v":""}]
[]
["Nombre Completo",null,{"$f":"IF('1. Autorización'!C8:F8=0,\"\",'1. Autorización'!C8:F8)","v":" "},null,null,null,"Cargo",null,{"$f":"IF('1. Autorización'!I8:I8=0,\"\",'1. Autorización'!I8:I8)","v":" "}]
[]
["Unidad ó Proyecto",null,{"$f":"IF('1. Autorización'!C10:C10=0,\"\",'1. Autorización'!C10:C10)","v":" "},null,null,null,"Sub-Proyecto",null,{"$f":"IF('1. Autorización'!I10:I10=0,\"\",'1. Autorización'!I10:I10)","v":" "}]
[]
["Régimen Tributario",null,{"$f":"IF('1. Autorización'!C12:C12=0,\"\",'1. Autorización'!C12:C12)","v":" "},null,null,null,"Correo Electrónico",null,{"$f":"IF('1. Autorización'!I12:I12=0,\"\",'1. Autorización'!I12:I12)","v":" "}]
[]
["Teléfono",null,{"$f":"IF('1. Autorización'!C14=0,\"\",'1. Autorización'!C14)","v":""},null,null,null,"Extensión",null,{"$f":"IF('1. Autorización'!I14=0,\"\",'1. Autorización'!I14)","v":" "}]
[]
["B.  INFORMACIÓN DEL VIAJE",null,null,null,"ESPECIFICAR: "]
["No. ","Origen",null,"Destino",null,"Número \nDías/Horas","Fecha/Hora \nSalida","Fecha/Hora \nRegreso","Objetivo General del Viaje"]
[1]
[2]
[3]
["Duración Total Días/Horas",null,null,null,null,{"$f":"SUM(F18:F20)","v":0}]
[]
["Observaciones Generales (OPCIONAL)"]
[]
["C. INFORMACIÓN DEL ANTICIPO (OBLIGATORIO ADJUNTAR FOTOCOPIA DE LA SOLICITUD DE CHEQUE O EFECTIVO & DEL CHEQUE EMITIDO)"]
["No. Solicitud de Cheque ó Efectivo",null,null,null,"No. Cuenta Bancaria",{"$f":"IF('2. Solicitud Cheque'!D27:D27=0,\"\",'2. Solicitud Cheque'!D27:D27)","v":""},null,"\nMONTO en\n","\nMONTO en \n","\nMONTO en \n"]
[null,null,null,null,null,null,null,"Q. (Quetzales)","US$ (DÓLARES)",{"$f":"IF('1. Autorización'!I47=0,\"\",'1. Autorización'!I47)","v":""}]
[null,null,null,null,null,null,null,{"$f":"IF('1. Autorización'!M47=3,'1. Autorización'!E46,0)","v":0},{"$f":"IF('1. Autorización'!M47=2,'1. Autorización'!E46,0)","v":0},{"$f":"IF('1. Autorización'!M47=1,'1. Autorización'!E46,0)","v":0}]
["No. de Cheque"]
[]
["D.  RESUMEN DE LA LIQUIDACION"]
["Concepto",null,null,"Monto Total",null,null,"(OPCIONAL)\nObservaciones/Justificación"]
[null,null,null,"Q","US$","Otras Monedas"]
["Anticipo",null,null,{"$f":"+H28","v":0},{"$f":"+I28","v":0},{"$f":"+J28","v":0}]
["Resumen de Gastos"]
["Hospedaje"]
["Alimentación"]
["Compensación Uso Vehículo Propio",null,"Automóvil",{"$f":"+'TABLA CALCULOS'!G19","v":0}]
[null,null,"Motocicleta",{"$f":"+'TABLA CALCULOS'!G20","v":0}]
["Otros Gastos Conexos"]
["Total Viáticos y Gastos Conexos",null,null,{"$f":"SUM(D36:D40)","v":0},{"$f":"SUM(E36:E40)","v":0},{"$f":"SUM(F36:F40)","v":0}]
["Retención por Cuenta del Solicitante",null,null,{"$f":"IF('TABLA CALCULOS'!G22>2500,'TABLA CALCULOS'!F26,0)","v":0}]
["Saldo",null,null,{"$f":"+D34-D41+D42","v":0},{"$f":"+E34-E41","v":0},{"$f":"+F34-F41","v":0},null,null,null,"ANTICIPO MENOS\nTOTAL GASTOS"]
["Valor de Reintegro a UVG",null,null,{"$f":"IF(D43>0,D43,0)","v":0},{"$f":"IF(E43>0,E43,0)","v":0},{"$f":"IF(F43>0,F43,0)","v":0},null,null,null,"PROCEDE CUANDO\nRESULTA UN\nSALDO POSITIVO"]
["No. de Depósito/Recibo"]
["Fecha de Depósito"]
["Monto de Depósito",null,null,{"$f":"+D44","v":0},{"$f":"+E44","v":0},{"$f":"+F44","v":0}]
["No. de Cuenta Bancaria",null,null,null,null,null,{"$f":"IF(SUM(D47:F47)>0,F26,\"\")","v":""}]
["Complemento a Favor del Solicitante",null,null,{"$f":"IF(D43>0,0,D43*-1)","v":0},{"$f":"IF(E43>0,0,E43*-1)","v":0},{"$f":"IF(F43>0,0,F43*-1)","v":0},null,null,null,"PROCEDE CUANDO RESULTA UN SALDO NEGATIVO"]
[]
["E.  FIRMAS Y AUTORIZACIONES"]
["Nombre completo del Solicitante",null,null,{"$f":"IF(C8=0,\" \",C8)","v":" "},null,null,"Firma:",null,null,"Fecha:  (DIA/MES/AÑO)  "]
[]
[]
["Jefe Inmediato \nViajes locales & al extranjero",null,null,{"$f":"IF('1. Autorización'!D60=0,\"\",'1. Autorización'!D60)","v":""},null,null,"Firma:",null,null,"Fecha:  (DIA/MES/AÑO)  "]
[]
[]
["Autoridad Superior (Unidad ó Proyecto) Sólo si el valor de la liquidación es mayor a lo recibido como anticipo",null,null,null,null,null,"Firma:",null,null,"Fecha:  (DIA/MES/AÑO)  "]
[]
[]
["Dirección Administrativa de Proyectos Sólo para Proyectos",null,null,{"$f":"IF('2. Solicitud Cheque'!D57=0,\"\",'2. Solicitud Cheque'!D57)","v":""},null,null,"Firma:",null,null,"Fecha:  (DIA/MES/AÑO)  "]
[]
[]
["F.  DETALLE DE GASTOS PARA LA LIQUIDACION DE ANTICIPOS "]
["Destino: ",null,{"$f":"IF(D18=0,\" \",D18)","v":" "},null,null,null,"Tipo de Cambio:"]
["Concepto",null,null," Número de Factura","Monto de la Factura",null,null,"Justificación y \nObservaciones",null,null,"Folio\nNo."]
[null,null,null,null,"Q","US$","Otra Moneda"]
["Hospedaje"]
["Alimentación"]
["Compensación Uso Vehículo Propio"]
["OTROS GASTOS CONEXOS (DETALLAR)"]
[1,"Taxis"]
[2]
[3]
[4]
[5]
[6]
[7]
["Total Otros Gastos Conexos",null,null,null,{"$f":"SUM(E72:E78)","v":0},{"$f":"SUM(F72:F78)","v":0},{"$f":"SUM(G72:G78)","v":0}]
["Total Viáticos y Gastos Conexos",null,null,null,{"$f":"+E68+E69+E79+E70","v":0},{"$f":"+F68+F69+F79+F70","v":0},{"$f":"+G68+G69+G79+G70","v":0}]
[]
["Destino: ",null,{"$f":"IF(D19=0,\" \",D19)","v":" "},null,null,null,"Tipo de Cambio:"]
["Concepto",null,null," Número de Factura","Monto de la Factura",null,null,"Justificación y \nObservaciones",null,null,"Folio\nNo."]
[null,null,null,null,"Q","US$","Otra Moneda"]
["Hospedaje"]
["Alimentación"]
["Compensación Uso Vehículo Propio"]
["OTROS GASTOS CONEXOS (DETALLAR)"]
[1]
[2]
[3]
[4]
[5]
[6]
[7]
["Total Otros Gastos Conexos",null,null,null,{"$f":"SUM(E89:E95)","v":0},{"$f":"SUM(F89:F95)","v":0},{"$f":"SUM(G89:G95)","v":0}]
["Total Viáticos y Gastos Conexos",null,null,null,{"$f":"+E85+E86+E96+E87","v":0},{"$f":"+F85+F86+F96+F87","v":0},{"$f":"+G85+G86+G96+G87","v":0}]
[]
["Destino: ",null,{"$f":"IF(D20=0,\" \",D20)","v":" "},null,null,null,"Tipo de Cambio:"]
["Concepto",null,null," Número de Factura","Monto de la Factura",null,null,"Justificación y \nObservaciones",null,null,"Folio\nNo."]
[null,null,null,null,"Q","US$","Otra Moneda"]
["Hospedaje"]
["Alimentación"]
["Compensación Uso Vehículo Propio"]
["OTROS GASTOS CONEXOS (DETALLAR)"]
[1]
[2]
[3]
[4]
[5]
[6]
[7]
["Total Otros Gastos Conexos",null,null,null,{"$f":"SUM(E106:E112)","v":0},{"$f":"SUM(F106:F112)","v":0},{"$f":"SUM(G106:G112)","v":0}]
["Total Viáticos y Gastos Conexos",null,null,null,{"$f":"+E102+E103+E113+E104","v":0},{"$f":"+F102+F103+F113+F104","v":0},{"$f":"+G102+G103+G113+G104","v":0}]

{"sheet":"3.1 Recibo Vehículo","index":7,"n_rows":38,"n_cols":15,"rows_kept":38,"cut":false,"hidden":false,"merged":[[37,0,37,12],[34,0,34,10],[35,0,36,2],[35,3,36,6],[35,7,35,10],[35,11,35,12],[36,7,36,10],[36,11,36,12],[31,0,31,12],[32,0,33,2],[32,3,33,6],[32,7,32,10],[32,11,32,12],[33,7,33,10],[33,11,33,12],[29,0,30,1],[29,2,30,7],[29,8,30,9],[29,10,30,12],[22,0,22,6],[22,10,22,12],[24,0,24,12],[25,0,25,12],[26,0,26,1],[26,3,26,4],[26,5,26,12],[27,0,28,1],[27,2,28,5],[27,6,28,10],[27,11,27,12],[28,11,28,12],[20,3,20,4],[20,5,20,6],[20,10,20,12],[21,3,21,4],[21,5,21,6],[21,10,21,12],[18,3,18,4],[18,5,18,6],[18,10,18,12],[19,3,19,4],[19,5,19,6],[19,10,19,12],[16,3,16,4],[16,5,16,6],[16,10,16,12],[17,3,17,4],[17,5,17,6],[17,10,17,12],[14,3,14,4],[14,5,14,6],[14,10,14,12],[15,3,15,4],[15,5,15,6],[15,10,15,12],[12,3,12,4],[12,5,12,6],[12,10,12,12],[13,3,13,4],[13,5,13,6],[13,10,13,12],[10,3,10,4],[10,5,10,6],[10,10,10,12],[11,3,11,4],[11,5,11,6],[11,10,11,12],[8,3,8,4],[8,5,8,6],[8,10,8,12],[9,3,9,4],[9,5,9,6],[9,10,9,12],[0,0,0,12],[0,14,15,14],[1,0,1,12],[2,0,2,12],[4,0,4,12],[5,0,5,1],[5,3,5,4],[5,5,5,6],[5,8,6,8],[5,9,6,9],[5,10,6,12],[6,3,6,4],[6,5,6,6],[7,3,7,4],[7,5,7,6],[7,10,7,12]]}
["UNIVERSIDAD DEL VALLE DE GUATEMALA",null,null,null,null,null,null,null,null,null,null,null,null,null,"RECIBO VEHÍCULO"]
["Liquidación Recibo"]
["Compensación Por Uso De Vehículo Propio"]
[]
["A. DETALLE DE KILOMETROS RECORRIDOS Y COMPENSACION POR USO DE VEHICULO PROPIO \n      (SEGÚN LO AUTORIZADO EN EL CAPÍTULO III, ARTÍCULO QUINCE (15) DEL REGLAMENTO DE VIÁTICOS Y GASTOS CONEXOS)"]
["Tarifa:",null,"Automóvil:",2.13,null,"Motocicleta:",null,0.87,"Q.\nTarifa","Valor\nTotal\nQ.","Objetivo/Justificación"]
["No.","Fecha","Placa","Origen",null,"Destino",null,"Kilómetros\nRecorridos"]
[1,null,null,null,null,null,null,null,null,{"$f":"+H8*I8","v":0}]
[{"$f":"+A8+1","v":2},null,null,null,null,null,null,null,null,0]
[{"$f":"+A9+1","v":3},null,null,null," ",null,null,null,null,0]
[4,null,null,null," ",null,null,null,null,0]
[5,null,null,null," ",null,null,null,null,0]
[6,null,null,null," ",null,null,null,null,0]
[7,null,null,null," ",null,null,null,null,0]
[8,null,null,null," ",null,null,null,null,0]
[9,null,null,null," ",null,null,null,null,0]
[10,null,null,null," ",null,null,null,null,0]
[11,null,null,null," ",null,null,null,null,0]
[12,null,null,null," ",null,null,null,null,0]
[13,null,null,null,null,null,null,null,null,0]
[14,null,null,null,null,null,null,null,null,0]
[15,null,null,null,null,null,null,null,null,0]
["Total compensación por uso de vehículo propio",null,null,null,null,null,null,{"$f":"SUM(H8:H22)","v":0},null,{"$f":"SUM(J8:J22)","v":0}]
[]
["B.  RECIBO"]
["Recibí de la Universidad del Valle de Guatemala la siguiente cantidad total por concepto de compensación de uso de vehículo propio, el cual incluye combustible, mantenimiento y depreciación; cuyo objetivo, plazo y proyecto están detallados en este formulario.  "]
["Total Recibido:",null,{"$f":"+J23","v":0},"CANTIDAD EN LETRAS:"]
["Nombre completo del Solicitante",null,{"$f":"+'1. Autorización'!C8:F8","v":" "},null,null,null,"Firma:",null,null,null,null,"Fecha:  (DIA/MES/AÑO)  "]
[null,null,null,null,null,null,null,null,null,null,null,{"$f":"TODAY()","v":"2019-02-25"}]
["Unidad ó Proyecto (Incluir Código)",null,{"$f":"+'1. Autorización'!C10:F10","v":" "},null,null,null,null,null,"No. Solicitud de \nCheque o Efectivo",null,{"$f":"+'3. Liquidación'!C26","v":0}]
[]
["C.  FIRMAS Y AUTORIZACIONES"]
["Jefe Inmediato",null,null,{"$f":"+'3. Liquidación'!D55","v":""},null,null,null,"Firma:",null,null,null,"Fecha:  (DIA/MES/AÑO)  "]
[]
[]
["Autoridad Superior\n(Unidad ó  Proyecto)",null,null,{"$f":"IF('3. Liquidación'!D58=0,\"\",'3. Liquidación'!D58)","v":""},null,null,null,"Firma:",null,null,null,"Fecha:  (DIA/MES/AÑO)  "]
[]
["NOTA: ADJUNTAR ESTE FORMULARIO A LA LIQUIDACION DE GATOS DE VIATICOS VIAJES LOCALES Y EXTRANJEROS"]

{"sheet":"3.2 Recibo Alimen al Extranjero","index":8,"n_rows":41,"n_cols":13,"rows_kept":41,"cut":false,"hidden":false,"merged":[[25,3,25,4],[25,5,25,10],[33,0,33,10],[34,0,35,2],[34,3,35,6],[34,7,35,9],[36,0,36,10],[31,0,32,2],[31,3,32,6],[31,7,32,9],[24,0,24,10],[25,0,25,1],[26,0,27,1],[26,2,27,3],[26,4,27,8],[26,9,26,10],[27,9,27,10],[28,0,29,1],[28,2,29,5],[28,6,29,7],[28,8,29,10],[30,0,30,10],[23,0,23,10],[18,1,18,3],[18,5,18,6],[18,7,18,8],[19,1,19,3],[19,5,19,6],[19,7,19,8],[20,1,20,3],[20,5,20,6],[20,7,20,8],[21,0,21,9],[22,0,22,10],[16,1,16,3],[16,5,16,6],[16,7,16,8],[17,1,17,3],[17,5,17,6],[17,7,17,8],[12,7,12,8],[14,1,14,3],[14,5,14,6],[14,7,14,8],[15,1,15,3],[15,5,15,6],[15,7,15,8],[8,1,8,3],[8,5,8,6],[8,7,8,8],[13,1,13,3],[13,5,13,6],[13,7,13,8],[9,1,9,3],[9,5,9,6],[9,7,9,8],[10,1,10,3],[10,5,10,6],[10,7,10,8],[11,1,11,3],[11,5,11,6],[12,1,12,3],[12,5,12,6],[39,0,39,10],[40,0,40,10],[0,0,0,10],[0,12,16,12],[1,0,1,10],[2,0,2,10],[4,0,4,10],[5,1,5,3],[5,5,5,6],[5,7,5,8],[6,1,6,3],[6,5,6,6],[6,7,6,8],[7,1,7,3],[7,5,7,6],[7,7,7,8]]}
["UNIVERSIDAD DEL VALLE DE GUATEMALA",null,null,null,null,null,null,null,null,null,null,null,"RECIBO ALIMENTACIÓN"]
["Liquidación Recibo Gastos de Alimentación"]
["Viajes al Extranjero"]
[]
["A.  DETALLE GASTOS POR ALIMENTACIÓN (SEGÚN AUTORIZADO EN REGLAMENTO VIATICOS Y GASTOS CONEXOS, CAPITULO IV, ART. 16 & 17)"]
["No.","Destino",null,null,"No.\nDías","Fecha\nSalida",null,"Fecha\nRegreso",null,"Cuota Diaria\n$.","Valor Total\n$."]
[1,null,null,null,null,null,null,null,null,null,{"$f":"+$E7*J7","v":0}]
[{"$f":"+A7+1","v":2},null,null,null,null,null,null,null,null,null,0]
[{"$f":"+A8+1","v":3},null,null,null,null,null,null,null,null,null,0]
[4,null,null,null,null,null,null,null,null,null,0]
[5,null,null,null,null,null,null,null,null,null,0]
[6,null,null,null,null,null,null,null,null,null,0]
[7,null,null,null,null,null,null,null,null,null,0]
[8,null,null,null,null,null,null,null,null,null,0]
[9,null,null,null,null,null,null,null,null,null,0]
[10,null,null,null,null,null,null,null,null,null,0]
[11,null,null,null,null,null,null,null,null,null,0]
[12,null,null,null,null,null,null,null,null,null,0]
[13,null,null,null,null,null,null,null,null,null,0]
[14,null,null,null,null,null,null,null,null,null,0]
[15,null,null,null,null,null,null,null,null,null,0]
["TOTAL GASTOS POR ALIMENTACION",null,null,null,null,null,null,null,null,null,{"$f":"SUM(K7:K21)","v":0}]
[]
["B.  RECIBO"]
["Recibí de la Universidad del Valle de Guatemala la siguiente cantidad total por concepto de gastos de alimentación durante el viaje realizado, cuyo objetivo, plazo y proyecto están detallados en la liquidación adjunta:"]
["Total Recibido:",null,{"$f":"+K22","v":0},"CANTIDAD EN LETRAS:"]
["Nombre completo del Solicitante",null,{"$f":"IF('1. Autorización'!C8=0,\"\",'1. Autorización'!C8)","v":" "},null,"Firma:",null,null,null,null,"Fecha:  (DIA/MES/AÑO)  "]
[null,null,null,null,null,null,null,null,null,{"$f":"TODAY()","v":"2019-02-25"}]
["Unidad ó Proyecto (Incluir Código)",null,{"$f":"IF('1. Autorización'!C10=0,\"\",'1. Autorización'!C10)","v":" "},null,null,null,"No. Solicitud de \nCheque o Efectivo",null,{"$f":"+'3. Liquidación'!C26","v":0}]
[]
["C.  FIRMAS Y AUTORIZACIONES"]
["Jefe Inmediato",null,null,{"$f":"IF('1. Autorización'!D60=0,\"\",'1. Autorización'!D60)","v":""},null,null,null,"Firma:",null,null,"Fecha:  (DIA/MES/AÑO)  "]
[]
[]
["Autoridad Superior\n(Unidad ó  Proyecto)",null,null,{"$f":"IF('3. Liquidación'!D58=0,\"\",'3. Liquidación'!D58)","v":""},null,null,null,"Firma:",null,null,"Fecha:  (DIA/MES/AÑO)  "]
[]
["NOTA: ADJUNTAR ESTE FORMULARIO A LA LIQUIDACION DE GATOS DE VIATICOS VIAJES LOCALES Y EXTRANJEROS"]
[]
[]
["TABLA CON TARIFAS INTERNACIONALES"]
["Esta tabla NO se imprime.  Es únicamente para apoyo al usuario"]

{"sheet":"TABLA CALCULOS","index":9,"n_rows":26,"n_cols":7,"rows_kept":26,"cut":false,"hidden":false,"merged":[[21,0,21,4],[22,0,22,4],[23,2,23,4],[24,2,24,4],[25,2,25,4],[20,1,20,2],[10,0,10,6],[11,0,11,2],[12,0,14,0],[12,1,12,6],[13,1,13,2],[14,1,14,2],[15,0,15,6],[16,0,16,6],[17,0,17,2],[18,1,18,2],[19,1,19,2],[9,0,9,6],[0,0,0,6],[1,0,1,6],[2,0,2,6],[3,0,4,0],[3,1,3,6],[4,1,4,6],[5,1,5,6],[6,0,6,6],[7,0,7,6],[8,2,8,3],[8,4,8,6]]}
["UNIVERSIDAD DEL VALLE DE GUATEMALA"]
["FORMULARIO DE APOYO PARA CÁLCULO DE LIQUIDACIONES"]
["INSTRUCCIONES"]
["A)","Identifique en la Tabla por Régimen Tributario los valores que corresponden a la tarifa diaria máxima autorizada."]
[null,"Si la tarifa autorizada es menor al monto establecido en las tablas, prevalece la autorizada. "]
["B)","Ingrese manualmente el número de kilómetros recorridos según aplique."]
[]
["A) REGIMEN TRIBUTARIO"]
[null,null,"Régimen Tributario al que está inscrito: ",null,{"$f":"IF('1. Autorización'!C12=0,\"\",'1. Autorización'!C12)","v":" "}]
[]
["B) TECHO MAXIMO APROBADO SEGÚN REGLAMENTO DE VIATICOS Y GASTOS CONEXOS & GASTOS MENORES DE OPERACIÓN AJUSTADO AL \n      REGIMEN TRIBUTARIO DEL SOLICITANTE"]
["Concepto",null,null,"Pequeño\nContribuyente","Retención\nDefinitiva","Trimestral","Relación de\nDependencia"]
[1,"COMPENSACION POR USO DE VEHICULO PROPIO"]
[null,"Compensación por Uso de Vehículo Propio - Automóvil",null,2.13,2,2.13,2.13]
[null,"Compensación por Uso de Vehículo Propio - Motocicleta",null,0.87,0.82,0.87,0.87]
[]
["C) CALCULO PARA EMISION DE FACTURA O FORMULARIO LIQUIDACION RECIBO"]
["Concepto",null,null,"Cantidad\n(Kms.)","Tarifa Diaria ó\nValor Unitario","Liquido \na recibir","Valor a trasladar \nal Formulario \nde Liquidación"]
[1,"Compensación Uso de Vehículo  Propio (Kilómetros)",null,null,{"$f":"IF($E$9=\"RETENCION DEFINITIVA\",E14,IF($E$9=\"TRIMESTRAL\",F14,IF($E$9=\"PEQUEÑO CONTRIBUYENTE\",D14,IF($E$9=\"RELACION DE DEPENDENCIA\",G14,0))))","v":0},{"$f":"+D19*E19","v":0},{"$f":"IF($E$9=\"RETENCION DEFINITIVA\",F19*1.065,F19)","v":0}]
[2,"Compensación Uso de Vehículo  Propio (Motocicleta, Kilómetros)",null,null,{"$f":"IF($E$9=\"RETENCION DEFINITIVA\",E15,IF($E$9=\"TRIMESTRAL\",F15,IF($E$9=\"PEQUEÑO CONTRIBUYENTE\",D15,IF($E$9=\"RELACION DE DEPENDENCIA\",G15,0))))","v":0},0,{"$f":"IF($E$9=\"RETENCION DEFINITIVA\",F20*1.061,F20)","v":0}]
[{"$f":"+A20+1","v":3},"Otros Gastos sin Factura Contable (previa autorización, según Reglamento de Viáticos y Gastos Conexos ó Gastos Menores de Operación)",null,null,null,{"$f":"+E21","v":0},{"$f":"IF($E$9=\"RETENCION DEFINITIVA\",F21*1.05263157894737,F21)","v":0}]
["Total  ",null,null,null,null,{"$f":"SUM(F19:F21)","v":0},{"$f":"SUM(G19:G21)","v":0}]
[{"$f":"IF(E9=\"RELACION DE DEPENDENCIA\",\"DEBE EMITIR UN RECIBO POR CADA CONCEPTO ARRIBA INDICADO, EL MONTO SERÁ EL LÍQUIDO A RECIBIR\",\"VALOR A CONSIGNAR EN LA FACTURA:\")","v":"VALOR A CONSIGNAR EN LA FACTURA:"},null,null,null,null,{"$f":"IF(E9=\"RETENCION DEFINITIVA\",G22*1.12,IF(E9=\"TRIMESTRAL\",G22*1.12,IF(E9=\"PEQUEÑO CONTRIBUYENTE\",G22*1,IF(E9=\"RELACION DE DEPENDENCIA\",0,0))))","v":0}]
[null,null,"EXENCION IVA:",null,null,{"$f":"IF($E$9=\"RETENCION DEFINITIVA\",+$F$23-$F$23/1.12,IF($E$9=\"TRIMESTRAL\",+$F$23-$F$23/1.12,IF($E$9=\"PEQUEÑO CONTRIBUYENTE\",0,IF($E$9=\"RELACION DE DEPENDENCIA\",0,0))))","v":0}]
[null,null,"GASTO TOTAL PARA LA UNIDAD O PROYECTO:",null,null,{"$f":"+G22","v":0}]
[null,null,"RETENCION A CUENTA DEL SOLICITANTE:",null,null,{"$f":"IF($E$9=\"RETENCION DEFINITIVA\",(F23-F24)*0.05,IF($E$9=\"TRIMESTRAL\",0,IF($E$9=\"PEQUEÑO CONTRIBUYENTE\",0,IF($E$9=\"RELACION DE DEPENDENCIA\",0,0))))","v":0}]

{"sheet":"Sol cheque complemento","index":10,"n_rows":110,"n_cols":14,"rows_kept":110,"cut":false,"hidden":false,"merged":[[62,0,62,11],[58,0,58,10],[59,0,60,2],[59,3,60,5],[59,6,60,9],[59,10,59,11],[59,13,59,16],[60,10,60,11],[60,13,60,16],[55,0,55,10],[56,0,57,2],[56,3,57,5],[56,6,57,9],[56,10,56,11],[56,13,56,16],[57,10,57,11],[57,13,57,16],[52,0,52,10],[53,0,54,2],[53,3,54,5],[53,6,54,9],[53,10,53,11],[54,10,54,11],[49,0,49,10],[50,0,51,2],[50,3,51,5],[50,6,51,9],[50,10,50,11],[51,10,51,11],[46,0,46,11],[47,0,48,2],[47,3,48,5],[47,6,48,9],[47,10,47,11],[48,10,48,11],[42,0,42,2],[42,3,42,5],[42,6,42,8],[42,9,42,11],[44,0,44,2],[44,3,44,5],[44,6,44,8],[44,9,44,11],[38,0,38,2],[38,3,38,5],[38,6,38,8],[38,9,38,11],[40,0,40,2],[40,3,40,5],[40,6,40,8],[40,9,40,11],[34,0,34,2],[34,3,34,5],[34,6,34,8],[34,9,34,11],[36,0,36,2],[36,3,36,5],[36,6,36,8],[36,9,36,11],[28,0,28,2],[28,3,28,6],[28,8,28,9],[28,10,28,11],[32,0,32,2],[32,3,32,5],[32,6,32,8],[32,9,32,11],[23,3,23,11],[24,0,24,2],[24,3,24,11],[26,0,26,2],[26,3,26,6],[26,8,26,9],[26,10,26,11],[22,0,22,2],[22,6,22,7],[22,10,22,11],[6,3,6,4],[6,6,6,8],[6,9,6,11],[8,0,8,2],[8,3,8,11],[10,0,10,2],[10,3,10,4],[12,0,12,11],[18,0,18,2],[18,3,18,11],[20,0,20,2],[20,3,20,11],[0,1,0,11],[0,13,17,13],[1,1,1,11],[2,9,3,9],[2,10,3,11],[4,0,4,2],[4,3,4,4],[4,6,4,8],[4,9,4,11],[6,0,6,2]]}
[null,"UNIVERSIDAD DEL VALLE DE GUATEMALA",null,null,null,null,null,null,null,null,null,null,null,"SOLICITUD CHEQUE"]
[null,"Solicitud de Cheque o Efectivo"]
[]
[]
["Campus",null,null,{"$f":"IF('1. Autorización'!I6=0,\"\",'1. Autorización'!I6)","v":""},null,null,"No."]
[]
["Fecha",null,null,{"$f":"TODAY()","v":"2019-02-25"},null,null,"Teléfono/Extensión",null,null,{"$f":"CONCATENATE('1. Autorización'!C14,\"  /  \",'1. Autorización'!I14)","v":"  /   "}]
[]
["Beneficiario",null,null,{"$f":"IF('1. Autorización'!C8:C8=0,\"\",'1. Autorización'!C8:C8)","v":" "}]
[]
["Valor",null,null,{"$f":"MAX('3. Liquidación'!D49:F49)","v":0}]
[]
["Concepto del Gasto"]
[]
[]
[]
[]
[]
["Descripción del Gasto",null,null,{"$f":"CONCATENATE(\"Complemento a Favor Liquidación Ch. # \", '3. Liquidación'!C29,\".\")","v":"Complemento a Favor Liquidación Ch. # ."}]
[]
["Destino \n(Viajes)",null,null,{"$f":"IF('2. Solicitud Cheque'!D21=0,\"\",'2. Solicitud Cheque'!D21)","v":""}]
[]
["Fecha (Duración) días (Viajes)",null,null,{"$f":"+'2. Solicitud Cheque'!$D$23","v":""},null,"del",{"$f":"IF('2. Solicitud Cheque'!$G$23:$H$23=0,\"\",'2. Solicitud Cheque'!$G$23:$H$23)","v":""},null,null,"al",{"$f":"IF('2. Solicitud Cheque'!$K$23:$L$23=0,\"\",'2. Solicitud Cheque'!$K$23:$L$23)","v":""}]
[]
["Nombre Participantes (Viajes)",null,null,{"$f":"IF('2. Solicitud Cheque'!D25=0,\"\",'2. Solicitud Cheque'!D25)","v":""}]
[]
["Emitir cheque de \ncuenta bancaria #",null,null,{"$f":"+'2. Solicitud Cheque'!$D$27:$G$27","v":0},null,null,null,null,"Tipo de Fondo",null,{"$f":"+'2. Solicitud Cheque'!K27:L27","v":0}]
[]
["Depositar en \ncuenta bancaria # (Si Aplica)",null,null,"",null,null,null,null,"Tipo de Fondo",null,""]
[]
[]
[]
["Tipo de Presupuesto ",null,null,{"$f":"IF('2. Solicitud Cheque'!D33=0,\"\",'2. Solicitud Cheque'!D33)","v":" "},null,null,"Centro",null,null,{"$f":"IF('2. Solicitud Cheque'!J33=0,\"\",'2. Solicitud Cheque'!J33)","v":""}]
[]
["Partida Presupuestaria No. ",null,null,{"$f":"IF('2. Solicitud Cheque'!D35=0,\"\",'2. Solicitud Cheque'!D35)","v":""},null,null,"Proyecto (Incluir Código)",null,null,{"$f":"IF('2. Solicitud Cheque'!J35=0,\"\",'2. Solicitud Cheque'!J35)","v":""}]
[]
["Nombre Partida Presupuestaria",null,null,{"$f":"IF('2. Solicitud Cheque'!D37=0,\"\",'2. Solicitud Cheque'!D37)","v":""},null,null,"Subproyecto",null,null,{"$f":"IF('2. Solicitud Cheque'!J37=0,\"\",'2. Solicitud Cheque'!J37)","v":""}]
[]
["Cuenta Contable No.",null,null,{"$f":"IF('2. Solicitud Cheque'!D39=0,\"\",'2. Solicitud Cheque'!D39)","v":""},null,null,"Subproyecto II",null,null,{"$f":"IF('2. Solicitud Cheque'!J39=0,\"\",'2. Solicitud Cheque'!J39)","v":""}]
[]
["Nombre de la Cuenta Contable",null,null,{"$f":"IF('2. Solicitud Cheque'!D41=0,\"\",'2. Solicitud Cheque'!D41)","v":""},null,null,"Rubro",null,null,{"$f":"IF('2. Solicitud Cheque'!J41=0,\"\",'2. Solicitud Cheque'!J41)","v":""}]
[]
["Código del Fondo",null,null,{"$f":"IF('2. Solicitud Cheque'!D43=0,\"\",'2. Solicitud Cheque'!D43)","v":""},null,null,"Subrubro",null,null,{"$f":"IF('2. Solicitud Cheque'!J43=0,\"\",'2. Solicitud Cheque'!J43)","v":""}]
[]
["Nombre del Fondo",null,null,{"$f":"IF('2. Solicitud Cheque'!D45=0,\"\",'2. Solicitud Cheque'!D45)","v":""},null,null,"Subrubro II",null,null,{"$f":"IF('2. Solicitud Cheque'!J45=0,\"\",'2. Solicitud Cheque'!J45)","v":""}]
[]
["AUTORIZACIONES "]
["Nombre completo del Solicitante",null,null,{"$f":"IF(D9=0,\"\",D9)","v":" "},null,null,"Firma:",null,null,null,"Fecha:  (DIA/MES/AÑO)  "]
[]
[]
["Jefe Inmediato",null,null,{"$f":"IF('1. Autorización'!D60:D60=0,\"\",'1. Autorización'!D60:D60)","v":""},null,null,"Firma:",null,null,null,"Fecha:  (DIA/MES/AÑO)  "]
[]
[]
["Autoridad Superior \n(Unidad ó  Proyecto) Si Aplica",null,null,{"$f":"IF(SUM('3. Liquidación'!D44:F44)>0,IF('1. Autorización'!D63:D63=0,\"\",'1. Autorización'!D63:D63),\"\")","v":""},null,null,"Firma:",null,null,"Fecha:  (DIA/MES/AÑO)  ","Fecha:  (DIA/MES/AÑO)  "]
[]
[]
["Dirección Administrativa de Proyectos Sólo para Proyectos ",null,null,{"$f":"IF('2. Solicitud Cheque'!D57=0,\"\",'2. Solicitud Cheque'!D57)","v":""},null,null,"Firma:",null,null,"Fecha:  (DIA/MES/AÑO)  ","Fecha:  (DIA/MES/AÑO)  "]
[]
[]
["Vicerrectoría Academica ó\nAdministrativa Si Aplica",null,null,{"$f":"IF('1. Autorización'!D66=0,\"\",'1. Autorización'!D66)","v":""},null,null,"Firma:",null,null,"Fecha:  (DIA/MES/AÑO)  ","Fecha:  (DIA/MES/AÑO)  "]
[]
[]
["Revisar antes de entregar a Cuentas por Pagar que esta solicitud cuente con partida Presupuestaria. \nEnviar para su trámite ocho (8) días calendario antes de la comisión de trabajo. \nLiquidar dentro de los cinco (5) días siguientes a la finalización de la comisión de trabajo. \nSi el monto requerido es menor a Q. 500.00 la solicitud se manejará con fondos de caja general (Siempre que no sea anticipo) y si es mayor se tramitará cheque. \nPresentar solicitud (original y copia) a Cuentas por Pagar quien sellará de recibido y colocará el No. Correlativo.\n*** PARA EL CASO DE ANTICIPOS, SE RECUERDA AL BENEFICIARIO QUE DEBE SACAR COPIA AL CHEQUE INMEDIATAMENTE DESPUÉS DE HABERLO RECIBIDO."]
[]
[]
[]
[]
[]
[]
[]
[]
[]
[]
[]
[]
[]
[]
[]
[]
[]
[]
[]
[]
[]
[]
[]
[]
[]
[]
[]
[]
[]
[]
[]
[]
[]
[]
[]
[]
[]
[]
[]
[null,null,"Sedes:",null,null,null,"Tipos de Presupuesto:",null,null,null,"Tipos de Fondo:"]
[null,null,"Campus Central",null,null,null,"50 AÑOS UVG",null,null,null,"FNR"]
[null,null,"Campus Sur",null,null,null,"ASHA 12-00006",null,null,null,"FTR"]
[null,null,"Altiplano",null,null,null,"ASHA 12-00004",null,null,null,"FPR"]
[null,null,"Colegio Americano de Guatemala",null,null,null,"EDUCON"]
[null,null,"Colegio Americano del Sur",null,null,null,"ESTRATÉGICO"]
[null,null,"Fundación de la UVG",null,null,null,"IPF"]
[null,null,"4 Grados Norte",null,null,null,"OPERACIONAL"]

{"sheet":"Password","index":11,"n_rows":3,"n_cols":1,"rows_kept":3,"cut":false,"hidden":false,"merged":[]}
[]
["Password:"]
["Temporal"]